##TITLE= TK 1; Methyl 1-Propargyl-5-indolecarboxylate  / CDCl3
##JCAMP-DX= 4.24
##DATA TYPE= NMR SPECTRUM
##ORIGIN=      varian
##OWNER=       haider
##DATE= 
##TIME= 
##SPECTROMETER/DATA SYSTEM= 
##.OBSERVE FREQUENCY= 299.9488
##.OBSERVE NUCLEUS= ^1H
##.AVERAGES= 16
##DATA PROCESSING= 
##XUNITS= PPM
##YUNITS= ARBITRARY UNITS
##XFACTOR= 1.00000000
##YFACTOR= 0.00437846
##FIRSTX= 14.900473
##LASTX= -1.768528
##NPOINTS= 32768
##FIRSTY= 0.070055
##MAXY= 143.469025
##MINY= -0.332763
##XYDATA= (X++(Y..Y))
$$ [...]
14.57032B0j4Oj6K1Jj5j4J0k5L7nj9J7L%K3j6Nj4J3j2Ok4K2j3kJ3%TRoKnj2lPLJ2kr
14.54997DpJ2mj5M1l8L5j2j6J4%rRnk2L7j5jlmJ8k1QpJ1JMmj4J3%J3Jljj5j2M3l1Oq
14.52911CK3qLomJ1lkpRklJ4k1PJ5l5K3rJ2k1K4l5J5pkK4%jlj2L5j2k5K0k1jJ8j6qJ8
14.50826A0K1rm2M5k9K0k0J0J2J8k6J1npTJ6j3J3j5J6k4L1lk3J0qj3K4Qk9K6nNj9L8
14.49045C7k0kTK0l8J5K2k0j6KJ3j1K7j7J8pj1Npk0J1K2j8kPJ3Nj8LJj0J3Jj7J9Kk0
14.47163@J3k6M9j8JKQmPl3J5LRm1L3j3L3l6j7J2OlmK6j2rJ4j3K2j5JNmoJ5k0J1k5J8
14.45179DjOj0J5mlTJ3j0nJKK3j8OMj5rK3k2J6p%Oj6%J1K1j3j4jnTM0j8kj0OLJ4Ol0
14.43042aj3K9Oj6KL3k3j9J6mJ5k6J9j4Lj0J5jPk1K4l6L9nMk0ORj2J4lpjJ2rOqjLj4
$$ y = [20, 6, 12, -4, 17, 18, 3, -11, -1, -26, 11, 6, -13, 4, 7, 7, 30, 14, 19, 5, 18, 6, 12, -12, 10, -3, -5, 8, 8, 8, 17, 11, 13, 8, -4, -7, 0, 3, 15, 13, 4, -3, 9, 5, -10, 31, -7, 28, 16, 0, 14, 14, 5, 14, 9, -13, 24, 9, 8, 5, 1, 19, -2, 6, -1, 10, 11, 15, 11, -3, 10, 10, 23, 24, 21, 20, 5, -7, 36, 5, 11, 3, 26, 18, 21, 15, 11, 22, 19, 17, 10, 19, 17, 14, 28, 7, 14, 29, -6, 17, 8, 20, -1, 23, -12, 3, -4, -6, 18, 18, 17, 14, 2, 37, 25, 0, 20, -1, -2, 16, 0, -8, 10, 31, 22, -20, 25, -4, 16, -4, 6, 18, 36, 10, 21, 16, 9, 2, 18, 5, 18, 3, 19, -5, 26, 23, 0, 10, 2, -11, 13, 21, -8, 18, 13, 18, -1, 37, 17, 15, 13, 33, -5, 10, 32, 12, -4, -2, 11, 0, 27, 10, 28, 21, 10, 15, 8, -12, -1, 21, 3, 1, 8, 21, 26, 8, 11, 12, 2, 15, 16, -1, 18, 20, 0, 13, -13, 36, 18, 19, 21, 29, 25, 32, -1, 14, 17, 26, -15, 18, 5, 38, 2, -15, -3, 3, 0, -4, 22, 10, 1, 15, 2, 24, 9, 10, 15, 11, 5, 20, 0, 11, -14, 4, 3, 9, -1, 14, 10, 7, 4, 17, 7, 2, 3, 5, 28, 10, 16, 20, 5, -4, 19, -3, 13, 6, 6, 12, -4, -4, 7, 28, 15, 1, 0, -5, -10, 30, 12, 10, 0, 6, 9, 23, 29, -1, -14, 15, 21, 5, 7, 40, 17, -2, 14, 10, 25, -1, 18, 4, 7, -3, 12, 11, 18, -3, 21, -15, 24, 19, 23, 3, 9, 18, 6, 20, 17, 10, 9, 21, 12, 18, 10, 9, 12, -2]
14.41007bK4j7J1onTM4m4J6k8KJ2k%pJ9mRl4L2jJj1J1J2Nl2Kj0M2m0K5j8J9k0K3oO%
14.39023B3k1K5k0qJ6j0kTJ3qK2j3J5k1nQrPkK0m0L9k7J4k4J3Qj1J0J3k9K2lk6L5k2
14.37192@J3j4RJ0J2j5j0K1l1L8k0J3oj8mJ9J0j7K0k5J9Jj5pK4k4pK1rjqJpK3k0J8j8
14.35310dnj2K7oQPl0M2k9K6k4K2k0K1j4lTJ1j0K2l4RJ0Oj8J5j2JK0mTJpJ9j8pK3k2
14.33377DJ1kJ5k2J6k5L8k0MnNj9J6kk5K0OPk2K0j8Lj4J1NJ1%j6Oj0PLJ4qNj6J4nkj6
14.31342fJ3j6K6k6J3kJJ4rMPoj4K2Pk4J2K9m2J6l7K4k1J3K7m5N6k4NLk2RqJ7lKj0J1
14.29409A6J3j1%j3J0Nk0J9Jj4rLPpNRJ4qK5l6OUl3LL4m2L9l9K5l6M3NPm2K8j1JJ7j0
14.27374A6pJ0Oj0j7J4k0K4mj0KTkmRJ5rj0Nj4J9j8lJ9nRj9RnJ2olMRrJ1j0J0k5L0j1
$$ y = [-2, 22, 5, 16, 10, 5, 0, 44, 0, 16, -12, -10, 2, 0, 0, -7, 12, 8, 17, -17, 15, 14, 15, 4, 15, 27, 32, 0, 2, -8, 34, -6, 19, 1, 20, 0, 23, 17, 23, 23, 2, 27, 7, -1, 15, 5, 3, 1, 14, 6, 28, 15, 30, 9, 4, 12, 3, 10, 8, 28, -12, 27, 0, 14, -10, 3, 11, 0, 10, 23, -6, 16, 13, -13, 22, 0, 13, -1, 8, 18, 30, 15, 5, 26, -5, 33, 13, 26, 20, 2, -2, 17, 27, 10, 30, 5, 24, 25, 10, 3, 27, 3, -4, 17, 8, 7, -1, 0, -7, 16, -4, 14, -4, -9, -21, 6, 0, 8, 15, -15, 27, -2, 24, 0, 22, 2, 23, 9, 6, 3, 14, 4, 26, -8, 1, 11, 17, -1, 14, 2, 3, 23, 19, 15, 16, 9, 28, 10, 3, 26, 4, 15, 13, 28, 6, 22, -3, 35, 15, 19, 14, 19, 0, 16, 14, -11, 9, 15, 22, 0, 20, 2, 5, -9, 2, 7, 18, 18, 2, 8, -2, 5, 8, 22, 14, 19, 3, 17, 12, 10, -6, 7, -9, 17, -9, 4, 2, 3, 17, 8, 12, 19, 13, -1, 21, 28, 4, 16, 45, 3, 19, -18, 6, -15, -2, 25, -20, 36, 12, 17, 20, -2, 7, -1, 16, 13, 15, 5, 16, 29, 18, 18, 5, 15, 20, 0, 19, 20, 6, -3, 0, 7, 0, 5, 14, 28, 20, 45, 9, 15, 21, 27, -6, -3, 31, -11, 28, -11, 14, -22, 21, 26, 33, -9, 19, 8, 9, 26, 16, 9, 19, 25, 15, -2, 12, -8, 16, 12, 2, 4, 6, 4, 0, 9, 24, 15, 5, 10, -4, 15, -3, -6, 13, 8, 17, -2, 7, 2, 14, 8, 5, 9, 18, 9, 20, 10, 20, -5, 25, 14]
14.25288A4J1l0L7k7jj1K7Kk5QJ0J8nk3J7qmj5L1j1KJ3qk5J5j0KK0mk0PnpnjK9j1J0
14.23355A7rK6k5jk1J6OoL1l4J1Tj2J5l4M2l3L6m1L4k0J1j5QK8n0MOJ8j3j1K0J2Nj9
14.21574A3J7m2J7k4L3Jjmj4K7pNj3J0j5PoJ3j0KUnj2MNK4j2j1%J2QqPpk6K2pRJ0jk4
14.19438AJ8PpmqK1k8J0J2rpPTpj1jQlKj0L5j6K2m5J9K2k7j0QJ7k1J9rMjj2kJ0J3j8
14.17403FK7k4j0J1j7M7m9K2k3J9kJ2k2J9k1J4l1L0mJ0j2PK8m1J1Lj5RPj2J3Mjj4J0
14.15623A1oRj3K0p%kJ0jk9L0j7J8j4k6K4qK4k9J8j4K9j6J8l2K7k8K4k0J5k6L9k3K9
14.13893C4k6J8%m3L7orj9K2j5L9l0LJ0k4J6Kj4K4j0%l5N8qk0j4L5qj5K0rJ2Kj1rqJ6
14.12011A5qMJ0q%j3%j4K9j8K1l0J5LJ1J4j6mj8L1nj1LJOnoJ1pJk8K6n%K1k0mJ8j8K1
$$ y = [14, 25, -5, 32, 5, 4, -7, 20, 22, -3, 5, 15, 33, 28, 5, 22, 14, 10, -5, 26, 15, 17, 30, 22, -3, 12, 2, 4, 24, 20, 0, 7, 2, -5, -10, -11, 18, 7, 17, 8, 34, 9, 8, -13, 3, 9, 3, 34, 0, 11, 22, 10, 25, -9, 33, 0, 36, -5, 29, 9, 20, 5, 13, 41, -9, -5, 1, 19, 6, -5, 15, 27, 32, 13, 30, -12, 5, -19, 14, 15, 14, 10, -4, 23, 16, 21, 8, 18, 3, 10, 4, 17, 7, 9, 11, 13, 8, -4, 0, 5, 29, 17, 6, 6, 18, 26, 18, 25, 18, -8, 14, 7, 16, 26, 25, 1, 19, 26, 19, 15, 7, 28, 0, 10, 22, 13, 6, 13, 20, 13, 2, 1, 9, 6, 8, -2, 33, 17, 39, -6, 13, 35, 8, -2, 6, 23, 2, 21, 12, 16, 15, 3, 1, 11, 24, 6, 33, 9, -1, 10, -7, 40, -9, 13, -10, 9, 7, 19, -3, 16, -5, 9, -22, 8, 4, 14, 2, 9, 37, -4, 7, 10, -5, 4, 11, -1, 12, 16, 15, 1, 11, 5, 14, 1, 21, 14, 14, 12, 22, 21, -8, 22, 5, 23, 9, -17, 7, -1, 23, -6, 12, -2, 27, 11, 29, -3, 24, -4, 20, 0, 15, -11, 28, 5, 34, 8, 26, 26, -17, 20, 14, 5, -14, 8, -7, 32, 2, 5, 15, -9, 7, 9, -5, 19, 9, 9, -26, 32, 24, 4, -10, 25, 17, 2, 22, 13, 25, 27, 16, 7, -1, 15, 7, 11, 21, 13, 13, 0, 0, -14, 15, -3, 18, -12, 3, 6, 17, 31, 15, 11, -7, 24, 19, 8, 11, 12, 18, 13, 7, 18, 11, 12, -16, 10, 5, 5, 26, 6, 2, 20, 2, 23]
14.09976B3rj3Pj4K4pPmpoNJ8k0J1l2J3ML2l6L3k3J4j6J6j0Omlj6K2nJ1rJ2k3K4Kj2
14.08043A5%nK2m4L0k8J0TK3k7RJLj9nL5l1JJ7j3mK1k5J1Rk3M5l9J0JNpKj4Qk4L6m6
14.06110c0N2k2Pp%L1j4J9k5J1%j8L2l1PlJ6j6QJ0k0MnJ9j2njkj2K3J4k6K8k0k3J5K
14.04227FNj1L3l2Rj1J7j1oK3qj4J8j0J1qnK2jk5J2KOl1L3m3K2k3L0NPk1J5j2J0orP
14.02294FNJ1j3%Qj7J9J5rk5lLlJ6J0k3MTk3J8jMK2k2K1rj3J1Nj1K1l1J3j1PrJ9j0Tj
14.00259bJ2%RQk4QlJ1NqpJOk3J1rK2Lj9LPmoJ8j0j3J8l8M2Qj4TJ2J3Jj3JqJ7j0kNk2
13.98072hK8jk2M1k9J8l3QNJ0k4K6l5ONK9pj9K7kj4j%j7K1%K2l1J0j6J6nqJ4j4J7j5
13.96190BK6k5Mj2MJ2J0j4Rnj%lk%MK1j1%j5L0m5J1J0pJ0oJj1J9nkk3J9NJ2l4K3j8L0
$$ y = [23, 14, 1, 8, -6, 18, 11, 18, 14, 7, 1, 6, 24, 4, 15, -17, -4, 0, 32, -4, 29, 6, 20, 4, 20, 10, 16, 12, 9, -7, 15, 10, 21, 12, 24, 1, 25, 27, 15, 15, 10, 32, -12, 18, -10, 0, 10, 33, 6, 15, 16, 19, 0, -5, 30, -1, 0, 17, 4, 0, 21, -4, 7, 16, -7, 38, -1, 9, 10, 15, 8, 10, -4, 4, -20, 16, -30, 22, 0, 7, 0, 0, 31, 17, 36, 11, 22, 22, 4, 36, 5, 12, 9, 25, 9, 17, 27, 7, 11, 6, 25, 13, 8, 7, 5, -7, 16, 30, 4, 32, 12, -11, 4, 6, 11, 0, 33, 1, 10, -1, 16, 5, -1, 22, 14, 0, 18, 8, 19, 11, 6, 28, 27, 2, 14, 16, 22, -9, 24, -19, 3, -20, 10, 15, 22, 1, 16, 4, 14, 8, -1, 6, 11, 22, 9, 9, 17, 0, 19, 34, 25, 0, -3, 0, -3, 13, 23, 0, 4, 8, -15, 3, 2, 6, 28, 6, 27, 18, 5, 16, 21, 10, 31, 0, 13, 2, 9, 0, 19, 9, -1, -2, 10, 10, 19, 27, 3, 11, 8, 19, 24, 16, 9, 10, 16, -7, 4, -5, 17, 20, 1, 4, 11, 7, 1, 19, 9, -4, 14, -24, 18, 26, 12, -2, 10, 23, 24, 11, 12, 4, 21, 11, 9, 14, -8, 20, 19, -3, 38, 9, 27, -6, 2, 7, 17, -7, 19, -16, -10, -5, 24, 17, -2, 25, 23, 9, 8, 8, -9, 12, 12, 34, 3, 13, -3, 13, 8, 0, 14, 0, 17, 2, 28, 3, 7, -5, -1, 11, 21, 7, 16, 11, 10, 10, 7, 5, 5, 9, 30, 19, 19, 4, 34, -11, 0, 10, 3, 13, 7, 8, -3, 16, 11, 9, -14, 5, 10, 22, -12, 11, -7, 23]
13.94155B3Kk5K4j3J0j8J7j4J0Tk9J8KrJ4k5RJ2j4OJk2K3k8M4m1J9MrL0l6J1Mk0OJ6
13.92323A2j2jlKRTk4J1PRk3K3k0J7prj0RJ6mqj1K7l0M1k1PMok8J0J7LlJoQJ0JkqrJ3
13.90136B1j1j0j2J4LJ9Kk1kK4k0nRkOj2J8j4J4Jj2pNorJ9K0l7QOK4k9L2k7K7k1oK9
13.88203C8o7L2kJ8k9J1J4koj5K0LJ0j8j9J7lJ4j7Rk7L8m1M8k6OJpJK1j7NK2j7Mk6L1
13.86321B4l0J3j3K1J1k7L0j6Pj6K5l6LTJ8j8J2Oj7PTrJLjK2Kk4qJ8j5K2k3JnRJ6Nn
13.84337B3l4M1l4jKK0rNrLj6M0l1J6olj1PJ2nj3K4j3J8nk3JJ8J2k1Ol8O2l2K1l1J5
13.82454A1j1J9Ql0J9k0J7pjJ9k1j3J0LKRj6J7K9n5J4ONj3J4j5NK8l0Pk2jK5KRlj5j
13.80521DOJ0j0j8J7J8j8J9l0lnK1mjJ3j5LnJ1Prj8J6J5j2k3mRK4k8QqPJ0Ok2L1k3K4
$$ y = [23, 25, 0, 24, 11, 21, 3, 20, 6, 16, 26, -3, 15, 17, 8, 22, -3, 6, 18, 4, 10, 11, -11, 12, -16, 28, -13, 6, 10, 1, 31, -5, 6, 10, -10, -4, 12, 0, -1, -4, -2, 7, 16, -8, 3, 10, 19, -4, 19, -1, 16, 9, 0, -10, -1, 15, 11, 3, -8, 19, -11, 30, 9, 16, 20, 14, -14, -4, 13, 16, 13, 14, 8, 16, 26, 27, 25, 17, 8, 21, 10, 0, -12, 2, 5, 24, 26, 5, 3, 27, 7, 2, 11, 9, 15, 3, 21, 7, 21, 22, 10, 3, 8, 2, -7, 12, 32, -5, 3, 9, 33, 4, 36, 9, 36, 15, 9, 38, -29, 3, 1, 19, -10, 1, 15, 13, 7, -8, 12, 15, 25, 7, -12, 5, 2, 16, -1, 8, -19, 19, -22, 26, 0, 6, 7, 0, 1, 22, 5, 10, 32, 15, 19, -7, 24, -6, 7, -6, 15, 26, -1, 29, 13, 20, 4, 29, -7, -4, -1, 17, -1, 11, 17, 0, 7, 14, 5, 6, 9, 8, 30, 32, 8, 0, 18, 3, 25, 2, 3, -2, 7, 23, 28, 23, -11, 30, -4, -5, -3, 17, 8, 13, 4, 7, -9, 31, 0, 16, 10, 7, -4, 3, 15, 10, -3, 21, 8, 26, 21, -2, -1, 17, 29, 8, 14, -24, 38, 6, 27, -4, 11, 0, 19, 27, -3, 16, -4, 13, 6, 5, 24, 3, -10, 0, 3, 5, 14, -2, 15, 44, -11, 3, 9, 14, 1, 15, 0, 5, 33, 3, 10, -12, -13, 12, 14, 23, 20, 5, 4, 10, 20, 10, -8, 9, 27, 9, 28, -2, -5, -10, 11, 7, 6, 19, 4, 7, 2, 13, 20, 11, -7, 9, 24, 12, -11, -15, -6, 18, -10, -2, -10, -3, 7, 13, -9, 22, -1, 23]
13.78537B3j1nJ8Lj3k5J2J7lQOql8J6j2KK7j5J0j7LKJ1j1OJ3j5%J5r%pj6J2K3j9qJ1
13.76604Fj1J9j0J2j1K1j0j6J4k1L1k2KLj1KJ4nqJ3J0k3J2K4j8%k1K6j9J1j3J1j2J3
13.74875A3nkoRoJ3nrpJ2k0K0pLnJ0QJk5J4plmJ3J4m5M1J6k1Kj3oK0Nj7J8k8M0k1J7
13.72840B7k5K1k2JoJ0j1J5j3K0j7K4j2jolQpJ3j0oQJ5j5pj5J4JJ2mRk9J7NK4l5MoJ3
13.70856A1J1k6J3LJ8l4kJ2oQMmJ8rj2lj9L9njj4oRMj7J0LK4k5rK7qJ1l3MJ4Nj1LM%
13.68770A1%kKJj1K4k4NrK8Jj4%j3J2Rk5mJ9kJ2k9J9k4J7kjJ6j7J9k6L7j9Mj7LK9k3
13.66837FroN4l3n%K4k8jnJMqK1mj5J1OJ0%k%l6K9lQk5JM1l6J4j8J8l1K4J0Qk3K4j1
13.64802A5k6J6pKJ2k2M3m3K2j4K5j4pK2k4L9l1MJ2l0K6rqOK2j5Nj4J7j0Kk3jJ7kpJ7
$$ y = [23, 12, 7, 25, 28, 15, -10, 2, 19, 16, 24, 30, 22, -16, 0, -12, -10, 17, 2, 12, -5, -2, 0, 11, 0, 6, 19, 4, 4, 19, 10, 10, 3, -13, -1, 22, 3, -5, 6, -5, 14, 4, 16, 5, 26, 16, 0, 14, -7, 24, 2, 4, 7, -4, -2, 12, 7, -1, 12, 22, -1, 11, 35, 17, 17, -4, 22, 3, 14, 1, 12, 0, 13, 8, 6, 0, 9, 3, 16, 11, 2, -5, 7, -13, 7, 0, 3, -2, 8, 16, 17, -8, 6, -1, -4, -8, 5, 19, -26, 15, 31, 10, 12, -1, -7, 13, 18, 1, 19, -9, 31, 10, 27, 2, 23, 1, 2, -4, 6, -5, 10, -3, 17, 0, 24, 12, 11, 5, 2, 10, 3, 16, 6, 0, 8, 23, 8, 1, -14, 0, 1, 13, 9, 18, -11, 6, 11, 35, 0, 4, -2, 11, 22, -4, 9, 12, 30, -4, -6, 6, 0, 8, 12, 8, 26, 17, 5, 2, -17, 22, 17, 16, 2, -4, 5, 9, -8, 2, 5, 29, 4, -5, 22, 14, 25, -8, -4, 10, 15, 4, 7, 11, 11, 11, 9, 11, 12, 1, 25, 1, 6, -3, 25, 26, 12, 12, -1, 11, 20, -5, -9, 10, 8, 20, -9, 10, -14, 3, 1, 0, 16, -1, 18, -8, 29, 10, 14, -3, 0, 29, 6, -3, -9, 45, 12, 7, 7, 31, 3, 2, -3, -2, 2, -6, 15, 11, -4, 7, 13, 23, 23, 21, 21, -15, 14, 11, 19, -6, -5, 36, 0, 14, -4, 14, -17, 7, 17, 25, 2, 26, 15, -11, 5, -2, 0, 12, -10, 33, -10, 12, -2, 23, 9, 2, 24, 0, 39, 8, 12, 24, -6, 20, 11, 3, 9, 31, 16, 21, 7, 24, 14, 16, -7, -8, 9, 7, 0, 17]
13.62920A7k5J0lJJ5kJ6k3kJ0rNj0j1K3jj1%J2Tj5KPj1oJ3j6J6J7j9kRK%l3J1jJ9Lj6
13.60885DJ0j0J0J4l7K0Nj6TL6j8J0jrkmL6m5K1ONj0lTK6Kj9Lk0PkJj4L3pJ4j6J2k8
13.58901eJ8OLjj3j8QMKj4J4mJ4OpQk0LJ3j0J6%Kk6Ok0J9j1J9OJ2l8J1rK6kNk5K4j5
13.56866G%pPj5K0j9J1pQK5k2J7k2K6k9KOqJ3jJ6m5M3J6m2%oJ3k4K2LJ1l0J3J4j4jr
13.54933hL2k2KJTlJ4j4pK4l1L2l5L7j2Rlj9J2POj9J1j5ML2k8qK0j2M%kLnJ9k6mJ4k
13.52898IQlJ4rj1TJ5nOoJJ6k5qJ0Pj2J4NlLK0m1M1k8Rj5K7l1L4l1K0mj0lJ0Ml8M9k8
13.50863@Oj4L2k2LK1j7Mj1kK4m3M4k9J5Rj4j7L2j5J3k4K0j0J6k5J2pQj4M3l8J2j7k
13.49083gJ1j3NTJ6k0J9j6J8j8L0l5J9pj0j3M7k0J4%lj9J7kj5mPj6J1JJ1j7J7rnQj7
$$ y = [17, -8, 2, -1, 0, 15, 13, 29, 6, 4, 14, 5, 10, 0, -11, 12, 11, 0, 0, 12, 24, 9, 11, 18, 7, 1, 14, -2, 14, 31, 12, 10, 19, 21, 21, -12, -1, -2, 17, 20, 4, 14, 4, 14, 28, -9, 11, 16, 0, -16, 20, 2, 12, 11, 2, 0, -4, 32, -13, 8, 14, 19, 9, 6, 3, 29, 31, 12, 15, -5, 2, 0, 1, -13, 20, 13, 27, 11, 23, -5, 13, 19, 22, 21, 8, -10, -2, 2, 4, -10, 4, 0, 14, 20, 13, 21, 1, 4, 17, 7, 23, 23, 25, -1, 5, -15, 4, -7, 12, 18, 30, -8, 3, -6, 20, 18, 23, -2, 22, 7, 7, 0, 7, -8, 12, -7, 4, -3, 5, 30, 8, 25, 3, 29, 0, 2, 8, 0, 13, 12, 28, -17, 26, 42, 0, 0, -6, 7, -17, 5, 8, 19, -11, 2, 16, 2, 1, -8, 24, 2, 4, 5, 6, 3, 17, 3, -4, 20, -11, 21, -14, 23, 11, 20, 17, -2, 10, 17, 23, 4, 15, 0, 4, 36, 8, 0, 20, 8, 12, 12, 10, 13, 8, 27, 1, -3, 11, 9, 17, 14, 28, 19, 8, -3, 12, 7, 13, 7, 8, 24, -1, -9, 1, 8, -4, 10, 15, 12, 15, 35, -6, 35, 7, 16, 1, 28, -3, 31, 0, 20, 16, 6, 3, 13, 17, -21, 28, 0, 6, -8, 24, 2, 5, 26, 9, 13, 2, 0, 24, -19, 25, -4, 11, 20, 6, -11, 21, 6, 19, -5, 15, 5, 21, -4, 8, 1, 9, -5, 38, 0, 12, -5, -7, 4, -9, -4, 1, 17, -3, 16, 0, 18, 0, 30, -5, 14, 7, -3, -16, 31, 11, 25, 25, 22, 3, 20, 18, 3, -1, 6, -10, 1, 2, 13, -4, 13, 4, -1, 7, -10]
13.47201a0J1j4K2Kk3QNL6k4mR%k0PmJ1oJ7j4J5k2J6LoJk1j3L4l3K4pKqQqPmJ9nMj5
13.45115@J2m%K2k5%mJ3%j6J1nK0Qk1k0K3j2oRLJ6l2LK2k3K7j3jrL0k8NOpPj6K3j6%
13.43080BNn%K1l0RK8j8PlPl2J4KJ7nk%lJ5pqk8K9j6J2j5rK5qKJ0j1j0J8opK3j7LkJ0
13.40944A7mJ3Nk7jJ7lj1KjJ7mj5J6k1K0k2QLj1J1nlkNPj4K0ok1J8RK1j2pk6kK0KLM
13.38858B0j3mJ4nmnMNjj8K5j2j9K9Pl1J2qK0j0kJ3j2mJ9k7K6j9J0kqJ8k4J8j9K0Kl4
13.36925a9L1k6J7J5jrJ2j2lTJ2J8o3O8l9K9m3K5kRl5L4j2K2l6L1nl1L1j3J9j0j8Po
13.35144fQlmN%jj1J4j5OJ9Mlj3K2%pjj0lJ5j3OK2k6Nj4kTL5k7MJ0j7J8k4J4K3m4K5
13.33109Ij4L6l6J9j5K1k3QRj5J1kJoJ4j7OMTmJ2j8mJ3pLQj4J3j8L8m8K2j3L0k3PMk
$$ y = [-10, 1, -13, 9, 11, -12, -4, 1, 37, 13, 9, 18, 18, -2, 5, 1, 12, 6, 23, 9, 24, 2, 18, 21, 15, 16, -5, -18, 16, -17, 7, 0, 2, -6, 2, -6, 1, -3, 16, 11, 15, 0, 12, 8, 8, 30, 5, 5, 1, 14, 14, -2, 9, 4, 24, 32, 11, -9, 14, 2, -4, 5, 8, 24, -8, -5, 17, -6, 21, 8, 7, -2, 28, 0, 5, 11, 4, 11, -5, 18, 2, 2, 7, 2, 2, 23, -7, 2, 30, 12, 19, 16, 23, -9, 5, 7, 24, 19, 17, 17, 14, 29, 22, 14, -14, 15, -1, 11, -4, -13, 12, 4, 6, 16, 5, -5, 13, 7, 0, 23, 6, 9, 7, 17, 13, 26, 31, 4, 3, 20, 17, 6, 8, 7, 24, 20, 5, 21, 0, 20, -2, 6, 9, -2, 9, 4, 1, -1, 4, 11, -3, 17, 11, -10, 8, 17, 38, 26, 19, -7, -9, 11, 13, 16, 20, 7, 3, 17, 12, 8, 3, 7, 12, 11, -7, 18, 6, -13, 16, 23, -8, 4, -4, 16, 6, 4, 17, 5, 1, 20, -7, 19, 0, 10, 8, 0, 18, -6, 12, -7, 13, 15, -19, 12, -14, 3, 18, 17, 8, 20, 8, 5, 2, 14, 32, -31, 37, -2, 27, -16, 9, 7, 16, -19, 15, 3, 25, -11, 20, 15, -16, 15, 2, 21, 11, -7, 0, -6, 2, -1, -5, 0, 0, -1, -12, 2, -13, -7, 12, 16, 13, 0, 22, 22, 15, 14, 4, 1, 16, 3, 9, 31, 5, 10, -4, -6, -8, 27, 0, 4, 14, -3, 15, -9, 5, 28, -16, 9, -5, 31, -5, 14, -1, 20, -3, 5, 14, -1, 10, 8, 9, 3, 17, 0, 6, 10, 14, 10, 22, 4, 0, 13, 6, 9, 17, 3, 16, -2, 36, -12, 10, -3, 27, 4, 11, 15, 13]
13.31125A3l0LJ4L2k7LJoj%k2L7j5mNKk1J7jRLj4L1l8RJ0lJ1oqK0j8rRJ0J1j2oPmj2
13.29040@J6j7K5k7J6j7MkQJTRj1jRj2Ojj0Nmj0K%K3prK1k0K2kjmJ8n8L1j3K3j2LjJ8
13.26903B2j8J5Jj5jq%J6k6K9j4K6qJ5k6j7J8nPjnKK6k6Ol6N4l1L2m1K7j0Kj2J6jkK
13.24970A3rnJ8k6MJ0Rj5J1j7PMj1Pj8J6oJ8rPj4L6k9J5k4J1LlL3m2J0k7M1j3nqJ3K
13.23037GK3k2J0j7J7kjk1OjJ5j0pJ2jJMnpJJ4jKj9L2k7KmKmJ0J6nl0J5Mo%N%j9L7q
13.20849A8j2pK8l3J0kk4L0jNj2QMoTL0j5npQk2K0LJqTJ1J0Jk2L4Jk5KJ5pj9NJ7lj0
13.18764G%j0L6k3Kj2J6j7J0%lJ2k0J7j3K8k4L1l4K1j2j6K6l3J6K3k2Jj7Qm%J6j5oK5
13.16932A4jJ3j7KPj6OoK2j5Qj9KJ5J1k9oL0k9K4pQqTK6l6PJ4j4J2J0J2m0LJ5Jj0K5
$$ y = [13, -17, -14, 0, 32, 5, 8, 9, 3, 2, 2, -20, 17, 2, -2, 3, 5, -16, 1, 0, 9, 12, -2, 29, -9, 0, 10, 7, 18, 12, 4, 24, 6, -3, 6, 16, 27, 15, 9, 16, 12, 0, 16, -1, 24, -3, 13, -4, 0, -2, 6, 7, 8, 17, 6, 5, 14, 2, 8, 7, -3, 2, -2, -12, -10, -10, 13, 6, -3, 18, -2, 20, 18, 17, 13, 31, -27, 4, -9, 14, 2, 5, 4, 22, 4, 19, 20, 5, 4, -4, -4, 12, -14, 15, 1, 27, 19, 34, 8, -9, 9, 4, 11, 10, 5, 7, 33, 7, 13, -23, 31, 0, 32, -9, 18, 8, 10, -2, 14, 13, 11, 13, 4, -1, 17, -9, -5, 5, 14, -1, 10, -7, 0, 4, -7, 0, -18, -2, -8, 10, 1, 8, -6, 30, 1, 16, -8, 3, 6, 3, 36, -6, 4, -23, 18, 5, 0, -8, 5, 7, 30, 8, 18, 1, 18, 16, 15, -6, 0, -1, 14, 4, -3, 9, 8, 9, 13, 8, 1, 2, 16, 15, 17, -2, 30, 3, 5, 1, 3, -1, 9, 25, 20, -10, 5, 9, 3, 3, 8, 8, -11, 26, 18, 6, -1, 27, -6, 4, 2, -22, 8, 7, 12, 0, 8, 12, 6, 0, 30, 15, 10, 3, 11, -11, 9, 12, 13, 5, -3, 8, 18, 19, -3, 31, 32, 7, 9, 24, 17, -2, 3, 20, 17, 7, 7, -3, 33, 10, 12, 0, 16, -1, 9, 9, 6, 18, -2, 15, 2, 30, 6, 37, 3, 24, 12, -4, 22, -11, 5, 28, 6, 7, -10, -2, -6, -6, 10, -5, -11, 14, 13, 26, 9, 11, 18, 2, 8, 2, 24, 9, 17, -2, 0, 15, 26, -3, -9, 21, -8, 16, 9, 17, 9, 1, 27, -9, -2, 12, -2, 10, 20, 32, -8, -5, 10, 11, 1, 26]
13.14999B6k4Q%Nk7K2mL3l0TQL4pl%Ol3QJ8lk2J2lLoJ0jlLKPknkNRj4J4Pj5J4j3p%M
13.12710DjpPNTj8K7m%j9J0J1rpk1K8j0Qrj0PL5l2K0k5J1kOj3J3k6K0Jjk0QL8k2mrK3
13.10624A8j6oNjLnJPQj6KTPj6J6Lj4OqJ3j0J1Pj4rJ7j3K4k4J7Oj5Nk%K1ol1K9J2k4
13.08538A0j3RmMjlJ1j2%PrmRJ7Mj4knj3K3k4L4rOl9M5j0j2j3K3qknrJ5%k3K6Nlj0J3
13.06402A4qKJ3k0jPRj6K1j7J8k4J7j9K8jk5j3J2MJ6j1%J8k0Mj3Nj0J5J3Nl8L4j0Lj2
13.04520@%k2K4RJ7k9K3oJ3j0j5nLk1J7J8l1QK1qKQrj4JJ8kj0J1RoNj6Jj6L3j6Mk5K8
13.02485A2l0K9j0lmJ4qMJ1j2P%J8k5%J0J5l8K4k6J9Oj1j5M9l9R%PJ4ol3J7J2j2J3l4
13.00602a6L3k5J6mPoLqNj7J0QJ7k7K3j5rJkmJ1J%k4K0MkK2l3J0QnK5n4L9j7OK2k0r
$$ y = [26, 2, 10, 10, 15, -12, 10, 6, 39, 9, -21, -13, 21, 14, 11, 11, 17, -16, -8, 10, 7, -15, -3, -6, -3, -9, 1, 0, -3, 0, 2, 9, 7, 2, 0, 5, 14, 0, 14, 21, 6, 20, 7, 0, 0, 4, 3, -4, 3, 8, 13, -5, 22, 18, 18, -1, 9, 20, 11, 4, -17, 11, 1, 9, 0, -10, -3, 32, 0, 20, -5, 6, 4, 10, -3, 10, -16, 4, 5, 4, -16, -8, 30, 8, 4, -5, 18, 2, -4, 1, 0, 3, -2, -1, 6, 14, -2, 0, 2, 9, -7, 9, 12, -2, 4, -4, 9, -1, 10, 17, 3, -6, 11, -2, 22, -2, 15, 21, 6, 11, 9, 9, 30, 24, -7, 22, 34, 10, -3, 6, 2, 6, 5, 2, 13, 1, 1, 8, -1, -5, 4, 21, 25, 11, 9, 4, -9, 14, -10, 24, 15, 21, -18, 27, 17, 5, -8, 15, 7, 5, 0, -9, 6, 6, -17, 9, 14, 11, 1, 14, 6, 8, 21, 1, 0, 7, 16, 0, 21, 4, 22, -2, 15, -4, 24, 23, -2, -15, -3, 1, 17, 6, 6, 24, 4, 8, -5, 0, -10, 5, 18, 23, -15, 19, 9, 12, 0, 0, -22, 2, 11, 28, -1, 22, 16, 29, 19, 4, -1, 2, -19, -2, 16, -15, -7, 14, 6, 8, 16, 7, -7, -6, 12, 10, 0, 11, 20, 14, 19, 3, 4, -12, 21, 5, 9, -16, 12, -18, 11, 1, -2, -6, 8, 0, 4, 15, 3, 10, 10, 28, 3, 3, 13, 28, -10, 14, -12, 7, 13, 2, -13, 36, -3, 6, 6, 13, 27, 21, -12, 5, 17, 5, 18, -16, 17, -8, 8, 4, 11, 5, 8, 0, 5, -12, -2, 6, 23, -4, 19, 4, -5, -4, -6, -10, 1, 2, 2, -22, -2, 2, 0, 22, -11, -1, 7, 2, 27, -27, 12, -5, 1, 23, 3, -6]
12.98568fOj3K5kJ2k3J7k4KQkJ2Pkk0L%KlNPJ6j5KMk0J0Rrk1OkrK0kKnJ9j4J3Oj5nq
12.96329gNj5J6%J8k5QK0j5J6l3J1J0j6J0Rkj9J3J2jk8L0k5J9kLrJJ0Ll3J3J4pqK9k6
12.94396aL2k1kqJ7j7PK1l0NqjOJK7rj1%oj3LK0rj1RK3j9J2j0Mn%J6k3K3k6J4%rPQj7
12.92260aJJ4qj7J1K0j1j4J2jJ3jj4%jNKPj4Mj8L1l6K3LQlj5NMlj0ROj2mJ6j5J3Pnj1
12.90123@oJJ6j8J2J3j0Pj8lnK2lK8k1mlrQmOrk8K2%JRTj4K1oNj0J2l4K0j6OK9l4K7
12.88037A9qoj0NRrTJ8k5K7KRkj5oK4l2KkK5rjMj1J5Nj7LoJ2k9K6j7ML0j5noqK4KTk4
12.85850eKPpJ8Nl5MK7l3K1nJ3j3J4l1J8qJ6%j4J9qJ0j5J4koj5L0k1OJ3o%j%k2J9%N
12.83815A4kmPk6K4oj5K1jk5NK0j1J3j4J1K2l3J2j8J4k1J5J2l2QL0qloRj0J5kpk3L6
$$ y = [-6, 0, -13, 12, 10, 22, -1, 16, -8, -6, 2, 0, 12, 19, 17, -3, 0, 0, 2, -1, 4, 11, 27, 12, 14, 18, -2, 8, 17, 8, -13, -7, -9, -18, 2, 0, 2, -3, 16, 2, 15, 21, 6, 1, -7, -2, -17, -1, -1, 17, -8, 0, 20, 5, 21, -12, -1, 9, -7, 3, 12, 10, -9, 4, 16, 15, -13, 17, -8, 11, 9, 12, 3, 4, 14, 17, -16, -3, 11, 4, -4, 25, -1, 31, 10, 8, 0, 17, 0, 7, 28, -2, 3, -5, -6, 0, 1, 28, 19, 8, 8, 2, -11, -8, 12, 3, -8, 1, 24, 5, 17, 7, 11, 6, 6, 22, -1, 22, -4, 10, 10, 1, 8, 16, -1, 0, 14, 6, -11, 0, 20, 9, -5, 7, 6, 19, 18, 4, 4, 3, 8, 10, 17, 3, 7, -11, 20, -16, 7, 10, 18, 15, 0, 5, 9, 6, -4, 5, 11, -1, -5, 11, -4, 9, 16, 11, 0, -6, -5, 11, -7, 5, 18, 8, 15, -3, -6, -11, 11, 8, 36, 15, 11, 8, -1, 7, 3, 9, 0, -28, -6, -6, -5, 4, 13, -1, 20, 14, 19, 9, 21, -13, 7, -9, -3, 26, -8, 19, 11, 5, -5, 0, 9, 0, -9, 9, -16, 11, 13, 22, 20, 5, -1, 23, -9, -7, -9, 16, 7, 6, 10, -1, 14, 19, 2, 5, -1, 11, -18, 8, -9, -5, 25, 10, 5, -1, -9, 15, 17, 19, -5, -3, 4, -3, 15, 20, -15, -11, 16, -17, 4, -1, 12, -1, 13, -18, 0, -8, 8, 8, -6, 13, 5, 15, 0, 14, 12, 6, -9, 21, 0, 6, 19, 13, 13, 12, 12, -10, 9, 9, 14, 12, 8, 15, -11, 13, 7, -8, 13, 12, -13, -8, 12, 1, 14, 0, 11, 33, 0, 12, -6, 8, -13, 2, 14, -18, -10, 20, 12, 9, 3, 12, 2, 17, 15, 8, -15, 21]
12.81933B1k6J2j1RKpK0k4K0j7QMjkLlmlLJ8Nj8qJ7k3L5l0j9L5j5J0qJ5k1J4j1JOJ4
12.79949B1j1Kj0LqL1m0L2j0KTl6K8pK0k6MJkJ6k6K2j4J9k8L9k8OK5k3Roj0QrMOJ1k4
12.77965gQk2L9k5J1J4k9J2%Qk2K6jqR%Tj8J6jj4K5l2K8k5L9l9KPLjQm%k1K3K7k0%n
12.75930A1K8l3J0%j6TK3oj3JJ7kj3J4j6J4lk4M8j3%l%j7K8j3K0j4lk1L1m2L9j1nRJ3
12.74048B2k8J1nj8K7JJ1mj5J5%j5nJ4Mk4%K9k5K3k4L2m1L0j0MqK8k1%k1K5Qk1j8K2
12.72216ClRpK0k8LJ0j2J7j2J3k0J6j9OJPkK2l5J6kQj8K5j3K1l4J1kJ9j9PqnJ5k3%O
12.70232gJ0%J2pk4J8j9M4j8jk0NK3j4J1k0M2k7koLJ7k9K4j5Qk0K3k6K2Mqmk5K0%L6
12.68350C0l8K8j7lj5K9k0NoL6k9Qo%ToJ9j8OlJ1k1J4J0rLjJ5mrLnNKpJj2JOoRj0NP
$$ y = [21, -5, 7, -4, 5, 7, 0, 20, -4, 16, -1, 7, 11, 10, 8, 11, 8, 4, 1, 4, 22, 27, 9, 1, 18, -5, 30, 0, -19, 16, 1, 11, 3, 18, -3, 11, 0, 1, 7, 21, 10, 12, 2, 5, -3, 28, -12, 20, 10, 12, 14, -22, 6, -1, 19, -7, -3, -2, -4, 12, -14, 8, -6, 13, -15, 24, -4, 2, 27, 4, 13, 7, -3, 5, -4, 0, 6, 17, -7, 1, -21, 18, -7, 4, 18, -11, 1, 1, 9, -13, 13, 12, 4, 13, 13, 13, -5, 11, 10, -4, 21, -11, 17, -8, 31, -8, -6, 1, 4, 3, 11, 7, 7, -14, 9, 36, 16, 16, 11, 39, 6, 16, 16, 0, -16, 7, 1, -12, -11, 6, 4, -9, 5, -11, 3, 0, -24, 24, 11, 11, 8, 8, -9, 19, 6, 26, 12, 9, -12, 19, -23, 16, 5, 0, 9, 22, -6, 5, 0, -18, 9, 10, 21, 17, 2, 17, 17, 2, -3, 11, 15, -9, -9, 20, -5, 18, -6, 26, -15, 15, 5, 9, 1, 29, 8, 8, -13, 12, 20, -1, -19, 3, 0, 9, 2, 22, -6, -3, 7, -5, 12, 0, 13, -7, 9, -10, -4, -3, 4, 2, 24, -11, 5, 3, 11, -7, 18, 5, 26, -8, 3, 1, 20, 1, 8, 0, -5, 10, -13, -13, -7, 3, 3, 15, 8, -16, 2, -17, 27, 9, 8, -12, -7, 16, 2, 13, -7, 35, 8, 6, 0, 3, 20, -9, 15, 0, 8, -12, 11, -15, 7, 11, 3, -1, -26, -6, -6, 30, -8, 20, 3, 0, -15, 14, -6, -1, -7, 29, 0, 8, 2, 2, 2, -4, 15, -3, 3, 0, 11, -10, 4, 14, 5, 8, 7, 22, 18, 9, 12, 7, 12, 14, 7, 8, -4, -3, 3, -3, 6, -4, 1, 8]
12.66112HOl4L8k9K3j4J7j1J2qoJ3l1N9n5K9k8J8pJ6pk0J8j5J3Tj5rQK%j1lK5j7NTO
12.64179A4k8K1oOJJ2J0m0K6l5L5k2L2l5K0j2oK1j4KMOk2J4ojJ9k0J2Omj0PJ0j7JQJ
12.62245A0Ll7K4Pj0KpMRjmoPkj6M6k6Pj3K5l0J0kK0l6L4j4QrOoj1Mj3OL8l9M1j8k0
12.60211iJ8j0K4l0L1k1J2p%J0j8J6l0K3k%Qk0LTjKqQkk1J6JP%j3J8j9J3%J9k4J1Rj3
12.58176DQk2K0j0JkTLJNJ0nkqLTkrJ8k7J2lK3j9j3LJ6Kj4K4mj4qK9k1j4K8Nj6kOMQ
12.55988A9j8j5K4j8J8k0J6j7KJ2J3Ml4mK1Pj4nlK4Oj7LJ4l3L4k1L4k1J2j9KqKOJ7j8
12.54106ENJ7j3lkpqL8l3J8k1k%J6LTqlLj4K3j4K3l2L1k2MlJlJ2k2LNP%Kj3K5k3K3l1
12.51970a0J2J8j6Nj5nK6j2lMRj3RkrTL3k6J5qj%j2L0k3J3kpjJ5j1KLloLlJ7oPLk9K8
$$ y = [8, 14, -20, 18, -11, 12, -2, 15, 4, 16, 8, 2, 15, -16, 43, -12, 17, -11, 7, 0, 16, 9, -11, 7, -8, 5, 18, 3, -6, 2, 4, 4, -7, -10, 15, -2, 3, 8, 14, -14, 7, 1, 7, 8, 20, 30, -10, 16, -19, 16, -6, 26, -9, 11, -1, -7, 14, 0, 2, 6, 12, -10, 4, -2, -3, 16, -4, 8, 14, 10, 0, 7, 17, 0, 1, 9, 10, 13, -24, 0, 7, -3, -1, -8, -4, 5, 4, 0, -6, 1, -1, -17, 29, 3, 10, -3, 22, -8, 2, 0, 20, -16, 18, 4, 12, 3, 9, 3, -8, -4, -17, -11, 27, -12, 29, 11, -9, 9, -1, 23, -7, 24, 3, 15, 8, 8, 18, 0, 16, -14, 9, 7, 7, 15, -5, -2, 1, 0, 2, -6, 2, 0, -21, -5, -4, 3, 3, -10, 8, -11, 2, 2, 21, -3, 8, 17, 4, 12, -10, 10, 0, 1, -1, -3, 0, 1, 6, 16, 11, 9, 1, 4, 7, 5, -4, 14, -13, -1, -4, 19, 0, -13, -10, 6, 8, -6, 18, 14, 0, -8, 21, 0, -14, 14, 19, 3, 1, 7, 11, 19, 1, -14, 10, -8, 10, -10, 6, -11, -9, 3, 16, 20, -14, -18, 3, 10, -4, -9, -12, 12, 18, 1, 4, 18, -15, 19, -2, 32, 11, 23, 4, 6, -2, 0, 6, 23, 5, 10, 27, 14, 11, 9, 2, -6, 32, -1, 17, -4, -6, -6, 10, 13, 16, 8, 5, 8, -6, 17, 3, 26, -6, 25, 3, 7, 4, 5, 2, 14, -8, -5, 0, 7, 7, 9, -4, 21, -2, 21, -10, 2, 20, 4, 9, -6, -11, 15, 3, 0, 4, 13, 0, 9, 7, -2, -11, 22, -4, 11, 3, 2, 2, -10, 20, -3, 10, 8, 1, 0, 15, 4, 6, 9, 6, 0, 3, 0, 17, 11, 18, 21, -8, 20]
12.49782B0l5K7Ok6J0K1l8K8j1Pj6JL2k6mNj0J2Kj1%J4j0QLJ4j9lmJ2mJ1TrMRk9J1j3
12.47798@J6k8K6qMKj3oPQj5L3k7J0nRqNrJ4k1K0mj0J4j5KRj4ljKJ7jj7M7n1J1RLj0
12.45712BJ1j5K5j8nNnJ7k5L2k0j1K2k9J4qRQPoJMRKJ1n3J7k6K9mrJ6Kj2KJ3nqJ0pk
12.43627@nJ6moJ3qJ3jj3j0pJ2OlQ%j2LQj5JK6j9k3J7K0l8M2k1J8l2M5k0kk3L7j9Jj6
12.41643a1M0j6k3J1Qj2L1m6L6j2jK0l0J2PNk3lK1mroOMKk0J7mJ4Lj6J4j7J6Qk9LMr
12.39659iRJ1pJ3j7JmK1k1J1Nmj9J3jQoJ2j7Ok2J6pJ0J2j9nK7j5Jj5J2K2k4J5j8J6k
12.37726IOlK8o3M7k7L5l8Pj0K6j9oM1n3L2j5%Rj4nqM2k1%K1k0jK5j4j1LnJ1rkKjnj2
12.35691a8L4k2QPrj0K1j0lJ8m1L8j2mJ6k5L1jj8Nj8J8LlrjPj2J6pJ2mNqj0lK9j3Qk7
$$ y = [20, -15, 12, 18, -8, 2, 23, -15, 13, 2, 9, -7, -6, 26, 0, -4, 1, -9, 3, 5, -6, -6, 8, -2, 6, 9, 23, 4, 1, -3, 9, 5, 16, 27, 18, 22, 31, 2, 13, 0, 16, -12, 14, 6, 10, 12, -1, -7, 0, 8, -7, 26, -1, 9, 4, 13, 5, 10, 1, 15, -6, 14, 10, 0, 14, -1, 1, 10, -4, -7, -8, -6, 11, 10, -7, 40, -11, 0, 9, 12, 2, 13, -2, 23, 5, 0, 5, 0, 17, -8, 24, 4, -7, 15, -14, 0, -8, 1, 9, 16, 10, 11, 15, 24, 26, 37, -16, 1, -25, 4, 0, -9, 7, 9, -3, -1, 12, 7, -1, 9, 2, 0, -5, 11, 7, 1, 14, 6, 19, 18, 5, -5, -12, 0, 6, 3, 11, 11, -1, 2, 10, -5, -4, 22, 3, -20, -3, 17, -21, 21, 0, 18, -14, 31, 11, 9, -14, 23, 4, 5, -11, 29, 13, -10, 1, 9, -3, 28, -18, 18, 6, 5, 25, -5, 7, 14, 19, -4, -7, 14, 10, 1, -5, 1, 5, 7, -13, 4, 0, 14, 17, 1, 15, -2, 14, 22, -7, -4, 0, -9, 0, 11, 4, 17, 0, 1, -3, 18, -3, 8, 13, 9, -10, 3, 2, 10, 4, 16, -1, 5, -17, -1, -8, 2, 14, -5, -10, 17, 2, 3, -12, 0, 22, -2, 13, -5, 11, 9, 15, 12, 40, -23, 24, -3, 32, -6, 1, -9, 17, -2, -8, 33, -20, 12, -3, -3, 6, -8, -13, -21, 21, 0, 0, 21, 1, 0, 25, 11, 0, 3, -2, 9, 0, -2, 0, -1, -6, -18, 16, -6, 2, 9, 0, -10, 11, 1, -2, 16, -25, 13, 1, -3, 13, -12, 19, 18, 0, 5, -13, 5, 8, 5, -4, -5, 2, -10, 6, -1, 11, 7, 12, 4, -6, -9, 20, 7, 15, -12]
12.33656a2L0j3J7k3jJnMJ1j1K9m7L5k5RKJ4j8NrJ0%jK4k5J7k1MJ6j4K4l8Qkj3K5kJ
12.31723FJJ1nlj7J1Pj0QoMqjK4m3K1oRJ2j4Mk1J1LMKljRPj8J2Rj3oJ4Nl5J7Nk2J7R
12.29535A0lJ0k8j1M4k7J7j6PMJ2oMKLl1J3j3K6j6J5j1j4K2qMPJ1k2Qr%J1j7K5m7K9
12.27653Ej0K5k1MrPkPJ0k5K6lj4K3k7LJ5KnqJ9k7J2k5K8j6K6k7MTrJ4OrK1l6J7j4N
12.25669dMmjK6k2j0K3j1KTmNK1j4j3KJJ4j1j8RLNjJ2j2lj4PRJ2j2JPoJ6j9J1j2lj3
12.23583a5J0pL0j2J3l2J9J3l2K6j2j0K4%lOj4j2PlK3nJ2k1jk0J7J2Rk0MjPj6K4j5P
12.21701A2j7NJ3j9J8j3J5rj5J2KlJ1j2nJJ1kLJ5Nqplmj4QJ5k3J7oj0J9j0Noj4J6qR
12.19666DmJ9kk4L0Kj0j5Nj4QqJ9l3J9KJ5Jj2J6j8JPrRpOj5mL%K1k1pJ8J0j3J9j4Rr
$$ y = [-12, 18, 5, 22, -1, -2, -1, -6, -2, 9, -2, 27, -20, 15, -10, -1, 1, 15, -3, 2, -7, 3, 3, 2, 26, 1, 18, -3, 1, 17, 3, 27, -11, -3, -5, -18, 7, 5, 6, 7, 18, 13, 10, -7, 4, 11, 1, 9, 3, 7, -1, -2, 22, -21, 0, -6, 3, 15, 1, 5, -16, -5, -2, 2, 4, 1, 0, 9, 16, -2, 10, 19, 6, 0, 14, 19, -16, 1, 6, -16, 1, 10, 7, 17, -11, -22, 22, -5, 12, -4, 3, 7, 19, 13, 17, 19, 22, -9, 4, -9, 17, 1, 16, 5, -9, 13, 5, 9, 16, 27, 5, 13, 4, 4, 15, -2, 23, -24, 5, -5, 20, -1, 3, -6, 1, -1, 6, 16, -9, 17, 14, 0, 23, -4, -1, 14, 16, 11, 3, 22, -5, 7, -18, 10, -6, 20, -7, -3, 1, -8, 6, 12, 3, 24, -12, 5, -9, -4, 0, -4, -5, 21, -1, -11, 12, 1, 3, 5, 1, 6, 27, 13, 0, 2, 3, 17, 6, -12, -3, 0, 5, 4, 16, 4, 1, -13, -6, 3, 15, 3, 4, 11, 5, 21, 2, 13, 1, -2, -15, -5, -12, 18, 6, 19, -13, 6, 19, -13, 13, 1, -9, 15, 15, 12, 18, 4, -8, -1, -4, 19, 14, 26, 5, 4, -16, 1, 13, 22, 2, 6, 5, 12, -4, 20, 5, 12, -5, 0, 13, -6, 12, -1, 14, 5, -10, 2, 4, 1, 12, 0, -5, -4, 7, 5, 8, 23, 28, 20, 13, 10, 6, -8, 0, 15, -8, 9, 3, -7, 12, 2, 7, 1, -13, 3, -5, 4, 0, 19, 17, -7, 23, 25, 15, 0, 5, -9, -1, -9, 10, -23, -4, -2, 13, 14, 2, 18, 0, 1, 8, -1, 8, 1, 7, -8, -12, -9, -9, 12, -9, -16, 2, 12, -1, 18, 4, 13, 4]
12.17581Dj1PKj3K2Rk0J0pK2l2J1m%jNLrJj5JQK4l1J2j2N2k9Oj5mjRj5J7%lj3J0PJ4
12.15495B1j6l0K9j3K3k0jrL7k9J6j1JK0rj0kKLlL2j6j1j0L2l3K1k0LJ3j5Oj9J8RrJ2
12.13613A2j0Onpj1J0J3nMOQj3Jk7L9k8RLkj0%J9oj8J5qNJ3j4J9k2j0M1k2jlnKJ3pj1
12.11527gJ2%Qj6J3rkQk0KPjKJ7Lk7%QOTljj2L4k4NoRj5Lnj5PJ9J0Qkk4NrJ5J3j4Mq
12.09238DmLRjJj8J4k0K9rqJ2j7Qj1qL9k9J1rlPJ3j8J3KqnJ2k3KL0qM%j5rJ1J5l0K2
12.07152Hj2rK0j4NLj4J1OqK6j2mnJ9l8J6K1j2k4J2J6j9N2m1NmKJ1j2lO%qKj5J5J1j2
12.05168ArL2j9nj4pK3Rk0NK3qkj8%K0j9K1nTrkK6j4Kj5J6j1J3J1j8J8j3jJ3k5K3k5
12.03235hJ4nPQk2OJ2K0m3NOKJ2k7ojL2j0kLMJ2j7Lj0J7j2J3nJ1j6J4l2L1j1MoJ4j1
$$ y = [4, -7, 0, 2, -11, 11, 20, 0, 10, 3, 25, -7, 4, 0, 0, -1, 4, 7, -2, -1, -16, -15, -7, 17, -14, -2, -14, 38, 9, 15, 0, -4, -5, 4, -11, 6, 6, 3, -10, 0, 7, 21, 5, -25, 4, -9, 14, -6, -7, -16, 21, -8, 8, -3, -2, 18, 9, -1, -3, -1, 2, -1, 31, 15, 4, -6, 26, -7, 14, -6, -3, 10, -5, 1, -18, 0, 9, 0, 12, 2, 8, 3, -4, -15, -5, 8, 3, 7, 13, 21, 8, 9, -18, 21, -7, 2, 5, 3, -7, -7, 12, 6, -12, 3, -5, 0, 13, -1, 18, -4, -14, 27, 5, 4, 1, -4, -2, 11, 4, -7, 5, 5, 13, -3, 10, 1, -1, 7, -13, -11, -4, -5, -3, 14, 17, -10, -10, -2, 4, 10, 7, 6, -6, 28, 4, 9, 3, 12, -3, 0, -5, -20, -13, 6, 16, 24, 22, -2, 3, -6, 9, 22, 8, 12, 4, 0, 3, 12, 11, 12, -6, 8, -12, 17, 8, 0, 12, -5, 3, -8, -16, 23, -6, 5, -4, -7, 0, 13, -5, 8, 10, 2, -3, 9, -14, -12, 18, 10, 14, 14, -1, -10, 1, 16, -14, 8, -4, -13, 7, -7, -2, 1, -13, -2, 4, -4, 22, 10, 6, 1, 20, -18, -2, 19, 7, -17, -5, 11, -8, 44, 3, 8, 4, 6, 17, 5, 2, 8, 8, 0, 2, -13, 2, 13, 1, -8, 24, 5, 0, -14, -21, 2, 11, -9, -4, 19, 11, 9, -9, -9, 11, -8, 13, 8, 3, -6, -8, 18, 4, 6, -9, 7, -4, 9, 20, 2, 20, 7, 6, 19, -6, 17, -8, 6, 1, 8, 16, -6, 0, 12, 32, -11, -6, 0, 2, 14, -13, -19, -20, 12, 2, 0, 3, 7, 19, 2, 5, -5, 12, 0, 13, 8, 19, 3, 17, -15, 16, 5, 9, 3, 17, 6]
12.01251FknkJ0jok2J7MK2l7K5Jj0JnNKlopJ2J3%jk1K5k0K1okj1TL0j2Nj0JJ1%j6LO
11.99063Dk4K0%mJ3j9mK1J2qpj4KJ5%oMO%k3K3pj6L3j2kRLk5K3jk1J8k3K7k8NK0rqK4
11.96978B1k5KPj4MJ2J7l5J5j0J4Jj0JTjmj5L6k9QpRJ8l1K8j1Rj2kJ6k3K5j8JkK7k9
11.95045fPjNlk1J1K5j6kQMj1Qj4K5k7K1j5J2pNMj9K3k1K1k6K7j7Rj1KJjKj9J4Kk4J8
11.93010goL8k7OJPk6L2k1J0j1J7JNk6JQMj7QJ0%KRj2Qpk1J4K8l8L2l1L0k9J4j7j1K0
11.91026bJ2qJ0j0Pjj8TM2j1Pj4MJ5k1K0pK2l1QpJOlM%pKpQRk4J5j5J1j3J4oJ0pLJ1
11.88889A1%qj6J9oJ1nPJk8J0R%Ro%Pk3K4j4oJ7j1K4k5J1j8J2l4K7j4J4Nj8K3j4J2j3
11.86956fK1k3J7k5K3Kk8L9j6J8j5pqROLj1pL0k4NJKk1J2j3L0k4J0MQl5K2mOKJ6l8K7
$$ y = [6, 4, -1, -3, 7, 6, 0, -22, -5, -1, 21, -16, 9, 10, 0, 1, -4, 1, 3, 0, -6, -13, -1, 12, 12, 11, -10, 15, -5, 16, 10, 8, -3, -14, 16, 4, 9, -1, 0, 11, 11, -5, -2, 4, -20, 0, 0, -4, 9, -10, -14, 7, 19, 11, 4, -10, -8, 7, 7, 1, 5, 11, 11, -12, 11, 4, -12, 21, 9, 7, 16, 19, -6, 17, 16, -5, 13, -10, 17, -11, -6, 14, 5, -3, 21, -4, -2, 5, -9, -5, 7, 24, -11, 4, -6, 8, 9, -1, 0, 1, 0, -4, -19, 17, -12, -4, -11, -2, 16, -15, 13, 2, 11, -1, -3, 13, -10, 15, -3, -2, -4, 23, -6, 1, 0, 5, 2, -19, -8, 17, 1, -1, 7, 11, 0, 8, -6, 19, -8, 13, -2, 10, 3, 8, 12, -7, 16, -5, 16, -10, 17, 0, 9, -2, 0, 1, 0, 2, -17, -3, -1, -25, -7, -13, 25, -2, 4, 5, 12, -14, 18, -3, 7, -4, 13, 14, 19, -7, -6, 2, 6, -11, -3, 7, 7, 9, 18, 6, 14, 7, -14, 0, 28, -10, 22, -9, 21, -8, 6, -11, -22, -2, 10, 2, 12, 2, 9, 8, -10, -28, 14, 3, 10, -4, 0, 15, -6, 14, 7, 29, -2, 6, -1, 0, 6, 3, 7, 7, 0, 2, -5, 3, 12, -12, 3, -12, -1, -14, 0, -6, 4, -3, 0, 11, 11, 3, -13, 6, 0, 11, 6, 13, 14, -14, -4, 5, 5, 14, 8, 8, 15, -8, 16, 2, -4, 13, 2, 26, 1, 12, -6, 6, -28, -1, -15, -1, 4, -14, 9, -5, 7, -6, 15, -8, 9, -16, 7, 9, -19, 20, 4, 22, 7, 0, -8, 1, 7, 10, -1, -8, 22, -2, 3, 4, 6, -15, -3, -16, 14, -10, 0, 4, 12, -23, -1, -5, 1, 3, 19, -19, 8]
11.84972HkMjMj9KkJ7Rk0K7k3Pj6rNJ1K1k3QpJ0j6J0l0L1j5%LPkOj3K3j5loKj1J0J4
11.82886FNkk1J1j3L6l2K4pj4oK9l8J2TQj1mKK1l3J7qJ2LmolJ2Lr%Lj0L2l7Rj0L3k9
11.80851gQTmJ5j4PljMj1JJ4rKnK3j9TK1kQj2nJ4Rk4Prj2K8jj2mK3k5J6j9QPjKrNJn
11.78562aK2k7J8mJ7k4LQonj1NQj6J5jPJ1oj9KJ1l6L1kJ2j5nJ2mJ8k3Qlj2K5k9J7pn
11.76527a1J5nJ0rJ7j1J0k9J2NmJ4pk8K3k0K5mJ8j5pJ1oOk0L8m5J8jJ6k1J4j0N%mLTk
11.74543DqJ0ONl2J9RJqJ3j5oTjK3j4J7k5J3Oj5L1l5Rj3oJ5kk2L7k8J4jJ0J3noj9PL2
11.72509B7k3j2J5JlpK7k4jRk1J1Tj4L4m0J0lJ2j0J7j6lnL1k3JTrK6k6QLrL0j4nKK0
11.70525B8j5j0JOj4jJ6j3J8j9PkMj2J7Mk3J6j2K9k5Rk8J3J4Jj5J4Nj5jLJ1k8J7jJ6
$$ y = [8, 6, 10, 9, 13, -6, -4, -6, 11, 20, 0, 27, 4, 11, -5, -14, -9, 2, 23, 0, 8, 1, 11, -5, 5, -25, 6, -9, -9, -6, 1, -1, 5, -8, 15, 0, -3, -9, -7, -18, -8, 6, 11, 9, -12, -1, -14, 22, -10, 14, 7, -7, -13, 16, -22, -10, 2, 10, -1, -5, -3, 18, -15, 2, -6, 6, 9, 5, -1, -4, 8, 11, 2, 2, 5, -5, 27, -10, -1, -11, 22, -7, 1, 9, 5, 20, 6, 13, 10, 9, 13, 2, 3, 17, 8, 10, 5, 28, 9, -10, 11, 9, 17, 5, 0, 14, 23, -1, 6, -3, -15, 13, 12, 0, -4, 19, -6, 10, -9, -1, 6, 5, 7, -2, 3, 4, -1, 21, -6, 12, 8, 25, 1, 4, 12, 6, 1, -10, -5, 3, -13, 2, 1, 8, 19, 13, -6, -4, 7, -29, 2, 0, 12, -3, -8, 4, 0, 18, -5, 3, 0, -12, 13, -16, 1, -6, -11, 4, -1, 9, 0, 17, 6, 16, -13, -1, 4, 0, 14, 7, -21, 2, -18, 7, 3, 21, 6, -1, 10, 4, 10, -10, 28, -17, 1, 0, 16, -5, 9, -1, 4, 4, 0, 3, 6, 4, -4, 6, 12, 17, -15, 4, 13, 14, 6, 19, 4, -2, -8, -9, 14, 0, 17, -8, 5, 11, -4, 27, -8, 1, -12, -18, -3, -5, -27, 10, -18, -4, -5, 5, 18, 13, 7, -12, -5, 27, 4, -8, 7, 8, 5, -2, 25, 1, 0, 9, -12, -1, 10, -4, 30, -10, 0, -3, 9, -1, 16, 0, -3, -8, 23, 0, 1, 2, -7, 19, -7, 1, 4, -5, 25, 11, 6, 8, 28, 13, 3, 4, 10, -4, -5, 11, -2, 16, -3, 4, 2, 6, -6, 11, 15, -8, 8, -4, 25, 0, 9, -19, -6, 8, 9, -6, 8, 13, -2, -3, 0, 11, -17, 0, -1, 15]
11.68642A5j1RJj1RjK2l6lJ6rRQj0J3k8K0j2j0RJ2l1K1kJJ1lrJ8k7K4rj3kMKLOPqnr
11.66506iQjj9K6J1j4LMK2j8p%oQJ2j6%qPJ0momqK1J3j7j4J3j3J1j8J8j2J3lRj0koQ
11.64420BpJ0KjNj8mL2k1mjJ0j2NKlKTK0j3Lk2J1kjLJ5k4kK5j0J0pJnj3K2j4J9k7OR
11.62283EQk7jLrL9j5J0nJ6k1k6RJ4KJKj1J2oKj5K3jPl7L6j5jNK4l9jK2mKl%Tnj0JR
11.60096@j1NPLoJ1LJJ5m5J8MQj4rK3qknM2n4K1Mr%J0roqLK2j8%kK1j4lJ7mj1LRj0K
11.57858DJ4j2Oj2k5L8j5J8k0K0k4J2j8J9Ql0L5j9j7J8%OJj5kJ5J9k0Nk8K0%lOmJ7r
11.55975HJk0Qj0K7mj7J0J7k0NklORPk0Rj3M%J2l1L1Moj1K2j0TlpK1j0j8K2Oj0TJ7r
11.53890BMJ0l4L7l6J6K2j2pnLj6N3l7K3k1MoJ9j3j9L7m7K6j8K8k3L4j7JLj3J9l2J7
$$ y = [15, 4, 13, 14, 3, 12, 11, 33, -3, -6, 10, 1, 10, 18, 8, 21, -7, 13, 1, -9, 0, 12, -19, 2, 0, 1, 12, 9, 0, 18, -9, 15, 6, -7, -9, -5, -3, 0, 6, 13, 5, 0, -9, -1, -2, -21, 5, 16, 2, 5, 9, 31, 13, 6, 6, 0, 8, 20, 4, 4, -4, 3, 13, 9, 3, -1, -9, 12, 25, 8, -6, 7, -6, 5, -13, 5, -7, 6, 3, 12, 2, 0, -6, 2, -5, 5, 7, 6, 11, -7, -11, 21, 0, -4, -5, 5, -7, -2, 0, -3, -1, 1, 21, 8, 11, -11, 0, -2, -3, 0, 15, -9, -11, 14, 4, 14, 7, 8, 3, -10, 12, -2, 17, -10, -4, 5, 13, -14, -15, -12, -21, 18, 3, 13, 8, 24, 3, -23, -14, 0, 2, 3, 5, -6, 6, 0, 2, -13, 10, 9, 16, -21, 15, 0, -1, 4, 28, -11, -12, 10, 6, 8, 5, 5, 5, 0, -10, -9, 0, -11, -6, 1, 4, -2, 9, 12, 13, 28, -17, 1, 5, 13, -1, -10, 13, 5, 3, -2, 40, -14, 7, 11, 2, 2, 12, 3, -3, -11, -8, 14, -4, -4, -6, 15, 1, -2, 15, 11, 0, 3, 12, 2, 4, 18, 6, 12, 0, -25, 13, -2, 16, -4, 16, -8, 4, -14, 5, 13, -17, 18, -1, -18, 0, 0, 6, 7, -8, -10, 5, 24, 4, 9, -19, 1, 1, -2, 4, 0, 17, 8, 9, -11, -3, -13, 14, 10, -7, 3, 20, 0, 5, 3, 0, 6, 15, 22, 2, 11, -2, 2, 2, 14, -17, 14, 18, 12, 1, 23, 13, 3, 0, -7, 14, 4, -14, 8, 14, 4, -6, 11, 2, 6, 16, -18, 19, -17, -1, 21, 9, 2, -3, 0, -16, 37, 0, 23, 2, 6, 0, 19, 6, -13, 24, -23, 3, -15, 13, -10, 24, 7, 8, 11, -2, 17, -15, 2]
11.52109Bj8K4jTlrOJJ7m4J9jPJMJ6k2J5j6J6k9K2RQ%l6K4j1NTj1oK0%k5kRj5M3m7M0
11.50023A6j9Mk4L8j6JNMjOj1%pNj4K9k1K5l1RJ2j6J9kJ3l0mK6kj5Jj6K6J1l4K3jj1
11.48090bmPj4PRrJ4jj3QpN%J9l0J1K6k7J6jLmkJ1k9JMNMrJ7nJ4j9TM6k3j1Rjj9J9L
11.45903Ij9L0k2QjTnJ5j4nJ0rQrJ2j6J0Tl4M8j3pj0J7j8kK9%j1oJk2PJ9Qll1L2j4J9
11.43868B0k0Pj0JqJ4j3nmL4j1Ojm0M5lk1J7j3J4rK5k3RlJ7k5LJ9k1lj4L6k2K6l1J0
11.41986Cj3kK2j2KnPrK4JMk4j4rL3Lj1kJJ2noKnj3KJ7Jk2L3k0J5j8J5j0J7m6K5J8k1
11.39951a0OJ1k3K2j1jJ8k4K7l0J4qK9k6L1l6M4k7j5K4j5NplMomK0nJ2j9J3oTqK2kj0
11.38018@OmNOj6LjJ7l2J5MPmK5l6J9l5K4mj3L8l6j0K2rJ7j7K5k1QrJ5j2lJ6j0mNj3
$$ y = [2, -16, 8, 7, 6, 3, -6, 0, 1, 18, -26, -7, -8, -1, 0, 4, 20, -2, 13, -3, 13, -16, 6, 15, 23, 23, -13, 11, 0, 5, 10, -1, -7, 13, 13, -12, -14, -5, -20, 23, -24, 16, -3, 1, -23, 15, -1, 0, 5, 9, 8, 14, 3, 3, -4, 1, -13, 16, -5, 20, -11, -2, 10, -6, 13, 11, 24, -6, -10, 16, 14, -1, 0, -16, 10, 21, -13, 10, 9, -2, -6, 1, -13, -6, 3, -6, 8, 7, -6, 2, -5, 0, 0, 19, -11, 0, 26, -1, 15, 14, 17, 13, 11, 22, -7, -6, -2, 3, 7, -2, 15, 10, 24, 5, -14, 32, 9, -2, 7, 6, -13, 6, 9, -10, 20, -2, 6, 5, 4, -1, 14, 0, -5, 5, -4, 4, -5, 7, -9, 1, 11, -23, 25, 12, 5, -5, 12, -6, -8, 21, 21, 10, 4, 5, -17, -10, 9, 17, 14, -17, 15, 1, 20, 0, 7, -3, -2, -10, 4, -9, -14, -18, 16, 5, 11, 10, -30, 15, 12, -9, 8, -5, 9, 0, 25, 2, 11, 8, 25, 0, 3, 22, 1, -2, -16, 20, -2, 24, -7, 3, -10, -12, 10, -2, 0, -5, 2, -7, 17, 18, 22, -2, -16, -25, 8, 11, 0, -2, -1, 11, 6, 0, 2, -3, -16, -14, 3, 4, -18, 15, -5, 10, -8, 7, -3, 14, -32, -7, 11, -10, -4, 7, -16, 6, -5, -6, 12, -12, 15, -15, -1, -9, 20, -6, 25, -11, 33, 6, -9, 15, 0, 5, -2, -5, -1, -7, -11, 9, 4, 16, -3, 10, 4, -2, -10, 12, 10, 0, 6, 2, 7, 13, -3, 0, -1, 16, -16, -1, 3, 10, 6, 31, -5, 14, -21, 3, -1, -14, 24, -12, -22, 0, -9, 8, -9, 16, -5, 3, -6, 9, -3, -6, 10, 0, -4, 1, -12]
11.36034a2K2Qk5MJ4oJ7l8LJ0JnJ8j3J0nkj9K5lJ5Klojkj6RoJ1k3K0j2rJ4MjL9l9lO
11.33948CR%qRJ1j2j7Jjj3LK4kJkrRj7L3l9K4qJOpJJ5jrOj4Nj5J8Ol5K6Oj9RJ9qQj1
11.31710F%loJ9kJ1j7l%Kj6OKQnMJk6J5Pk2QJ3%Tj0jL1k5J3OlTMl8M2k2KK1l2L4l6K3
11.29522Hj8kJ3Mj4NJ2pRj5J9k0J7k3J4qJ9j3MJ4k5PQqNJ7j4nTmK0k2PJ7j1J1k7K7j6
11.27538@K1mj1j2J0MjJj4%L0j7rRj3J2k1J5Nj4QJ5Kj4pJ2J1k2J0rOJTMj3K2k1LJ0M
11.25504A4j7J0Mj5J2Lk3K6pMj9J3j0P%J5j7qJ8Kk2J0QRmjKj8J9n1M6j0K1k1J1k3RJ1
11.23570Hjj7K2plNj0J5Lj1Mj0KPRj4K5j6noTJ0J2l1K0MKk7L2j3Ol2K0oJ5k3M6j8Jr
11.21536CRj5Rj6RJ2j6NOjoJj5K1j9J3lNoQmJmJK0j9qNjQNlLJ0j1mTRJk6RJ2mMlk3L1
$$ y = [-12, 10, 18, -7, -3, 11, 5, 22, -16, -13, -3, -2, -7, 11, -2, 8, 3, 1, -18, 7, 4, 19, 21, 18, 12, 11, 9, -7, 2, -4, 7, -16, 4, -8, -17, -3, 1, 0, 39, 0, -3, 3, 12, 12, 4, 13, 24, 12, -5, -4, -5, -18, -15, 9, 7, 8, 6, -3, 6, -11, 22, -17, 7, -1, 0, 6, -1, 0, 15, 14, 5, 11, -3, 2, -13, 5, 11, -24, 2, 8, -11, -2, 17, 9, 17, 6, 6, 3, -3, 16, 14, 25, 8, 5, 5, 7, -9, -3, -1, 7, 2, 6, 7, -19, -4, 3, -19, -11, 2, 2, 2, -8, -9, 22, -3, 10, 16, 13, 10, 14, -24, 18, -4, -2, 19, -13, 21, -15, 8, -10, -12, 1, 5, -9, -4, 8, 1, 10, -5, 14, -6, 11, -12, 2, -6, 13, 0, 4, 18, -7, 0, 8, 0, 5, 22, 8, 3, -2, -6, 14, -8, -1, 16, 5, 16, -11, 16, 0, 21, 17, 6, -6, 4, 8, 7, 8, -6, -6, 24, 7, -2, 7, -6, 6, -15, 0, 5, -9, -1, 14, 16, 2, -5, 7, 18, -4, 6, -3, 3, 4, 5, 9, -4, 18, -3, 0, 10, 14, -3, 7, 11, -4, 8, 11, -12, 14, 7, 11, -8, 5, -5, 2, 2, 17, 0, -8, 10, 12, -10, 0, 8, 17, 13, 12, 14, -4, 15, -36, 10, 0, 21, 0, 11, -12, -3, 8, 7, -10, 12, 5, 2, 7, -3, 12, 15, 4, 8, -2, 0, 7, 16, 2, 27, 11, 6, 0, -6, 4, 16, -15, 5, 9, 11, -16, 16, 3, 9, -23, -3, -9, 6, -17, 29, 11, 12, 3, 12, -3, 6, -10, -1, 11, -5, 0, 6, 5, -1, 0, -15, 6, -13, 0, -3, 2, -4, 4, 0, 1, -3, -2, 18, -1, -9, -4, -5, 3, 8, 5, 8, 18, 7, 3, -1, 8, 9, -17, -8, 4, 0, 4, 1, -22, 9]
11.19145Ik0ORTk5J8j1jJ7k9K5j5MK9j8Pj3j%J0j0KQkjMk2J6j5J7pOK0j8pqrJ6qRjJ9
11.17008A9m0M2l9L2j3M%nj6K0J1mnrPTj1JTKnlK5rqjJ6l1J5oJ9k5J4rJ1mJ0k5L0l5
11.14973a7K6lnLL2o1N8l5L0k6LqLJ3k8K6j1J3k1Lj7J5LJ6j2njMj4K4jqJP%j8K2j1%
11.12989@%Tj2J7k6K9j0M%Omj8J9jlmnK4k0J5j4mJJ4J0j4MJj3nJ1JJ9j8qPj1J2j1lQ
11.10903bkJ6jj7lJ8Kj2J3jj0qQMpJ1k1K2j1JMnJ3j0rPjJ6j9P%Lj0MK0m3L0oLoj0rM1
11.08716B0k8LmJ9j7LKPlOk%jJ3jl4K6k4L7j2J2j1j4nLKnJ3jj5OJjlJ8j0Qok0L3k8P
11.06579fnM0k9J3j6LmJ2Nj8j4J7j0J9j7L2m4L8k5K4j5J9j4lNk2J8nj3ONjpTJ1J5kj6
11.04646a1J8j0K0k6J4pK8m0oL0j0j2KQKLmOnLlkokK3J2k3OJMj2rkJ0K1k5Mj1Jj2K3
$$ y = [9, -11, -5, 4, 13, -12, 6, -5, -6, 11, -18, 7, -8, -4, 25, 7, 14, 1, 0, 0, 10, 0, 2, 10, 8, 7, 11, -11, 5, -10, 7, 0, 6, 26, 8, 1, -7, -16, 0, -8, 1, 0, 19, -21, 21, -18, 14, 1, 5, 5, 0, -16, 4, 15, 11, 6, -3, 4, 11, 0, 1, 2, 4, -1, -4, 21, 12, 4, 3, 19, -12, 3, -3, 16, -9, 5, -4, 7, 3, 13, -12, 18, -17, 9, 6, 1, 4, 36, -25, 33, -2, 28, 2, 5, -3, 0, 13, -15, 11, 0, 13, -8, -5, -22, -7, -4, 12, 0, -5, -6, -2, -16, 8, 7, -1, 0, 7, 7, -11, 11, 0, 0, 0, 0, -12, 5, -21, 8, -2, 2, 2, 8, 4, -14, 5, 4, 1, -3, -8, 16, -4, 11, -3, -7, -6, 8, 18, 4, 8, 9, -4, -9, 2, 3, 22, 4, -4, 3, -8, 4, -7, -10, -2, -4, 12, 11, -6, -9, 9, 11, -1, 12, 11, 1, -7, 1, 5, -2, 9, -12, 10, -1, 0, 4, -1, 12, 2, -7, 0, -1, 15, -4, 3, 3, 6, -4, 0, 20, -23, 7, 1, 4, -2, -12, -21, 20, -8, -5, -9, 10, -7, -4, -2, 5, 2, 8, 6, 6, 5, 18, 17, -17, 9, -15, 22, 10, 22, 11, -3, -8, -5, -3, -8, 5, 4, -11, -5, -4, -5, -8, 10, 0, 8, 2, -18, 15, -13, -6, -11, 29, 0, 13, -3, 0, -4, 8, 13, -5, -19, -2, -12, 7, -10, 22, -22, 16, -9, 15, 0, 19, 5, 2, 7, -15, 3, -2, -15, -9, -4, -5, -12, -19, -8, 7, 5, -11, 7, -3, 17, -9, 5, -2, 26, -14, -20, 10, 0, -12, -10, -2, 0, 3, -1, 5, 0, 3, 0, -2, -8, -10, 13, 25, 2, 8, 9, 13, 1, -8, -10, 0, 21, -4, 0, -11, -10, -22, 1]
11.02561Ak6L5Nl6K5J5k7LNQjj7J2j2QRk0nRTj4L2j9%KJ9l6K8k1KJ0KJ7k3J0j1nK4l9
11.00577b2L4m0M1j2mJ7j7NloJ0pJ4%j8J9j0J2k3mML3l4J3j2K5l7J7kK0LmJ0k4j0OJ5
10.98694Ij1J6Ql0J2Lj8J5Mk1K8j2KJ7k3K1j7jMnJ2j7J2k4J5j1K4j3KJ8Om0J8K%lpJ4
10.96761IMj6Oj5K4k1k3M6pj5mkJ1j2RKTkJ2j9pL7k8J8jj4J5j9J5J0j7qK3l3K3J1Kl8
10.94828b2K4J3j9MnMK3k3Nj2K9j3J9k7joK1Pl4L6k1Pk9J6MNJ8jk2mlkK7j2koJmJ0L
10.92793Hj4j0M8l2MrkJ4j3J8j6J9j0nRj3QoJ5k7K3pLj5L0j7JnJ6nj6KoK1pj2J3j8K3
10.90809A0j1J0j5K2k0J1lnJ7l5K5rmKMK3j5oJ4j2OQj8PmnKJ1j5K4kj8j7L7m1J9J6j3
10.88876@Qk6K2mjJ7k7NK0qk6K6j4Rj9J6Kj1K7k7LJ7mjj1J1j5J0nL0k8J7j5jLJ2j2q
$$ y = [1, -25, 10, 15, -21, 4, 19, -8, -5, 0, 8, 7, -10, 2, -10, -2, 7, -13, -18, -9, 0, -14, 18, -1, -1, 1, 20, -16, 12, -9, -7, 3, 5, 22, -1, 9, -2, -7, 17, -22, 12, -28, 13, 1, -3, 14, -3, 2, -1, -7, 3, -4, 10, 10, -8, 11, 1, 13, -10, -14, -10, 23, -11, 2, -10, 15, -22, -5, -7, 13, 16, 12, 22, -2, -12, -6, 9, -2, 14, 22, -8, 4, 7, -11, 4, 8, -13, 15, 3, 5, 22, -1, 20, 3, 2, 6, 1, 13, -4, 8, -16, -1, -12, 12, -1, 1, 19, 25, -15, 3, 5, 5, 2, -5, 9, 13, -3, 3, -12, 12, -9, -32, 14, 7, -8, -12, -14, -3, -15, -6, -4, -2, -4, 8, -11, -18, 19, -9, 9, 8, -6, 9, -10, 5, 15, -2, -10, 13, -20, 3, 14, 16, -22, 2, 15, -4, 0, -5, -1, 22, -1, 4, -8, 21, 8, 27, 0, -1, -7, 14, 21, -13, 23, 2, 9, -20, -4, 0, 5, 23, 22, 0, -4, -7, -9, 18, 6, 4, -2, -1, -5, 5, 8, -6, -16, 32, 0, 4, -5, -7, 7, -6, 12, -4, 15, 5, 0, 9, -4, 4, -2, 13, -14, 9, 2, 5, -10, 20, 3, 4, -1, 15, 10, -6, -4, -10, 11, 4, -8, 5, -13, 10, -1, 9, -6, 16, -4, 7, 4, -1, 16, -19, 6, -3, -7, -5, -1, 22, 7, 1, 15, 3, 9, 17, -1, 6, 2, -3, -1, 10, -5, 19, 17, -1, -18, 19, -22, -3, 13, 0, 8, -18, 4, 0, -1, 16, -11, -6, 14, 6, -20, 6, -8, 1, -18, -2, 0, -11, 16, -11, -8, 9, 5, 4, -7, 4, -11, -1, -6, 24, -4, 13, -2, -3, 0, 12, 0, -8]
10.86943hJ8mk3ML1%Jk8J0jLkJ1Jkj9qK4qK7k7nLK2%l4NJ2LJ5j7j9J3qJ1J4j7QoQpj2
10.84806a1J1J9k4OnLmnJ4j9K9j6J2%kj1K6k6MnRJTLj1j3K4j0J5k3J1k2J7mJ9j1jJ0
10.82873A1j3K5k1lKlJTJ2j3J0oRj2J1j1%OoJLJ1j5J5rKj1J2Jj5LJTJ4lMk5LJ0nJJ6
10.80737A5l7K5%TRk0QpJ2j0NP%k4J7K7kk6Mj2K6oqmjKJ3k3J4PkjpKk4L5j0TOJ4j9J4
10.78600I%qMj1J2k4K6l2L6j4KJ3k2%Lj0K5j0Qj6oOPnJ6j0mJ2MTk5J0MPj4pPj0J8nJ3
10.76514A3nMk1J8%j8J7j5RK0k6lJ4kqK4k5jJ2J5j9LRj4mPmrJ0KmPj5L5j6Jk6K5Kj2
10.74480@JK%j2K3k7J5lmNOj5L4k2j5QPk0K7j1pJ2j3RqJ4o%j0L0j6l0M8k3Rj1Mj2NJ3
10.72445GjmOqLj2J0j6J7NKNk8K0J0j0j7K4k7L0k1QOoTpL5m3L6l6M7k9Kj3KJ4Jj8L0
$$ y = [-8, 10, 6, -17, -13, 18, 18, 19, -9, 1, 0, 3, 1, 12, 13, 11, -8, -16, 8, 0, 27, 0, -5, -2, 20, 20, -14, -9, 3, 6, 21, 4, -15, -2, -10, 1, 15, -2, 6, 0, 8, 1, -11, 0, 19, -5, 1, -4, -1, -5, -10, 4, -15, 14, -2, 10, 10, 8, -3, 23, -3, 1, -4, 5, 6, 7, 10, -1, -14, 10, 0, 15, -8, 3, -19, -2, -6, 13, 2, 1, 11, -2, 23, 2, -1, 1, -2, -1, 0, 12, -1, 9, 3, 12, 0, 11, 0, 0, 6, 0, 1, 4, 15, 0, 15, 6, 8, -3, 9, 10, -5, -2, -1, 0, 14, 11, 15, -10, -7, 3, -2, -1, 15, -22, 3, 3, 3, 12, -8, 0, -7, 5, -5, 0, 7, 7, -17, 0, 27, 25, -1, 3, -9, 17, 11, 3, -1, -2, 0, 13, -10, 4, 11, 9, 8, 1, 3, -21, 14, 4, -6, 0, 14, -5, 9, 9, 1, 5, -6, 6, -18, 8, -24, 12, -2, 0, 13, -9, -9, -6, -16, 9, -1, 7, -9, -15, -9, -2, -7, 9, -1, -5, 7, 11, 15, -10, 0, 4, 11, -3, -10, -3, -13, 5, 0, 13, 8, 12, -9, 9, 9, -9, 8, -7, 2, 22, -4, -7, 7, 5, -3, 21, -4, -5, 7, 22, 3, 6, 15, 1, -3, 4, 0, -9, 1, 3, -1, 6, -9, 26, 10, 11, -15, 10, 12, 0, 1, 3, 3, -9, 14, -13, 2, -1, -5, 0, 6, -9, 25, 3, -12, -4, 3, -17, 10, -1, -8, 4, -9, 0, -8, 6, 0, 0, -10, 20, 4, -26, 22, -1, 8, -3, 1, -11, -6, 7, 6, 2, 8, 0, 3, -9, 1, -15, 2, 7, 9, 14, -14, 6, 16, 6, -11, 13, -14, 16, -5, 3, 9, 3, -3, -10, 25, -18, 18, -18, 29, 0, 2, -11, -9, 5, 6, -12, 18]
10.70461A8j1kKj1J8j1Q%lqJ5k8J7j4K5pj4qJ6mKJ6j6K3l4J7j9L2lj1J8j7Llrj1Qj4
10.68528b0MJ5j2L0k2L7m2K3k4K1k1K2%l5K0kOJ4J1k5J9k4jRk0J8nK1rkLj7RnMJ4k6
10.66645a2K3j2J2j4j8L2j3qnJ6mOj6J2mMK5m2J6j6J6KPj0LkpK8k6J0NMl1K8rRk1L3
10.64712B1j6J2j6J2j7J0Nj1nPRk1qK3n%j6J2j0PJ6K4l9rJ8j3K6J0j9k2K0Qj1qK6j6
10.62881Dj4J2J8l0J2kPj2Rj1pK2rj3OJ6j3ML0j5j1lmJ4K5k7mK3k5j0J5pOmK1m0K3j6
10.60948a0JPK2k7QpJ4j8J4j1K3Koj3qK1nl0KK2k%MKnjMlK6m6M9k9rJ5%oMkK1j6TJ0
10.58811AJ2J1k7QJ4j7j4J8qlQJjj4lJ3LQk3J8rROj4NqJ1j5J0nJ4k0J0J2mjMj2K6l4
10.56776a0K7j6J0j4J5lj2LRJNj8J3j2J5j6J3k6J2jpK4k0jRJ4j3OpkJ4j7oMJ8j1Mj0
$$ y = [18, 7, 5, 7, -4, 14, 3, 11, 11, 8, 0, 15, -13, 4, -10, 15, 8, -6, -14, 2, -2, 0, 16, 0, 23, -11, 6, -13, 19, 16, 5, 23, 6, 9, 6, -3, -14, -6, -20, -16, -1, -13, 17, -5, 32, -10, 13, -11, 10, -11, 11, 11, -24, -4, -6, 0, 14, 25, 0, 19, -5, -6, 3, -17, 1, -4, 17, 8, 6, 9, -8, 1, -4, 0, 14, -12, 11, -1, 11, -3, -21, 11, -2, -10, -15, 1, -3, 3, -13, -1, -5, -1, 24, -18, -2, -18, -2, 0, 7, -3, 0, -2, -9, 19, -7, 3, 8, 12, -19, 9, 0, 9, -12, 21, 5, 17, 1, 13, -4, 6, 11, 0, -5, 2, 11, -10, -18, 5, 0, 0, -16, -4, -14, -7, 9, 33, -6, -15, 3, -10, 16, 26, 7, -15, 5, 13, 2, -6, 20, 4, -10, 2, 20, -10, 2, 0, 7, -5, 4, -7, -14, 8, -1, -14, -8, 8, -5, -1, 29, 14, 3, 0, -4, 10, 35, 8, 4, 27, 2, -8, 7, 0, 6, 2, 23, -17, 6, -10, -9, -2, 20, -7, 1, -6, 8, -10, 4, -7, 16, 18, 12, -1, -9, 12, 7, -23, -21, 1, -1, -1, 3, 5, 0, -1, 3, 0, 26, -20, 29, 0, -9, 6, 6, 0, 4, 2, 23, 7, -9, 1, 13, 24, -3, 5, 19, 2, -12, 6, -2, -5, 3, 4, 3, -11, -14, -1, 2, 10, -13, 5, -4, 5, 11, -3, 2, -6, 5, -10, 0, -5, 9, -11, -1, 11, 7, 6, 10, -2, 24, -10, 17, 1, 11, -3, 12, 9, -3, 0, 9, 10, 15, -3, 10, -2, 13, -3, 10, -16, -4, -5, -12, 12, -8, -9, 0, 14, 1, 7, 0, -2, 12, -5, -11, -7, 11, 0, 4, -6]
10.54843flNK1k4K6k5ORj1J0k1K5m3L4j3RK0m7J9J2j5J1MrJJ9Pk9K5j7J1j4rJ4NmTO
10.52910E%J7k1J5j3j0jL%PMj1J0j4QknJ6oNk0K2kTj4KLJ4k7J2ROKkj2OnPqjTJ2lMp
10.50621BJ5j0l3K9j4K1jj0q%K4lqj5K2rLj2mkK5kj8J4Mpj5K2prJ2j3Rj0QJ1j2rOj9
10.48586b3M2l7RNJ8pmOkoORok1jL1opMj8J3JMj0K1m1L3m5M4j4K2j5kJ6k5OMNJ2J4l4
10.46500AJ2j8PkTKRj5J5j2J2r%K4qJk4J3j2Lj0K4k7K0PrNj0J6Kj2Nmj5K4oKpnj2K1
10.44415FqJ2k2L6l1LMk4L1k0J5oRomj7K2oJJ8qPk4K4j3mJ0%TJ5j9qJ1k0K3j8K0j5J9
10.42431A3nmJ5k5J2J%j6QqJ2J0j8KJ2pJ4k9NkNj8K8nQqj0K4j5qJ1jNk2J7nLJ0j7J1
10.40396Cj0PljK8j1j9MlkJ5okj0j4M4j6pJ4J7j4jMk3NJ3%k1njKOKLlj0K3l1N2m3J8
$$ y = [-6, -9, -4, 17, -7, 19, -6, 0, 9, -2, 8, -13, 12, -31, 3, -10, -1, 19, -28, -9, 3, -12, -1, 3, -6, -5, 14, 21, -8, 17, 0, 11, -3, -12, 2, 7, 3, -1, 5, 5, 22, 1, 16, 3, -7, -8, -5, -5, 2, 6, -5, 5, -9, -1, -3, -8, 8, 2, 7, -13, 9, 7, 5, -9, -7, -4, 10, -17, -5, 4, 10, 12, 10, -2, 4, -1, 6, -2, -3, -4, 8, 5, 9, 2, 17, 7, -26, 3, -11, 10, 9, -1, -9, -9, 15, 12, 4, -11, 11, 2, 5, -7, -11, -13, 12, 10, -8, 6, 10, 3, -12, 10, 3, -6, 6, -7, 2, -8, 0, 11, -1, -10, -4, -23, 19, -18, -9, -4, 14, 7, 3, 9, 7, 1, 7, 16, 10, -11, -12, 19, 13, 6, 10, -8, 5, 6, 10, 0, 21, -20, 13, -32, 12, -2, 20, 5, 3, 19, -6, 0, 4, 9, 21, 35, 1, 13, -5, 2, 0, -2, 0, 9, -6, 9, -3, 9, 0, 0, 24, 16, 17, -7, 6, -6, -3, -13, 11, -16, 4, 11, 2, 7, -3, 13, 15, 3, 8, 4, -11, 13, 7, 9, 2, -3, -15, 6, -2, 10, -12, 24, -7, -4, 0, -24, 7, -13, 2, -4, 5, -1, -5, -22, 0, -6, -5, 13, 5, 12, -12, 12, -1, -5, 5, 5, 5, 20, 1, -7, 4, -16, 7, -11, 9, -6, 13, 8, 4, 19, -6, 6, 7, 7, -9, -1, -9, 3, 13, -5, -3, 9, 2, 16, -13, -8, -10, -5, -23, 5, 0, 8, 0, -10, 14, -1, -9, 2, 1, 6, -16, 1, -4, -1, 9, -8, 3, -7, 0, -3, -4, 24, 13, -6, -2, -5, -7, 8, 2, 0, -10, -24, 20, 4, -3, 11, 28, 14, 13, 17, -6, -1, 12, 12, -9, -14, -15, -13, -7, -5, -2, -5, -15, 8, -23, 29, -14, 4]
10.38310Dj3K5j6kj5RJ5kMk3J9J5qJ0k2j1K2J6k9kj0K5mKJ1k6j5OK4j9J3j8J5K2m0J9
10.36479AkJ0j8rjJ1LPqJ6j5NJ1j3jK2kk4jTK2j5jLjnNQnj2J9oL%qj8K3k5L1rKJ6rJ7
10.34240B6k4Mj1jLJj6K1j3K3k0J1JrJ7j9K0Lj3J3j8kJ4j0Pj0J3k4M8k6j2rNJ4Lj2k1
10.32358b3K7J1j0j2KTrJ0KJ4qMnj0NrK1j2%nK0k5Rk6K7Mj1LjJ7l2K0mJ6qJ1k1MjOo
10.30272cJ8j6j0j5M5k4RMj6LlQJ6j9KRj5KmK2j3%kJ1j8JNj9K8l7L8j0NOpkmK%NJkL
10.28085DlqnRrJ4kKOj2J6k1PoL5k8rqJ2J4j2K1k6oJ2%j1PJ6K2l3j3K4j6kNnK2rj0J4
10.25999Hj5J1k2M0m0J1%J3k1J1K3Pj6Mj4jqJ3mJ2k1J2j4kJ3Nj1J2jmrRj1J6j2K6j6
10.24117DRk3J1oK6k3j4J4kONj4PJ3k3L6k4Nj2k%L5j6j3J5Jl1K0mkpJRONj9PQj3J0r
$$ y = [4, -9, 16, 0, -2, -17, -8, 7, 5, 9, -14, 5, 20, 12, 22, 0, -11, 11, 27, -2, -4, -14, 11, 7, 9, 20, -6, -21, -15, 9, -10, 3, -15, 0, 22, -18, 1, -1, 9, -9, -18, -19, -8, -5, 2, -6, 10, -5, 0, 11, -2, -3, 19, 17, -7, -8, -9, 13, -2, -3, 0, -1, -6, -1, 7, 2, -10, 9, 3, 6, 6, -2, -20, 3, -22, 9, 0, 2, 18, 9, 26, 2, 6, -5, -6, -3, -2, -18, 3, -10, 13, -7, 4, 5, -4, 13, -6, 14, 17, 4, 17, -1, -3, 11, 1, 8, -2, 11, -13, 35, 9, -3, -12, -7, 7, 10, -2, -23, 4, 15, 5, -7, -5, -3, -12, -2, 0, 14, 6, 10, 5, -5, 0, -9, 12, 0, 0, -5, 15, -10, -1, -27, 0, 4, -7, -4, -5, 12, -20, 0, -4, 12, 4, 15, -6, -2, -3, 3, -3, 15, -1, -11, -26, 19, -5, 4, 8, -8, -5, -8, 0, 16, -3, -1, 8, -7, -5, -9, 13, 0, 0, -2, 9, -9, -8, -3, -22, 6, -31, 7, -3, 2, 8, 1, -1, -5, -3, -3, 2, 3, 1, 4, 1, -7, -12, -3, -12, 2, 0, 2, 8, -4, 12, -9, -2, -8, 27, -1, -10, -18, -6, 8, -4, 17, -9, -15, -3, -3, -14, -7, 9, 31, -2, -15, 9, -7, -9, -4, -9, 13, 4, -6, 8, -7, 4, -18, 22, -18, -7, -7, 6, -15, -4, 19, 26, 10, 14, 0, -1, -9, 4, 0, 12, -9, 3, -11, -13, 0, 5, -6, 6, 5, 1, -8, 1, -10, 6, -6, 20, 4, 13, -10, 1, -5, 21, -2, -16, -2, -4, 2, 7, -7, 0, 13, -10, 26, 2, 7, -5, -7, -7, 28, 12, -1, 14, 15, -16, 4, 0, -2, -9, -8, 1, 7, 12, -7, 0, 8, -5, 5, -4]
10.22031dMTJmnRj3QMj3LKRL8l4j8L6j5j9NJ9k6J8nonJ2Jj1J3mj8K3j8K0j9PpLJ0jJ2
10.19895A6j6j7J4J9l8K6J1Mj5lQl4N0m2L2k0K4k1Pj7JNRMk1J8m%Nj3RJkk9K4QTrOk
10.17860FpJnJj4K4P%j6J4l6J5MjMqNPJ1n%k3J6nJ1jk8N2j9noJj4L%K3jj3rK4j2lTK
10.15621cPj3PqK4l4L2k4K4j2J7m2K5k2J6J3j4K1nOqnJ5j2mlK3k0NKqRJj5PpRj7K9m
10.13587A2lMj6Rj5K1J5k5J5rKrK8l5J8k7PLPj9K6j6rJK4qJ0j1j3J6oK8j7mOok0K2p
10.11603aoRQj6J1%noOJ4j4%J7k6RJ4j2%j9J0j7MJ1oL6k1K3rNk5J1KoLlJ2k1Qk1L2k9
10.09517a8K3k3L6j0TjKj4L1oNk0K1k2K1l9J9MJJ5k2K9prj8J6j9J5J2j3qRNkrJ0j8J8
10.07584Dj8L5k2J5k8K9mLpKj3NkmJ0j7PJ6Jk0LRoOjqR%k2K7j0J1J0j9TL9m2L3kk3Q
$$ y = [-4, 0, 4, 5, 1, -4, 5, -8, 0, 4, -9, -6, -4, 5, 43, 9, -9, 27, 12, -7, -2, 17, -9, 9, 4, -2, -7, 5, 6, -5, 8, 4, -14, 9, -9, 11, -8, -1, -8, -5, 5, 4, 16, 0, -17, -3, 16, -22, 4, 15, 19, 4, 1, 9, -25, 25, -17, 15, -5, 19, -2, 5, -12, -11, -6, 3, 7, -14, 4, 0, 0, 5, -8, 1, 2, 0, -29, -5, 3, 11, 2, 8, 6, -1, 0, -5, -4, -18, 6, 13, 13, -3, 11, -25, -10, -6, -7, -3, -11, -6, 1, 12, 7, 7, -16, 0, -5, 6, 5, -23, 29, 10, 5, -1, 0, -14, -11, -11, 12, 11, -2, -11, 13, 1, -2, -5, -3, 4, -9, -2, -10, 14, -20, 12, -12, 12, 0, 17, -25, 0, -22, -6, 7, -7, 14, 9, 15, 7, 2, 17, 5, 1, -2, 21, 1, 6, 8, 0, 9, 10, -5, 2, -5, 4, -13, 16, 12, 9, 13, -3, 6, -9, 12, 27, 2, 17, 8, 10, 1, 29, -6, 12, -15, -8, -5, 2, -17, 9, -7, -16, -15, 9, 1, 11, 0, -13, 3, -3, 25, 8, 4, 10, 4, -16, 6, -1, -7, 2, 10, -6, 5, 5, 0, -6, 0, 14, 0, 0, 17, -9, 0, 14, 2, 2, -17, -7, -24, -20, -9, -15, 21, 0, 23, 14, 19, -6, 5, 7, 1, 4, 1, 13, -8, 0, -21, 11, -18, 5, -18, 18, 8, -2, -3, -1, -15, 16, 10, 15, -5, 16, -6, 15, -24, -5, -1, 0, 15, -7, 22, 15, 6, -12, 4, -15, 0, 12, -1, -9, 0, 5, 3, -6, 4, -14, 4, -14, 21, -1, 14, -14, 15, 11, 14, 7, 9, -4, 1, -1, -5, 5, -12, -5, 11, 12, -8, -5, 4, -2, 4, 3, -5, 4, 4, -18, 9, -1, 10, 20, 1, -18, 21, -21, 12, 10, -13, -5]
10.05498eQpRrjJ2rQk3J0LK7lj0j3Qnj9L1rkJ4j8LJ0oJqJ2pJTj0p%LJJ9mKk9K6qmkJ1
10.03158BRj0Lj0J9j3qK1j6N%kKJRj8OpK1l4L0m0L1JmlNqJ2KoTj6K9j0Q%J8l0K6j9p
10.01021gOrpmJ3TlmJ1kNrkJ0k0J3LmJJ5k7K3j7mkJ0kJ3kj4J2j0J2k0J2Ok0K0Pnk3j
9.98885a3QPj3L9j4j7J4Kq%oPj0K1k8L2k7JRnJk0RQLTMl2K7pJ7j5K6j1j9J2j1QkRj1
9.96799bJ6k5K6kk9K1NmPj8J0Ooj6J0oK8k6Oj3J2J9k3J6qlTK1k5K4ml%Pk6MnJ3j7J4
9.94764AmoLlK8m2K8o%Rj1J8m1K0J6opjNqoM1n1J8RrLj1J8j3OJ9l0Rj2QqK4pLKj9J0
9.92577cLJ9j9J3oj0jj4L3k2qK8pqJ8j8LMrqLOnlrN0j2l1J8K0k7Qoj3K2Qj5qk2L0Oj8
9.90440a0NJ4j1KK1m9M0k1Rj7L5k4K7j2k5K4k9K9Mlj8J8oj4%L9j1m2K3J2Kj5J5k1K6
$$ y = [-5, 3, -4, 5, -4, -5, 7, -2, 6, -17, -7, -4, 23, 20, 10, -3, 5, 0, -19, 12, 3, 1, 15, -3, 0, 10, 4, 5, -3, 9, 2, 3, 4, -6, -13, -13, -10, -9, 10, 6, 8, -21, 5, -3, -7, -9, 2, 11, 1, 4, -6, 13, 0, -8, 13, -3, 2, 2, 0, 2, 3, 12, -6, 0, -7, 14, -20, 10, -30, 1, 2, -2, -5, 0, -8, 4, 6, 0, -6, -22, 7, -3, 5, 5, 23, -7, 19, 0, -7, -1, -10, -17, -21, -8, 5, 2, -2, 9, 7, 12, 3, 1, 11, -9, 4, 7, 3, 4, 19, -8, 15, -2, -6, -8, 2, 0, 13, 11, -3, 9, -1, 11, -9, 3, 9, -11, 9, 16, 11, -12, -13, -5, 2, -11, 28, 14, -3, 11, 13, 5, 5, -1, 6, -4, 17, -11, 21, -6, -5, 4, -1, 0, -20, -11, -3, 0, 3, 7, -25, 2, -5, 12, -3, 23, 12, -7, 5, -6, 2, 0, 9, -2, 14, -11, 15, 13, -16, 5, 10, 6, 13, -5, 5, 11, 5, -11, -1, -7, 21, -5, 1, -12, 0, 19, -4, 12, 4, 1, -2, 19, -6, 18, 14, 11, 11, 18, -8, -4, -9, 4, -13, 1, -3, -9, -6, -9, 19, -23, 5, -1, -1, 8, -3, 15, -26, -6, 10, 4, -3, -4, 1, -7, -13, 28, -23, -5, 4, -5, -2, -13, 5, -8, -2, 17, -13, -4, -16, -8, -16, 8, 1, 4, 6, -13, -3, 0, 19, 0, 13, 7, -3, -4, -18, 15, -7, -15, 13, 6, -2, 16, -2, 1, 5, -4, -12, -9, -3, -8, -11, -20, 30, 18, -13, 5, 25, -2, 6, 0, -13, 9, 17, 2, -6, -28, 2, 8, -10, -5, 9, -2, 0, 21, -28, 12, -9, 0, -17, 18, -6, 21, 9, -16, 8, -21, 8, 12, 9, -9, 9, 3, -11, -11, 28, 17, -25, -2, 10, 12, -3, 12, -9, 17]
9.88660A7k3J1rJ4k2K2%Lj3j8PJ8J1nj3Nj8J2JRk2J4jJ0m0M4j2MpRk5L7j5Jj7J7Nl1
9.86727b0J7oRj3L7k7K2j5Rk3L0k2OJ2j9KToj1J9J6j9J3%j3JJ6j8j2K5MnkoNkj0K2l5
9.84743a7K1j6K7j2QmPj5%J4oLj2O%jK1k1jlOnToK7m0L3Qj4Lj3J4pqNJ5k7J0JQmMJ3
9.82555A7Nk1qJ9j5RJlJj3K1qJ7j7mj5J2lOJ4k1J8K%j1nj3RQpKlnMK2l7L8j7j4Rj6J9
9.80419c%j5K2K0k0mJKmJ2j3K3l2KK1%Jj5J3k3M2l5j6K0jj0J3k2J8OJ2rJ3k1kmJ0Ml
9.78435Cj5Q%PKqNJ2oPk2MQk9K8j3L0l4J3JMj6J1k4K3PTomlJ6j7Nk1L8m0K7njJm%LM
9.76196FpJ2j7J4%rNj1L1l3J1jQj8K3j9N%j3L6oj7j4J1oJ6k4L4l1K3J5Ll1Lm%Rj8j5
9.74212b9L7k3J0J1Ok0J5rJ0Mj2lnJ0KmKJ1ok3J9nK2k9OL%JPMmj2pK0j1j0J3%QqjNQ
$$ y = [17, -6, 5, -4, 10, -12, 10, 10, 13, 0, -18, -11, 7, 18, 13, 0, 5, -13, -1, 0, 9, -13, 1, 0, 10, -30, 14, 2, 6, -1, 8, -17, 20, 5, 6, -11, 6, 11, -20, -3, -9, 0, -13, 24, -3, 19, 4, 13, -10, 20, -2, 4, 16, -3, -1, 1, -5, -16, 3, 19, 0, 13, 13, 0, 1, 17, -1, -13, 12, 16, 11, 9, 3, 8, 6, -4, 18, -17, 4, -12, 15, 3, 11, 7, 14, -1, -1, 13, 7, 10, -2, 4, 4, 3, 24, 3, 2, -1, 5, 0, -5, -11, 16, -24, 9, 17, 3, 6, -7, 7, 0, -8, -3, 12, -15, -5, -4, 4, 0, 4, 17, 22, 1, -7, 12, -3, 6, 7, 4, 5, -8, 13, 5, 22, 5, 1, -14, -2, -5, 1, 15, -6, 12, 14, 14, 3, -2, -15, -6, 2, -5, -3, -6, -11, -7, 15, -22, 16, -1, -15, -6, -22, -3, -3, -18, 4, 24, 4, 0, 1, 3, -1, 11, -2, 21, -11, -9, 12, 12, 13, -2, 11, -12, 30, -5, -21, -1, -2, -12, 1, -21, -3, 3, 15, 6, 19, -2, -4, -8, 2, 6, 3, -12, -4, -4, 3, 5, -3, 2, 14, 8, 15, -7, -3, 5, -24, 4, -9, 21, -13, 0, 1, 5, -11, 0, -24, -1, 6, 13, 7, 3, 0, 16, -1, 4, -17, 21, -19, 8, 3, 2, 3, -1, -1, 2, 6, -1, 11, -6, 8, 8, -1, 4, -7, 24, -9, 2, 1, 9, -9, 14, -5, 0, 0, -13, 23, 17, 0, -14, -3, -9, 7, -17, 17, -14, 9, 24, 27, -4, -1, -5, -5, 4, -14, -29, 8, -15, -5, 6, 12, -8, 7, -2, 8, 12, 0, -3, -8, 2, 4, 0, 2, 13, 7, -16, 3, -2, 20, -9, -3, 0, 0, 1, 8, 12, 8, -4, -11, 9, -2, -12, 1, 1, 9, 1, 0, 5, 13]
9.72025A3j0JlQj6J7j9J4j1RTj2KTj1P%J7j7j4JJ7j0OnJ1j0MNJ9k4LoJ1j5J6nPrj8K3
9.69939GpRMJj3Qoj0J0j9K1qJ4j3j8K0j1L0l8K0nK2k7jJ3j2R%j7K9j2K2j5J2m1J6j1
9.68057a7M2l3K2j8J0k9L5k1J1j7ORJ0j7K8k7J5lJKj3oLJ1jnj9L1k4J7j2J1Nk3K0Po
9.66175Ej3L4l0pj3L4j7Rj1L2k4Mk3K1jK2l0K0j2nlJ8Rj9MTKopNrK2k3K7j5mRrLkTJ3
9.64038A2%mj2Lj9J3OJ4j3oJ1jj1Rlj0OQjnmj4K8mj0J3kqrK8rok0K0PMrk8J5j3RJ1k5
9.61851b9N5k7Ok8M1l6K5nkj3LQpnJ4%nJj7LTQL1l0mj4K7oQk6L4k6J3PkLj2J8j5M%k
9.59714Ak7J5R%lKJ2j7J4j1K7k1j0J3rkj1%lK2rJ2j6L5m6K7j1KQnj3K4j4j9L2j5J0M
9.57781GmrJ4j4Lj1nK5pjJ7j5PpqL2m1L9k8J3pk1K6lKm%J0j8QNoK9m1K9k6J5pPj9K2
$$ y = [13, 3, 4, 1, 9, -7, 10, -9, 5, -6, 3, 12, 0, 2, 4, -7, 0, 0, 17, 0, -14, -13, 4, -6, 0, -5, 6, -4, 0, 5, 24, 0, 3, -3, 8, -7, 9, 4, 11, 2, -16, 7, 0, 9, 13, 14, 1, 9, 3, -7, 3, -16, 5, -3, 11, -2, -20, 0, -11, 19, -19, 1, -4, 18, -9, -10, 3, -9, 0, 0, -17, 12, 0, 22, 7, 19, -22, -6, -17, 25, -8, 14, -4, 6, -23, 12, -9, 2, -15, -9, 0, 10, -7, 21, -6, 9, 6, 7, 9, -4, -10, -7, 4, 3, -2, -21, 10, -14, 3, -9, 2, 7, -16, 4, 11, 5, -8, 26, -4, -11, -24, 10, -7, 2, -9, 23, -1, 3, -20, 1, 0, 22, -8, 12, 0, -5, -8, 10, 19, 0, 4, 8, 10, 4, -3, 2, -7, 15, -8, 19, 4, 0, 9, 0, 3, 1, -1, 12, 12, 8, -4, -1, -20, -7, -1, 13, 0, -6, 5, 4, -7, 2, -1, -11, -5, 3, 2, -3, -7, -21, 7, 3, -7, 6, 4, -4, -13, 15, 6, 0, -20, 0, 7, 11, 2, -26, -11, -24, -15, -4, -29, 26, -1, 5, -23, 18, -18, 7, 2, 0, -13, -10, -2, -9, -14, 0, 0, -5, -4, -21, -18, -15, -7, 24, -6, -10, -24, 3, -3, 5, -21, 13, -13, 0, 7, 5, 8, -4, 14, -1, 3, 3, 1, -26, -11, -2, -2, -5, -3, 9, -8, 6, -5, 22, 1, -9, 4, -5, -7, -18, -18, -21, 1, -8, 4, -12, 23, -23, 4, -7, -5, 3, -2, -15, 9, -5, -24, 8, -7, 3, 7, 3, -6, 8, -6, -3, -14, -19, 6, -1, -2, 15, 0, 7, 0, -8, 24, -17, 22, -6, 7, 0, -21, 5, 2, 4, 0, 0, 10, -8, 0, 5, -1, 28, -13, 16, -10, 5, -2, 5, -14, 8]
9.55695HJ4k0j2KJ2J3j7K2rpkonL2l0oOlLN%oKnJ7j1K0Pk2j2J4k6L5k5K6l8M3l2J8p
9.53660bJ1j0QJJ0j9Jlj1K5j5Ok1L2j6J2nJ3j0TK0j2Kk4J4OnJ2j7J0j9J8nmJ2j4NJ9
9.51727A5j5MPj6JJ5k3J2j9L6pj3rRJ%kj0L2mj9J4j0%j7J3LJ4pj1J0k6L5j0lJ1j7lL
9.49743fJ3k5K7k1J2j0J9j5nK0lqj7K4mNJrKj3J5j3J0qnL0rj6J9rPj3kj9L8j2J0j6K6
9.47759B0l0J0qJ4j7J9j4J4j0J2j7J9qj3J2QjJ8j3k9J9j0OpmJ8qlOj7K6k5K7jj0Ok5
9.45877a6RPNj6MpJ1LlkNLJ5rJ4m3L8k2lMJ1j4K1k3%MRJ1qlQk2J8pqOj1J0%j3J5pJ8
9.43689A2j9QNOJj3PRj2j8J4ONj5J1j0LRrNOj1j5QK4j7K5k5K6j7j3LJ2lj%Oj4Jnjj4
9.41553b0L1rj0J5j1K2pj2j3J4OqjJ5kpOlJ0j7Nj0J4Nj9Oj0Qj0Roj0J2kJ5oK3j6J2k9
$$ y = [8, 22, 2, -10, -8, 4, 17, 0, 22, 13, 6, 4, -2, -7, 25, -5, -11, -5, -8, -5, 0, 0, -6, -4, -9, 8, -3, 17, 24, 2, -10, 4, -22, 13, -12, 14, -24, 19, -13, 5, -2, 9, -1, 7, 8, 18, -1, 0, -3, -14, 11, -4, 2, -19, 13, -3, 9, 4, 17, 7, -3, 17, 5, 7, -17, -3, 3, -2, 10, -7, 3, -16, 2, -3, -7, 5, -9, -4, 15, 0, 4, 11, -5, -4, 11, -12, 0, -19, 17, 10, -3, -12, -3, -2, -2, -4, -14, 18, 14, -5, 9, -1, -1, -18, -5, -2, 12, 5, -6, 4, -22, 13, 3, 0, 11, -6, -9, -6, 7, -18, 9, -12, 0, -10, 9, -6, -11, 9, 6, -2, -19, 5, 1, 6, 7, -2, 0, -13, 2, -11, -1, -9, -14, 16, 7, -9, 10, 1, 8, -5, -7, -26, 12, 0, 10, -6, 20, -10, 0, -8, 6, -11, 8, -6, 8, -2, 10, -7, 12, 4, -9, 3, 11, 10, 28, 15, -14, 5, -5, 1, -6, -10, 8, 0, -3, 3, -14, 12, -13, 14, 13, 3, 9, -16, -7, 0, 5, -11, -7, -14, -3, 0, -3, -5, 0, 3, 18, 9, 23, -20, 18, -4, -7, -3, 8, -6, 15, -8, -8, -4, 5, 16, 8, 5, 13, -9, 9, 2, -6, 0, -11, -1, -1, -14, 1, -6, 12, -7, 1, 6, 12, 13, 0, 7, 16, 4, -14, 0, 6, 11, -4, 7, -3, 0, 9, 0, 5, 11, 0, -15, -7, 17, 0, 25, 0, 26, 9, -4, -1, 11, 8, 7, 7, 13, -1, 0, -5, -6, -20, 11, 2, -8, 7, -4, 18, 11, -1, -14, 0, 6, -2, -3, 12, 10, 3, 9, 6, 16, -1, 4, -6, 8, 13, -6, 0, -10, -2, -12, -3, -9, -19, -7, -9, 6, 0, 23, 7, 19, -10]
9.39518a0K1m0L9qTJ6j8J8m2M7m4M0j4J2j4PMj6K1j2J4j5Rk7L1k7J9j7K4qJ1l6K6Nj2
9.37738dJ1klJrJ9k2LJ2j6J0JJ2j2Oj4J3qL1m8J7Lj2RmJ4Oj4pjRk6L9k6L4j4Lj5nQN
9.35652DJ4j2Lqjq%Rj0K6j7kjJ9pNnJ%j2J4qk6L3%j8mL5j3mNmTj9L2j7JmnJJ3oj9L0
9.33413A1j0moJ8MKj0qj9J3K8mk1J2kJ6k1J5rlTjTlJ8j6olJ3Tl2J5MJ9k6KqL2qJ0k6
9.31328eJ4j1omL0L%k0J4j9K3m4M6k2L4l3J0k2J3lJ0j9K2jKl3K6jmj1J4lpJ2Mj7Kj2
9.29395a8J5lL3l2K0l1K1j0J9Qpj9Pj2mJ3%pPQjj4NlJ1oJ1j9OJ1nNj5lJ9j0jLp%J9q
9.27258Fj1jMJ9j7Nj7J4qoK0mrJ4lrK6k9Pj3L8k6j1nQ%RKkTJ4Qo%k9MJ8qJ1j8J2Qqm
9.25020APj7K3nj3TK9j2Rj4K8j9ljljJ8l9J8KJ2j4K9k0J4qp%J1j3qJ4J1mTrOj7L9j7
$$ y = [-10, 11, -29, 10, 2, -6, 10, -8, 10, -32, 15, -29, 11, -3, 9, -5, 2, 6, -10, 11, -1, 13, -2, 7, -20, 11, -16, 3, -14, 10, 2, 13, -23, 3, 8, -4, 7, 5, 2, 3, -6, 13, -9, -6, 6, -10, 0, 1, 13, 1, 7, -7, 6, -2, 29, -19, -2, 1, -11, -2, -6, 8, 14, 0, -7, -8, 1, -25, 14, -12, 22, 8, 11, -4, -9, -1, 4, 18, 6, 9, 1, 0, -8, -8, 1, -9, 17, 0, -2, -3, 16, 9, 14, 9, 10, 10, -2, 12, 4, -22, 11, 11, -7, -11, 24, 11, 7, 12, 8, 4, -15, 17, 0, 1, -3, -8, -7, 6, 0, -19, 11, 1, -3, -9, 9, 13, 15, 5, -3, -22, -9, 19, 15, -6, 6, 4, 20, -1, 14, 5, 2, -1, -2, -3, -6, 12, -4, -10, -13, 0, 13, -19, -4, 0, 19, -7, -5, -13, 19, 11, 21, -5, 9, -2, -8, -12, 18, 21, 21, 1, 15, -4, 19, -25, 21, -1, 33, 0, 10, -12, 1, -2, 8, -11, 11, 10, 12, -21, 5, 4, 0, -11, 3, 0, -7, 5, 9, -8, -6, -18, -3, -6, 27, -5, 15, -16, 5, -5, 14, 22, 15, -4, 3, -9, -13, 0, 0, -7, 0, 8, 7, -7, -2, -5, 6, 0, 11, -8, -2, 9, 4, 9, -6, -9, 10, 0, -1, 2, -5, -5, 14, 6, -5, -6, -2, 17, 0, 5, -12, 2, -6, -12, 8, 4, -5, 9, 6, -3, 23, -6, 1, -12, 26, 0, -11, -16, -8, -8, 1, 3, 1, -1, 13, 21, 15, 15, -14, -10, 8, 0, 11, -7, 5, 13, 5, 1, 8, -9, 14, 9, -4, -17, 12, 0, 9, -5, 23, 4, 1, 0, -3, -4, 14, -25, -7, -5, 7, -7, 22, 2, 16, 8, 1, 1, 12, -1, -9, 5, 16, 12, 8, -1, 5, -12, 27, 10]
9.22985A0j0%nNj0J1mKlJ9qJ4k4J6j1jj2J1Mj1mOpJ0OJ1k0J2pj3J0j1J7J2m2L2j4J1
9.21052Bk%jLKj3OJjj4L0k8J5RmnjJ9pj3J0j4K1l1L0k6J7mNl2K6J2jnoj2J2pJ3rj7K8
9.18915HoJ1plJj4K6k5J9j2lpJ5LrLrJ3qJ4Rj3M%qRjOj0roJ4j5J3k5K5%J2l4J6j0J8
9.16779ErJ0joPomOJ2pnj1J0lJ1k0J0rK3pljJ6kk6kJ8j6J0OQl2K2KlTk1KORJ2kjj6R
9.14489bRoJqMJ9rkjoJ6j8J7qoTpL3pj2jRj9JMJ1j7J1K1j9JrJ1Qj4mj0K0j5L5k8KMJ6
9.12251A9k6K3j7J2j7LJ2kk2mJ4jOJ8k7j1K5Lj0%pLJ0qKJ9Pk2PKl6L5j7K3k4J1oJ4k8
9.10267a7J2%J9j3LJ1j7MjLrNjoNJ0k2lJ0L1k6pK4pnkj0J7kJ6nk6J6j2K0l8L3K%j4J
9.08181aKj1J7k4J0QPqj1Q%KnJOj6J5LJJ0%j5j1J2JOqJ4nOnojnLRj3Mj6J0pJ5j6L4j6
$$ y = [10, 0, 0, -5, 0, -10, 1, -3, -1, -4, 15, 7, 21, -3, 13, 2, 1, -11, 0, 4, -7, -11, -5, -12, -2, 4, 15, -5, 7, 0, -13, -3, -14, 3, 15, -27, 5, -9, 2, 0, 0, -1, 2, 4, -9, -3, -2, -3, -17, 13, -15, 0, 9, 5, 0, -1, 18, 11, -2, 8, -6, 15, -16, 14, -12, 5, 1, 6, -26, 0, 12, 11, 6, 0, -12, 0, -7, 6, -3, -20, 8, 2, 13, 6, 3, 4, -10, 16, -9, 10, -2, -5, -12, 3, 6, -3, 0, -9, 4, -4, 10, 19, 6, 10, 10, 2, 11, 10, 16, 6, -3, -9, 5, -10, 3, -22, 3, 3, 15, -19, -3, -13, 5, -4, 6, 5, -1, 6, 0, -4, 2, 14, 7, 2, -9, 1, -2, 9, -11, -1, -10, 13, 6, 3, 2, 18, 16, -10, -12, 6, -10, 0, 6, 14, -18, 4, 6, 3, 0, -21, -19, -13, -4, 8, 6, 5, -11, -2, 7, 1, 2, -6, -2, 17, 8, 6, 5, -1, 15, -3, 14, 6, 0, -6, -13, 20, 13, 1, 0, 9, -10, -9, -5, 6, -11, 0, 21, 2, 3, -6, 5, 13, -1, -5, -15, 5, -10, 25, -3, -1, 3, 19, -7, 16, -1, 11, -6, -3, 9, 7, -15, -19, -5, -6, 0, 18, -9, -20, 5, 8, -2, -2, -9, -6, 4, -4, -2, 17, 24, 2, 9, 11, -25, 10, -7, 16, -8, 3, -3, 11, -17, -5, -5, 14, 1, 4, 15, -2, 2, 1, 4, -5, 0, -1, -7, -2, 8, -14, -17, -7, 24, -2, -9, 15, 8, 3, 1, -9, 8, 6, 22, 17, -9, 7, -5, 15, -23, 10, 12, 12, -2, -1, 1, -10, 7, -17, -7, 1, 8, 0, -11, -3, -3, -1, -6, -5, 1, -15, 0, 3, 4, 14, 14, -1, -12, 0, 1, 7, -1, 13, 8, 14, 9, 3, 2, -3, 0, 9, -4, 0, -16, -6, -13, 2, -14, 20, 4]
9.05892DpjK8k6RpJ5mTj5J7k7L4j2K8l1rK3j8j6L3j1Mj5QOrj6M5k3jOl0K7j7J6qOrM
9.03857cQJ7k7K3l0lJ2KK1j2j0KTNp%Oj3J3J5l7RJJ1j4Rj1K1qj0J7OrlTLJ1k0J5rLl
9.01721@K0rj0%OPrjJ2k7J1rJ6%Tj9L1j7TJ7PrJ1o%l%J0rj6J6kmJ1k5M5m4K5k1Jk0L3
8.99584BjMqlJ3KnNJ3l7L0k2LJ3rj3J2mJ0J5j5k2K0J1k1qK0pj4%K3k4lJ5K5k0jpnJ3
8.97549@oJ2Qk1K3rQj1kT%J5l1PJ9j0J%KnlJ1rJ1oK5k2nk9K8J0j3kJ6j3J5j4J2oj9K
8.95463a3K0j9LJ6j8K4oLk0J3JlPOj0j6J0LNj7J4ok2K2rJ6OPk8J5j4PNj4K5Krj1QTk1
8.93378a0J8j1NRkj6Pj9K1%j4K3j4PJ3j1kmkrJ6j9M6k6J2j8J7l6K8q%j5J4J3qj6K1n
8.91445E%mj2RK6k2oNJ2j5J0kj8J5j2L0k8J0lJ1mk3K1j2RTPqj4KJLqRj1K0mRk3J9j2
$$ y = [4, -3, -4, 24, -2, 7, 0, 15, 11, 7, -8, 9, -18, 16, 4, 32, 1, -8, 15, -3, -19, 14, 3, 7, -8, 0, 6, -3, -19, 26, 3, 2, 8, -22, 5, -12, 4, -4, 2, -7, -3, 5, 22, -5, 18, -12, -15, -3, -1, 20, 8, -2, 0, 2, 7, 0, 0, 6, -7, 6, 21, -16, -7, -6, 5, -9, 0, -11, 10, 2, -8, 9, 15, 6, 3, 0, 3, 14, -6, 9, 0, 3, 0, 20, 11, 1, 1, 7, 14, 5, 4, 16, -11, 0, -9, 7, 7, 7, -12, 19, 2, -15, 2, 9, 0, 11, 5, 5, 2, 2, 12, 3, -13, 3, 1, -3, 8, -17, 28, -16, 9, -12, -11, -31, 2, 1, 5, -3, -6, 7, 9, 4, 9, 22, -15, 15, -7, -4, 9, 0, -13, -1, -5, 5, 20, 5, -17, 3, 14, -7, -15, 5, -2, -16, -16, 7, -17, -20, -5, 20, 0, -1, -8, -13, 0, -6, 6, 14, -7, 16, 7, 15, 4, 2, 0, 0, 15, -16, -9, 10, 0, 1, 1, 3, -2, -5, 6, -3, 8, 2, 27, 5, 0, -29, -1, 9, -4, -6, 10, -3, 12, -2, 10, 4, -15, -13, 7, -12, -9, 7, -11, 13, 7, 10, -10, 3, 4, 1, 8, 14, 4, -12, -2, 1, 6, -11, 3, -3, -25, -3, -12, 4, 10, 17, -11, 4, -10, -3, 2, -12, 13, 15, 6, -5, 3, 11, -10, 8, -3, 2, 11, 9, -7, 0, -19, 2, 2, -12, 11, -3, 4, 17, 6, 4, 0, -2, -11, 5, -14, 32, 6, 18, 0, 17, -19, 9, 1, 1, -14, 0, 13, 5, -11, 10, 5, 5, 1, -11, -2, 24, 2, -4, 1, 13, -2, 8, 6, -12, 3, -9, 21, -7, 3, 0, 11, 7, -16, 5, -7, 2, 11, 18, 10, -4, -2, -1, 2, -6, 3, -8, 12, 8, 17, -6, 13, 1]
8.89359AL%j4%J0RnLj5PKK3k2k4J4J5pR%j1J1J0l0K4rLJnJ1Ll0J7lqJ4j5J4%j4PNJ5
8.87222A9k2j3K6j3J3k5J8oKRqJ1j0L%nLQjk7M8k9KkK2k6jj4J2K0Nqj1TJ7j6QJ3Qj9
8.85187@jj1J7lj3J0J1qkNj5KQoJ8k1J8j8J6k%j4J3j3jJ3pJK5j7J0j0oTK8l2RnJ1j0
8.83153fO%Mj0MLj%QTk0K0k4K0qQlOk9J8j4K6k6rNJ0J5%j5KTJ2j3KJ5qjj5LNJPkj1M
8.80863aoLJ1nkJPk5J9j2JK0Nj4LQl1J7J0K9m9J0JlK1k7K1k2J5oRrJ7l2L8k3joJ2j7
8.78829a3NJ1Jjj7K4Pk4jK3oJ6k3mlJ8qnoJ5k5J8lJ5k6L2k4LlJ6Jk2J2pJ0k5J5mJ3L2
8.76794C7m6J0njkJ5kOj1J0j8jJ5mJ3j0kJ9k8P%J0j2J2k9K7j0LOnJ4mj2j0J2Jj5%K5
8.74810A5j6Rj0J0j3Nk2J0L3Ol6Oj2J6qK5j4Oj5%rK3qpJJ6k9L2k7J2JTj4J9JoRrj2J4
$$ y = [1, 4, 4, -10, -10, 0, 9, 4, 7, -8, -1, 1, 24, 2, -22, -8, 7, 0, 9, 9, -2, 9, 19, -11, 13, 4, 7, 8, 3, 14, 17, -13, 4, 1, -7, 7, -8, 6, 6, -8, -1, 4, 19, -3, -16, 10, -3, 10, -15, 3, -3, -1, 8, 0, 11, 1, 4, 4, -1, 2, 10, 9, -18, 30, 1, 3, 1, 23, -3, -4, -18, -6, 14, 19, 11, 0, -11, 6, -10, -2, 11, 19, 0, -1, -12, 5, 2, -11, -1, 10, 2, 0, 5, -10, -8, 0, -6, 12, -9, 9, -9, 7, 5, 5, -9, 4, -9, -10, 3, -4, -3, 22, 5, 15, 5, -1, -7, 21, -11, -2, -7, 4, -6, 0, 0, 4, -6, -2, 1, 0, 0, 8, 16, -4, 16, -8, 12, 4, 12, 9, 15, -14, 4, -10, 16, -10, -19, -14, -4, 11, 11, -4, -2, 0, 12, -1, 1, 16, 8, 7, -8, -5, 0, 1, 8, 6, -5, -1, -7, -4, 7, 2, 0, 1, 8, -17, 2, -10, -9, 11, 16, 2, 5, 13, -18, -1, 9, 38, -11, -1, 0, -3, 18, -9, 12, -10, 5, -1, 8, -1, 16, -16, 22, -1, -2, -8, 4, -13, -8, 3, 4, 3, -14, 10, 17, -7, -8, 15, 9, 25, 2, -2, -5, 13, 5, 0, -6, 9, -16, 2, -1, 14, -12, 20, -4, -1, -4, 12, 13, -9, 3, -4, 6, -19, -4, -8, 5, 37, -9, 1, -4, -5, -7, 8, 6, 12, 1, 11, -7, -8, 7, 3, 16, 6, 4, 23, -5, 2, 2, 12, 0, 12, -17, 10, 0, 3, 9, 4, 18, 14, 2, -8, 4, 5, -10, -10, 15, -1, 8, -2, 8, -5, 0, -22, -12, 21, 27, -9, -3, -15, 1, -7, 18, 4, 10, -5, -5, -14, 9, 1, -6, -5, 11, -18, 14, -13, -1, 0, 1, -13, 6, 7, 1, 10, 1, -11, 3]
8.72775ClJ1k2K4k5K4j1j5K1jj1J1Mj4KMpK6Oj6rkQqJ2j1Rj0MrL5n2L8l1lPJ1LJ4j1
8.70740Fj1kJ4j7K4l0L4k5Qj6J1J4j1%j5K3k7L2j4J1k8Rj6L9j0KJ0j9j2J0MJ1Jj6JJ0
8.68909EK%pRqj3K8ol3K7mqL2j7RJ0pMj5K2kk3nM6k6jKpK2l6L7l3MRk1mjJ3K0k7%K7
8.66772B4j5kj1NTqNj4J%K5j8KTjPNoj5K4k0LJ0k9K8lRj7J9k1K2k7j2J8mRj2MQ%kj3
8.64635a5K1nQrJ2k0J9pj0L2k4Kj1J9k1j3J2L3Kk5%n%K3k2K2%mkj3J1K5l4J6qQj5n%
8.62651cJ4j1J7k6RLRjnj1Qj7J6%klklJ4lJ0k9Rj5RJ4nROj8J2jj5TL6j3j1PJ7k0K0K
8.60515A2k3QmJ0rJ7oqQPj8O%jlRoJ5l0K8k9K3J4j4J4k6J3kPlk1lK0j4J1j0J9j4KlTM
8.58378cLk7L6k6K0Qj0jJ6j8J6l6J1PkqJ9J6k4K4j9j1J3%Oj9K4l1K8Pjj4k3QjNkK1o
$$ y = [3, 0, 11, -11, 13, -12, 12, 1, -14, 7, 6, -5, 6, 10, -4, -2, 2, -5, 21, 27, 11, 2, 0, 8, 0, 12, 1, 10, 0, 4, -5, 30, -22, 16, -15, -18, -11, 0, 3, 17, 6, -5, -7, 7, -10, 14, -16, 18, -7, 1, -15, -4, 10, -1, -1, -16, 7, -20, 12, -2, 9, -19, -10, -26, 13, 3, 5, 15, -4, -16, -6, -2, 9, 10, -6, -5, 5, 7, 7, 0, 9, 1, -12, 16, 10, -23, 4, 0, -8, 24, 7, 16, 26, 19, 23, 8, 30, 28, 5, 0, 46, 20, 19, 21, 14, 36, 0, 37, 4, 8, 17, -4, -8, -9, 4, 24, -3, -3, 24, 9, 7, -4, 1, 6, -2, 3, -11, -10, -10, 15, -3, -1, 1, 0, 7, 12, 6, -9, 15, -5, -2, 8, -21, 7, 4, 13, -4, 15, -6, 16, -11, -23, -5, -9, 0, -12, -8, 0, 0, -2, -15, 6, 1, 9, 0, 12, -8, 11, 4, -6, 26, 2, 4, -7, 12, -9, -22, -10, 23, 25, 0, 0, -5, -5, 18, -4, 18, 18, 14, 12, -1, 10, 35, 1, 17, 9, 17, 2, -3, -3, 11, 0, 17, -9, 0, 3, 12, 11, 6, -5, 3, -14, 2, 2, 0, -3, -5, -8, 6, 3, 13, -16, -7, -22, -13, 1, -4, 5, 11, -7, 5, 4, -11, -26, 10, -3, -14, -7, 10, -10, 10, 12, -11, -3, -7, 3, -6, 11, 5, -3, 5, 12, -6, 0, 0, -1, -4, 5, -1, 14, -16, 12, -17, 6, 20, 6, 20, -6, 7, 5, 12, 9, -12, -15, 5, -9, 2, -8, 11, -3, -1, -4, -7, -3, 0, -27, 9, -17, 3, 11, 1, 0, 16, -2, 14, -22, -11, -4, -6, -14, 5, 21, -3, 21, 2, -9, 4, 4, 10, -9, 15, -16, 12, 19, 18, 4, -19, -11, -12, -7, -9, 12, 6]
8.56394Fj2PjmRoK0k1JK7k7J0rlj4J8oMJ4m6L5l7L2k0L0Mmj4J8Jj6mlK7k0kQj6J%L6
8.54309B3l4L0k8Rj0J7rQLj0OrJ3Lq%k3K2JJ1qK4l2K4j2%Rj2oj0J2kJ8j6j9KK7Rk0J4
8.52274A7rj1PK3k0Mj0J0mk8K2Tj9JpLjPNj3Mk3K7l8L6JJ0m0L8Jpkk4K6qnJ2Ok3J3M
8.50188GkpK%JpJ6rJ4j8lJ5nLQj4NJj2RPj4J8Lj4OJ1k3Jj5J6J3j7RKJ8j1j6QmMlpJ2
8.47950HqJ2nJj3J3rLlK0k9J5j0PkJ2mqOJ7k5J8qj3J5lkpJ8mLrj7J8kJ7k9J8nJ4j9p
8.45813fK0lQk3Rk%KnLRjk6NLPJ9k5K0m0N1j7rJ3qonK7j9kOK0k2LmqK0j3kjRJ7k6J1
8.43575I%J2nMLpOLrnPjj1J2PKj5J7LJ1j2J6lOj1K5Pj2j7M1j7J1J2K1j1K8L0NK8R2J24
8.41489D06L28N86P03M75J86L56M03J51k97l63k06r4J04K53Q6K2K67K93o4m78m74m23
$$ y = [6, -6, 1, 0, -4, 5, -1, 19, -2, -1, 26, -1, 9, 0, -3, -17, 1, -5, -1, 13, -33, 2, -35, -3, -23, 7, 11, 7, -7, 11, 12, -4, -8, -11, 16, -4, -6, 2, -14, -13, -13, 23, -11, 19, -9, 0, -10, 7, -2, 6, 9, -1, 5, -4, 9, 12, 4, 4, -19, 3, 4, 15, 7, 31, -1, 23, 11, 11, 20, 8, 2, -8, 4, 2, 20, 4, -15, -13, 14, 23, 3, 17, 8, -3, 4, 27, 7, 11, 1, 11, 7, -21, 1, 23, 4, 5, -2, 1, 0, 7, 12, -1, 3, -20, 7, -31, 5, 6, 16, -24, 14, 15, 8, 6, -18, 8, 0, -5, 7, 13, -10, 3, 7, 5, -2, 0, 0, 1, -6, 10, 1, 15, -3, -6, 9, 4, 7, 15, 1, 6, 7, -5, 4, 11, -3, 15, 18, 4, 10, 21, -2, -1, -16, 0, 13, -4, 5, 7, 25, 14, -2, 6, 2, 6, 3, -4, 8, 0, 12, 7, 8, -5, 8, -1, 2, -1, 19, -10, 5, -5, 2, 0, 12, 8, 0, 6, 23, -2, 16, 8, -5, 10, 7, 5, -2, 16, 12, 15, 6, -11, 7, 5, 22, -7, 11, 6, 20, 1, -6, 14, 11, 19, -4, 5, 3, 3, 5, 0, 3, 12, 11, -15, -10, -7, 0, 19, -6, 14, -26, 25, 8, -1, 12, 4, -2, -7, 20, 1, -1, 5, 25, 3, 6, 2, -6, 14, 1, -1, -2, 7, 24, -2, 9, 9, 21, 16, 20, 23, 16, 22, 25, 16, 11, 18, 17, 6, 18, 25, 27, 12, 29, 32, 43, 31, 47, 44, 50, 39, 64, 71, 59, 42, 83, 66, 77, 89, 110, 99, 127, 157, 162, 190, 282, 406, 734, 1320, 2023, 2498, 2684, 3040, 3443, 3594, 3297, 2934, 2728, 2634, 2738, 2991, 3077, 3099, 3366, 3659, 3595, 3117, 2643, 2220]
8.40370B220n49n88m30k46j08o9lp7j6Mj6Tmj1LJ2nj0K6l5oNj9J4lk7K5jk0lj3J2rl
8.38640C4k4OQj4j0lQpJ7j1Qj4jKRk0K4mjJ0rJ3l8L0j4j%OTj0K5k5j2L7k5kJ4j1j0R
8.36605@J2l1J9J4j2OqOjJ2j1j4K0kRj1J3j9j5J9NK6l8J0rPj6K3qPj1J7j4J8j1joK1
8.34672B6l2J6Mj1QqJ2nJ2KnJ6l3MjnRjOj1j5K4j2RrJ0nlJNKl1K6Rj5MkMj%j1OJ6q%
8.32383Gk4M6k7Rj5J5rJ3j1Rj3J4k7qK9k3J6JKTj1J5j7K3jrqpJ6Jj0QolJ3pj1NRrJ2
8.30297Ij4NJ0Kl1L1l0J8J5k0J7j7K2k0RQJj8J4oj8L8k5j1kJ3j%K3j4J3k9K5j7J8r%
8.28415Ik7L2nj6J6k0M2k6JMJ2k0JRMNj7Lj0rNK8j4j2NRkj0L0m4K5j6J4k0K4%rnMJ4
8.26380A4l5J9J2qJ8k3nQkNk5M1j7Kj0RPJ2j4oK1k6J7J4j3J6l9K5l0K0JJ1k9J4J6J8
$$ y = [2220, 1671, 1083, 653, 407, 299, 230, 227, 150, 134, 138, 122, 106, 102, 91, 94, 106, 101, 91, 117, 82, 76, 81, 62, 76, 73, 46, 71, 70, 50, 47, 34, 46, 37, 34, 10, 16, 24, 10, 0, -3, 5, -2, 15, 4, 12, -2, -3, -1, 8, -12, 12, 8, 7, 17, 8, 21, -17, 13, -1, -2, -2, 4, 10, 0, 25, 0, -12, 25, 0, -2, 12, 1, -9, 0, 12, -19, 0, 14, 2, 8, 0, 6, 5, 17, 6, -8, 12, 10, 19, 8, 21, 2, -13, 6, 11, 37, -1, 9, 0, 7, -9, 14, 6, 13, 2, 19, 5, 23, 12, 11, 5, 26, -6, 10, 14, 3, 11, 3, 15, 10, 22, 24, 19, 35, 2, 6, 5, 0, 9, 8, 14, 3, -12, 12, 0, 9, 0, 10, 5, 2, 3, 8, 10, -21, 5, 14, -1, 3, 1, 5, 4, 4, -7, -1, 15, 7, 7, -17, 29, 2, 11, -4, 11, 2, 15, 4, 13, 0, 14, -13, -21, 8, -15, 1, 2, 4, 6, -5, 10, -7, 16, 15, 6, -2, -9, 7, 8, -2, 6, 0, -3, 10, 3, -8, -3, 6, -3, 9, -5, 0, 10, 12, -19, 12, -18, 0, 15, -5, 12, -5, 17, -3, 6, 14, 15, -3, 11, 5, -13, 25, 0, -11, -13, 0, -1, -1, 22, 8, 21, -8, 17, 0, 18, 9, 9, -18, 14, 9, -7, 9, -11, 31, 5, 6, 10, 22, 2, 3, 12, 16, 21, 4, 7, -3, -12, -7, 21, 7, -5, 0, 9, 7, -3, 27, -17, 8, -8, 6, -14, 10, 10, 1, -4, 0, 14, -21, -2, 10, 2, 20, -3, -8, 0, -2, 3, -22, 19, 2, 4, -6, 3, 10, 22, 8, 2, 23, -3, 14, 28, 15, 31, -8, 17, -13, 7, 8, 19, -10, 4, 20, 38]
8.24549C8n6L1j7J8jQmlj5J6qjj2J8j9L2k4J1QNj7oJ3lk0J9qMJ5j1k8QROmpJ1pK2KTq
8.22412A7J1k6Oj3K3k5J3K0k4J8Poj0PRj6nmnJ1nj6K4orOLj6J7Mplj8L5k4J5lNj9RTj3
8.20276dKOj2J5mK0l3J3lmJ7jj8J4j4K4j7J3J0l5kJ3J4jj3Pj4J5j2LOJlk%mnQmPj4J3
8.18139BjTJ9k4K4l0J3Jj4J7oRJnj0J0J1k8MK8j8omMJ4j4oK5j5RrLk5K5Jj3J7jpOJ5
8.16053B1rTLJ6k2oTJ4KJ5Jk4QJ7l4K1%J2j9MqK7j7k%LRjoPojkqNJLln%K6J6j9Pj1q
8.13713A2kJ2j2qJ7J2%j1NoKrLmp%MpNQj4K1Nm0J4LKk0K4j1MpK0k0NKj0RmL0j9Pm6J4
8.11475a7J8J5k2ONnQj7RK0j6mj1lJ7oL1k6Oj1J3q%qmL1j6Qj5J9k2j1L0j7%J5kj3kJ0
8.09440EnQJrjKJJ2k9J4Rj7NL4j8Lj2j4J7Ok0jK2Nj2JoRjj7J7j0%K6k5oJ1lMRk3QmP
$$ y = [38, -18, 13, -4, 14, 13, 21, 17, 14, -1, 15, 7, 6, -6, 12, -7, 25, 1, 12, 20, 25, 8, 2, 15, 12, -8, 11, 3, 7, 22, 11, -17, -9, 0, 6, 2, -5, 6, -1, 21, 23, 25, 17, 28, 2, 8, -5, 18, -7, 6, 26, 2, 20, 27, 21, 11, 18, 27, 11, 6, 2, -3, 8, 3, -13, 11, 5, -4, 2, 5, -11, 6, 10, 3, 0, -18, 17, -7, 8, 5, 10, -9, 0, 9, -4, -2, 4, -8, 7, 3, 23, -10, 3, 0, -4, 13, 12, -6, 8, -6, 18, 1, 14, 24, -11, -13, 0, 14, 13, 0, 7, -7, 8, -4, -1, 5, 6, 3, 1, 1, -3, -8, 0, -4, 3, -11, 2, 1, 0, 19, -5, 19, -11, 2, 3, -11, 6, 0, 9, 10, 5, -5, 5, 16, -12, -8, 20, 2, -4, -8, -4, 10, -4, -10, 15, 0, 9, 0, 3, -22, 3, 4, -9, 8, 7, 0, 6, 21, 12, 3, 6, 22, 0, -6, -12, 2, 4, 19, 20, -4, 4, 21, -13, 8, 8, 20, 1, 5, -3, 24, 7, 5, 5, 8, 17, 16, 10, 17, 11, 10, 8, 0, 5, 6, 9, 6, 1, 1, 27, 43, 24, 31, 20, 12, 10, 22, 10, 2, 19, 31, 31, 20, 25, 19, 21, 12, 15, 11, 4, 4, 8, 1, 6, 14, 0, 21, 26, -14, 0, 3, 5, -15, 9, -2, 2, -5, 15, -5, 0, 2, -8, 1, -3, 27, 8, 15, -31, -17, 1, 16, -6, 0, 5, 0, 8, -9, 0, 20, 4, 0, -11, -14, 3, -3, 28, 2, 8, -3, 10, 2, 2, -6, -10, 21, 5, 13, -2, 17, -5, -16, 14, -3, -3, 12, 10, -3, -5, 5, 0, 8, 9, 0, -1, 1, 2, 14, -15, -1, 8, -9, -4, 30, 12, 15, 3, -11, 6, 12, -8, -9, 13, 18, 6, 7, 1, 10, 9, -8, 9, -1, -1, 25, 0, -6, 5, 2, 6, 15, -8, 0, -4, 3]
8.07202ClKk3K9rJ0j1J1pj1LMK9Jl0J2j1K5j3j1OkoJ6%j4J2l3L0j8K1j3jj1K6j5lN%
8.05218@Qlrj8J7J1Tk8L1j0k0K9j2%Jpj8K0J4k0QnK2k6L1n4N3j8%JonJ3j5QkPj6K3j0
8.03183FkJ1RrnLrk5K8j2J5j8L4k2J0j6MRn%qJ0J3Jj1j7oK1nk3J9MJn%RMj3PmJ1j5P
8.00995FJ7nmj1J4j8J5oqK7l6J5pR%J5j0klJ8j3J2k2K2QJ2mkRomK6j4J7pj9J1rJ6rJ3
7.98910F3RK1kj8L3K4N0J08K55N19N57K27M57K4l13l54l10l69j59P5M61M01K14L84j46
7.97638B211l64l57l55m68k61j60q5m5j9kj8K0k1rjk2L1omJ7J3Tj1j6%j0lJ6MOjJ5Q
7.95959A16j5J9lj1M9M0J69K70N79O05K70M96ol74l60l70m30j72J29N37M36K26M39k10
7.94738B429m06m14m11m84k93j63j01k4m8K1k0k9Pmk6k0J8kj2K9j9K3k3jJ%j2JJ8k1
$$ y = [3, 0, 2, -21, 8, -1, 9, -2, 9, 2, -9, -6, -2, 27, 28, -2, 10, -1, 24, 11, 0, 6, 4, -2, 14, 14, 0, 12, -21, 9, -9, 12, -1, -2, -13, 13, -2, -5, 0, 0, 8, 5, -4, -22, -5, 6, 17, -11, 20, 10, -10, 19, 7, 7, 8, 1, -17, 3, 17, -3, 5, 0, 22, -4, 27, -27, 26, 8, 8, 9, 3, -2, 11, -4, 4, 2, 9, -7, 16, 6, 4, 15, 24, 15, 10, 13, 4, -21, 7, -5, 10, -8, 26, 4, 14, -2, 2, 11, 6, 6, -2, 8, 21, 22, 11, -6, -12, 9, 4, -19, 0, 4, 5, 0, 0, 9, 13, 0, 7, 3, 14, -1, 6, 23, 18, 14, 3, 17, -1, 14, 8, 0, 27, -9, 6, -1, 8, 8, 23, 13, 11, 8, 26, 13, 25, 3, 25, 33, 45, 41, 39, 48, 42, 38, 64, 50, 67, 60, 41, 52, 43, 59, 50, 63, 72, 93, 91, 73, 106, 130, 180, 288, 543, 1062, 1619, 1846, 2303, 2327, 2014, 1660, 1350, 981, 822, 897, 1358, 1759, 1973, 2357, 2211, 1847, 1490, 1135, 667, 406, 246, 161, 116, 97, 95, 77, 97, 76, 67, 66, 44, 75, 69, 65, 82, 95, 108, 97, 81, 81, 71, 68, 84, 88, 94, 93, 108, 116, 101, 120, 117, 106, 155, 195, 364, 634, 1213, 1818, 2088, 2584, 2578, 2204, 1844, 1474, 1044, 872, 1001, 1538, 1974, 2200, 2639, 2429, 2023, 1609, 1198, 714, 421, 258, 157, 133, 85, 106, 86, 57, 64, 60, 34, 14, 32, 30, 18, 47, 28, 51, 28, 27, 28, 28, 16, 17, 35, 14]
7.93212A4K2k7L6l5J5j6Qk1K7k0qNj%NRrj7J5Rlj0J1nL%j7J0J9jj8OLkRLOk6JTKMJ3
7.91025B0k0J2mjJ3oKJqmJ9klmJ8k3j2J2Mj8NJ8k1LTj2K1qj8J3JK5j1Ok3j1ML4k7J6
7.88990A4Lj4Nj1MQmMpQoQoJJ1j4Nj2J0J1Pk2qoK0mklJ5k4J5njmJ7l3J3MJ5j1J9k4M
7.86802@ljokoJ7JK4oj2Mj3N%kJ5j4jJ1j9K5pk4K3j5rQPJ0l0L4j6K3k6K8l1K4Jj6K2
7.84767B3l2L6k6J7qjj0JmRPnk7J1J7j4K3j9qJ7%j7J7j5K1rJ7k0K4m7L1Jj0lPjLqRj0
7.82733cJ0mlrRQk0K5Jj5qJ8k1J6O%j4K4k5J4qNj2MqJ0k%OnloL1k8jK5Jk2jTK0k2K5
7.80545A7k6J%QoPJ2%k7J8ojL1l0rJ3Pj5M%PnJ2j1Mj0J2pKj4J8o%LMKJ0oj8PJ0jmTJ3
7.78256A6k1%J6k1J4Tj8JNOJ5k9J3omJkNpJ0Kr%J7j1J2j8J4j8RpJ7k2Rj5KPrJ1j3J5
$$ y = [14, 36, 9, 45, 10, 25, 9, 17, -4, 23, 3, -5, 0, -1, -1, 4, 13, 4, -13, 2, 11, 8, -2, 9, 4, 7, 7, -10, 0, 19, 18, 0, 6, 9, 7, 16, 19, 25, -1, 0, 1, 3, 7, 20, 0, 12, 8, 7, 20, 14, 16, 17, 9, 5, 24, 22, 19, 15, 33, 10, -2, 10, 14, -4, 1, 19, -2, 1, 4, -8, 13, 5, -13, 0, 1, 26, 15, 21, -2, -13, -9, 25, -2, 14, 17, 3, 8, -3, 1, 9, 5, 9, 2, 10, 4, 12, 6, 7, 18, 4, 9, -3, 7, 18, 25, 3, -5, -11, 9, 5, 3, 0, 15, -9, 6, 1, 0, -4, 13, -20, -7, -3, 12, 1, 20, -4, 0, -3, -4, -10, -12, -18, -1, 0, 24, 18, 6, 10, -3, 2, 2, 0, 15, 1, 0, 11, -8, 17, 10, -14, 9, -6, -15, -7, 0, 10, -20, 14, -2, 21, -5, 23, -8, 16, 17, 1, 23, -9, 27, 1, 18, 10, 9, -1, 0, -4, 5, 12, 7, -20, -9, 8, -6, 17, -2, -10, 7, 7, -10, 7, -8, 13, 4, 21, 1, 25, -22, 9, 10, 0, -3, 4, 3, 6, -2, 7, -3, 7, 3, 0, -9, 0, 8, -12, 13, 14, -1, -9, 9, -12, 4, 10, 10, -4, 20, -5, 9, 1, 6, -6, -2, -10, 0, -2, -2, 4, -1, -4, -10, 21, -7, -8, 17, 18, -4, -5, -6, 14, -8, 17, -9, -8, -8, 0, -6, 1, 13, 13, -14, 4, -2, -3, 28, -2, -11, 2, 9, -6, -2, -2, 5, 0, 12, 1, 5, -5, 7, 0, 2, -12, 6, 0, 0, 3, 7, 9, 19, 13, -5, 2, 12, 11, 7, 3, 16, -5, -5, 11, -10, 4, 18, 0, 1, 6, 12, 27, -2, 11, 5, 1, 2, 0, 5, -2, 8, 10, 1, 1, 18, 7, 19, 1, 15, -3, 6, -1, 16, -6, 3, -12, -10, -3, -12, -1, -14, 1]
7.76170AK3k5jNlKj3MJ0kLjnJ4jj4j6M0l2J2J8j9J2%jrkk3J5K5k0K0l6L2l6L5Lk2%J2
7.74135ErJ4lj8J4LmnJ7oRj7J5j0LnJ6k6K9ok4K5j0Qj9LMpJ1qK3k6J5j1Lj1J3Kj2kJ5
7.72050HqQqL0k3j7K3j4JLl%J6nRj4Qj6L3k9J7nQoJ1k1J5k3J9KK4n%j9qJ2pJ7Pj2j1
7.69964A7rOj5J8o%qjTk1K1M%oQJ4j6J1j4Pok%j5J4j2J7j5L6j9j7J0JMLK3j7J2j9K8
7.67929C5k2J0j9LJ1nKRoK3pk4J4j6PjQkTj2j1NJ3pKpqJ4j2K6m6K7k7M8l1qJ3pJ5j9
7.65894a4J3OLj6J0l0L4pQKMj2oOK2j6oqPJ0rTNj6K4qLK2j7j2J2oK9j5j3NTj5J5pJr
7.63758eJ0k0OlJ6k1J0J6MnqJ2j9K1l8L5jJ4k6NMj5K0j0PKj2mNJ3lLk6K1rJ0jj0JRK3
7.61672C1K5knkk4lTMj2mj2J8j6K9l6K4mk0J9k3K3rJ0j4OpJ9kj4J5k7L3k4K4j0J6lO
$$ y = [1, 24, -1, -2, 3, 0, 2, -11, -7, 3, 1, 4, 3, -2, 12, 11, -3, -19, 21, -11, 1, 19, 0, 12, 12, 11, 2, 0, -23, -8, 17, -3, 17, -19, 13, -23, 12, 15, -7, -7, 5, -4, 10, 7, -11, 3, 6, 2, -3, 14, 8, 17, 0, 15, 5, 8, 3, 19, -7, 22, 16, -8, 17, 7, 15, -4, -1, 3, -4, 7, -1, 22, -4, 11, 0, 3, -8, 5, 7, -5, -7, 8, 0, 8, 0, 30, 7, -10, 13, -1, 0, 3, 0, 0, 16, 11, 20, 6, 14, -2, 31, 2, 19, 14, 22, 16, 27, 6, 21, -2, 17, 19, 43, 38, 38, 19, 11, 23, 16, 33, 40, 28, 17, 8, 14, -1, 17, 11, 11, 3, 2, 1, -20, 1, 5, 5, -1, 7, 21, 5, 16, 2, 9, 3, 1, 1, -14, 0, -12, 5, -10, 26, 7, -10, 0, 1, 5, 8, 31, 14, 26, 7, 35, 13, 23, 4, 7, 18, 13, 15, 24, 18, 41, 34, 10, 24, 8, 15, 14, 22, 20, 18, 6, -5, 0, 13, 6, 8, 1, -7, 7, -5, 21, -25, 2, -25, 23, -8, -16, -3, -10, 5, -14, -1, 5, 8, -8, 2, -28, 6, -1, 7, 9, 13, 1, -5, 1, 23, 7, 1, -7, 0, 10, 1, -8, -3, -19, 5, -3, 0, 22, 5, -7, 5, -1, 28, 13, 0, 5, 10, -5, 10, 3, 4, -5, 5, -15, -9, -12, 4, -17, -7, 9, 13, 8, 0, 12, -7, 14, -24, 11, 10, 24, -2, 3, 7, -8, 12, 2, 9, 11, -1, -5, 0, 13, 10, 13, -13, 8, -1, 9, 8, -2, -1, 8, 31, 56, 54, 49, 47, 23, 20, 17, 21, 9, 5, -7, 11, -5, 24, -12, 12, 8, -12, 7, -16, 7, -2, 8, -6, 0, -7, 12, 10, -4, 11, -16, 17, -7, 17, 7, 23, 20, 26]
7.59739B6J0mk3J4j5J3nlnJj1JkJ8%Pj6oM3k3J5oj0TRj8rJ6pkJKJqjNJ4oNk3K7j2Rj1
7.57500Aj0KQmK1l2J3j7K2k0K3oRJTj2qJ7k4L6j7Lj3QJ7k4L0l6J5k3J9J0j9RNj3J3J
7.55567FoKkTQk7L1ONj6lj0K1oMKl7L3nTKJ8j6J2k3J5j4J5%qJ8J1k7mpN%J8k3K1j3%
7.53431aOK2oj9%j4L3j9mJ1Pj5mj2K3qNj4J4J0k1kK1j3J5J3k5%j0L3l7J7j8K5lk4J8
7.51549DKTrjrK0j3j0L2k7KJ0j1J6MJ1k4PrJ0j0J4Koj9J9kj0J4opK5k7L8l3K6k0J1j6
7.49565@MrmNJ5LmMk3J0K0Qj6JolnJ4j8J8Oj8jK7k8J0mjTl%Pj6J7OorNKlomPmJ0QJ2
7.47174B7j8%pJ8rJ6l9L3j8K5j2j3OkJ4mOomKj2Mj3K5j5Rj8J4Okj7K7j6nRlmNJ7k1K1
7.45088B6j4M2k0J1KMPlj8J5K7j1pK4k2L1pN4Q1J61K74L90L72K26K61L66M67L09P2o5
$$ y = [26, 36, 32, 9, 23, 8, 21, 16, 13, 8, 9, -2, -1, -3, 15, 15, 22, 6, 0, 43, 20, 35, 29, 19, 9, 18, 0, -9, 7, 0, -2, -1, 1, 2, -6, -7, -2, 12, 6, 11, -12, 15, 3, 12, 1, -9, -7, 1, -3, 18, -14, -1, -18, 4, -16, 7, 1, 10, 11, 12, 0, -8, 9, -15, 21, 4, 7, -6, 2, 19, -5, 25, -11, 4, -19, 0, 10, -9, 0, 5, -8, 5, 6, 0, 2, 0, -2, 6, -21, 10, 16, 21, 5, 2, -8, 13, 7, 11, 13, -24, 9, 4, -1, 1, 19, 3, 15, -8, 7, -7, 8, 8, 0, 18, 29, 2, -2, -9, -4, -4, 14, -9, 12, -1, -1, 5, 27, 21, 2, 2, -12, 21, 2, -2, 9, 16, 1, -3, -15, 8, 0, 5, -9, 5, 15, -6, -8, 13, 0, 15, 28, 3, 3, -7, 26, -11, 6, -12, 13, 10, -14, 4, 6, 8, -1, -2, -11, 9, -4, -14, 18, -9, -7, 3, -8, 8, 12, 23, -1, 6, -3, 7, -3, 11, 13, 7, -12, 7, 5, -5, 9, 3, -4, 21, -6, 32, -1, 25, 5, 16, 0, 4, -5, -9, -4, 11, 14, 10, 14, -9, 1, 21, 29, 13, 14, 8, 5, 0, 14, -4, 14, 20, 2, 1, 28, 0, 10, 6, 5, 4, 1, 1, 8, -8, 9, 15, 9, 0, 5, 7, 4, -2, -6, 1, -3, 7, 15, 27, 9, 9, 2, 20, 11, 27, -12, 21, 3, 28, 16, 3, 9, 7, 21, 17, 23, 17, 13, 15, 3, 7, -6, 19, 4, 13, -5, 9, 15, 13, -4, 23, 7, 2, 11, 8, 4, 9, 26, 5, 26, 12, 54, 34, 45, 47, 51, 58, 55, 37, 52, 79, 68, 61, 85, 63, 94, 87, 141, 222, 383, 657, 1047, 1419, 1645, 1906, 2272, 2739, 3048, 3120, 3055]
7.43562C055r3j11k41l57l87l16l31l38l12j91j35o2n0j7j4m3J7%k3lK0j4Pj0prK5p
7.42137E3k7L4lNlOJOj4J5J1j6QNOM5K0P1J30K68L85L48K05K24L57L78K77Q0r0j17j21
7.40560B547k16l14l71k87k75l20k76j55j43m9k3m5K7m9J0orNQkj4j0TJ1j1J8qnj5n
7.39034HJ0Lj9MJ6j5J9k7lK3j0J0j9K0KJ0J8k0K7rK9k0Kj9J9l1J2k8Qk2J6pRKpKJ2j0
7.37101A5qJ7jj9J3j0kJ7l1K1j2ROj4QTroQj8L1j8J0mJ8k4RKj0MklRnk3K9j2LjJJ9j4
7.34964A1Rj9J9pjj1J4j0L5m0J3J8k8LrJ2mJ2lkoMQLj6%nK6j5J0j9K9lrj9J1PMpKlJ2
7.32828B6j4J1j6qJ9j3Oj3L3k3KrkJ6j8K9lj1pOqLpQTnKJ1k0K3k2qK3K4m4QMJ0KJ6j3
7.30742B6K8l5L7JK8k6J1J0mjJ1j3oPj9RK7j3J7L6K2R2J36K41M02P07Q26Q09N90K89
$$ y = [3055, 2962, 2851, 2610, 2253, 1866, 1550, 1219, 881, 569, 378, 243, 181, 131, 114, 100, 57, 74, 74, 51, 48, 68, 54, 61, 51, 44, 35, 60, 53, 26, 60, 57, 62, 59, 65, 66, 72, 58, 73, 84, 68, 76, 81, 87, 132, 152, 223, 353, 621, 1006, 1354, 1559, 1783, 2140, 2518, 2795, 2875, 2785, 2668, 2547, 2331, 2017, 1646, 1359, 1084, 764, 488, 333, 190, 141, 118, 73, 100, 51, 61, 55, 46, 51, 59, 57, 43, 33, 23, 34, 23, 41, 33, 28, 13, 8, 18, 21, 2, 6, 22, 7, 26, -1, -4, 19, 9, 19, 0, 20, 22, 32, 50, 30, 57, 48, 77, 57, 59, 40, 59, 28, 40, 12, 20, -2, 14, 7, 16, 18, 11, 13, 25, 15, 7, 24, 23, 4, 17, 7, 5, 22, -9, 12, 0, 9, 15, 1, 9, 17, 8, 2, 10, -8, 23, 5, 15, 11, 29, 5, 14, 16, 6, 10, 8, 5, 14, 9, -14, 15, 3, 6, 5, 6, 25, 11, 20, 1, 20, 13, 12, 1, 15, 5, 40, 0, 13, 31, 3, 6, -3, 9, 5, 17, 14, 12, 6, 10, 18, 21, 5, 5, 0, 26, 11, 21, 2, 31, 28, 19, 0, 11, 18, 22, 15, 17, 14, 26, 12, 23, 7, -1, 18, 5, 11, -2, 31, 8, 10, 1, -1, 15, -3, 26, 23, 12, 5, 11, 3, 6, -1, 7, 15, 10, 12, 23, 3, 26, 4, -4, 19, 43, -1, 7, 11, 21, 23, 39, 26, 54, 19, 56, 57, 85, 59, 70, 80, 76, 75, 86, 73, 67, 74, 55, 64, 91, 78, 95, 131, 153, 245, 381, 622, 1024, 1731, 2557, 3366, 3956, 4245]
7.29216D245j61n18o86p40o53n40l21j85j09k1k0J3rR8J75L17N45P88Q32P52M51P7l67
7.28046C963n82p74p28o22m84k51j80m6q0j3QJO0j2J03P1K66P84J502L895J915j685
7.26927G111K51m83k251k264j098n38l26j13n8m9ro1jl2l6jk1qk4J2j0J7j1J7Kj2K4
7.25553B8j9J3ml6L3oj1K7l1RJ2rlTJoL1l3PMPoPl1K6J1rmnJ0K0pTPj2KQk6J5j9J5J7
7.23417B3j7oj6K0k0L6j0mK4j1j7J5j9LmK3j7K1k9L0k8Rl2K1J5j7K8j7J0kjK2k3Qj8
7.21636@J5rlmJ3Mj8Rk7L0NQ%l3J8j0J9kK2l2K5j0J5j8Kj7%J7oqRpK1k3nJ0J1Mk0JK2
7.19550B8j1Qj7nK6j3j1mQj3Lljj1K7poLMj6JJ4MqMqRrNOkk8L0j5NjK0j4Mj1J6j2kTJ2
7.17261GpJ6%k5K2j7J9j3J5qJ2%TRj4QKJj1qpJ4Mlj4Qk2L9k7%k3N6k5pJ3%k2J7mJ3j4
$$ y = [4245, 4084, 3566, 2880, 2140, 1487, 947, 626, 441, 332, 311, 291, 304, 295, 393, 568, 885, 1430, 2218, 3050, 3802, 4253, 4330, 3963, 3381, 2607, 1879, 1257, 773, 522, 342, 296, 216, 203, 211, 212, 272, 260, 363, 434, 700, 1484, 2986, 6881, 8796, 7111, 7362, 6879, 4628, 2364, 1266, 728, 402, 289, 231, 182, 173, 112, 111, 79, 43, 42, 21, 13, -11, 1, -9, 8, -3, 14, 16, 4, 28, 9, 22, 18, -18, 15, 9, -2, 25, -6, 3, 15, 6, 3, 0, 1, -5, 26, -7, 0, 4, 11, 5, 12, -19, 7, 18, 9, 5, 0, 10, 30, 23, 16, 23, 11, 13, 21, -5, 10, -9, 6, 23, 6, 0, -16, 4, -16, 20, 10, 6, 30, 19, 2, 17, -2, 1, -3, 20, 3, 24, -5, 25, -3, 6, -26, -5, 10, -7, 21, 4, 14, 12, 11, 33, 10, 18, 0, 15, 6, 3, -1, 12, 16, -2, 7, -20, 10, 15, 23, 23, -10, 8, -2, 17, 15, 37, 5, 30, 20, 35, 17, 19, 2, 2, 19, 13, 5, 14, 7, 28, 5, 0, 10, 21, 25, 5, 6, 28, 17, 25, 8, 3, 29, 16, 5, 1, 9, -4, -1, -4, -5, -16, 11, 4, -2, 1, 5, -11, -10, 4, 8, 0, 4, -4, 5, -4, 1, 7, 5, -23, 7, -8, -3, -4, 16, 2, 6, -5, 11, -1, -3, -5, 7, 0, 16, 16, -9, 13, -4, 15, 2, 17, 9, 21, 21, 21, 30, 16, 24, 26, 27, 16, 8, 1, 15, 19, 16, 2, 10, -12, 27, 0, 0, -23, 33, 8, 1, 14, 14, -8, 9, 5, 18, 4]
7.15176DJ8k0Pk3L5j9J0qJJ6j6J9j6Lj7J2PokJ8OMqj4J7j2Pj0OoJ0j8J8j0Pp%K3k7%
7.13141IJ0prLlTnJ4j9K9j9J4k1K0nNlTMj4J7qj1K5l8J7j5Rj9K9k9L9l5M4j9J1jmJj
7.11106Ij0j9L1qkJJ8j3joRJ3j7Qrj8KJ2Tk8L4nqnoJ1rJ0%pJ1k9J6PoJ0kPj4JMmkjJ4
7.08817A1j1j3K3rRk2L1j6nPj4%J3j5NTkLj9L6k4J0Tk2K7k6L0l9L2Qk9L0j2j1J3k5J6
7.06934EOqRPk7KNj8L2jj0pK4Lqj1nOkj0J8pJQj1KJ7j4JnMj8lJ5LNj6L1mj1Rj7KTjk
7.04594AMjTRk2K0mMj0l%J0jlk1K7Lj2KLj1K5k9L1k5K9l4J0j6K0nMloTL0j7Mo%kJ0k6
7.02407a8L1l7K8j5MJ7k0LJ%mJ0j3K7poNjKQJ9j1l4J4mrK1mPj0J1k3Rj3K7j1mj4J5J
7.00372Bj1PKMJ8rj4mPoJ3j1klj7K0Rkj6L5k2Pj0oP%Nj3K6l7K9j3J7j1RjnJK9k3nJ7
$$ y = [4, 22, 2, 9, -14, 21, 2, 12, 4, 5, 21, 5, 24, 8, 11, -6, 6, 13, 7, 5, 23, 29, 33, 25, 11, 28, 16, 23, 13, 19, 13, 23, 5, 23, 13, 20, 13, 13, 36, 9, 9, 19, 12, 3, 6, 3, 0, -5, 9, -10, 19, 0, 14, -7, 13, 8, 13, 10, 7, 11, -3, 14, 6, -5, 20, -18, -1, -16, -7, -26, 3, -26, 13, -22, 22, 3, 14, 13, 9, 10, 9, -1, -20, 11, 3, 1, 2, 20, 7, 6, 0, 9, 22, 5, 13, 4, -14, -12, 0, 12, -16, 18, 13, 5, 0, -6, 5, -4, 6, 6, -1, 10, -19, -3, 4, -2, 8, 6, 13, -1, 0, 4, 0, -2, -3, 11, 0, -13, 10, 1, 10, -12, 19, 3, -2, 5, -9, -9, 4, -11, -6, -1, -3, 0, -19, 17, -7, 3, 13, -9, 18, -8, 22, -17, 15, 23, -6, 24, 12, 1, 14, -11, 5, 11, 3, 12, 19, -8, -6, -1, -19, 13, 12, 2, -5, 19, 22, 14, 3, -2, 4, 2, -8, 10, 3, 4, 12, 1, 3, 20, 6, 7, 2, 6, -12, -15, 0, 3, 8, -8, 23, 19, 8, 17, 0, 2, 4, 3, 1, 5, 4, 3, 12, -10, 10, 6, 10, 0, -3, -3, 7, 6, 3, -18, 9, 12, 0, 2, 5, -6, 19, -10, 21, -4, 25, -9, 1, -15, 5, 0, 4, 1, -5, -11, 19, 2, 6, 0, 0, -2, 8, -18, 13, -24, 4, -11, -7, 10, -10, -7, -6, -6, -10, 0, -13, 14, 7, 1, 6, 5, 7, 15, 34, 23, -11, 3, -1, -10, 11, 7, 14, 4, 15, -8, 1, -12, 15, 4, 0, -14, 1, 2, -9, -2, 0, 4, 22, 13, -1, -5, 2, -4, 9, -2, -4, -7, -24, -4, 5, 3, -13, 22, 0, 7, -3, -9, -2, -2, 3, -10, 16, -21, 8, -5, 12, 1, 10, 9, 4, 5, 34, 11, 6, 23]
6.98235B3k2K0k0J5mj7OmLpO%jJ2mNnK1pqJ4J3qjlk4Pj0J3Oj2rlK4j2lnJOJnJqlK0j3
6.95895ajJ0Pk1J1nJ8j7LKnjMj9J4%QJ0j8lolL0lqnPj9L9m4K2j8J4j1nK6ojK4j5KJ2
6.93759B8pkJ6nokj6Mj3K1m1J9Rj8K5rJ2kRkj6qL2j9K3k9J5pLj2j8K2k0M6j9L0OkRk5
6.91724C1J7k7j6nlQlj%pJ4j0J4k6K1l9L1NQKk0MJ1j1K0j8J1nlqJ0pJ9j4J1j3Kj4K5
6.89740A4j9Kj3K0NJ0j9J5mj1Oj5QkLJ4k3j4J0J9k7K2Lmlj3K8j9Rlj2J3l0M0JKl1K8
6.87807A0J1k6mJ3K%j7OK0j0j5J2nNLRmqoPKrjrJ7j3K9l1K1k9K5j9K4l3L6j4J8k3j1
6.85823a7L3pk1JLlJJ0JONj2j8J9lJ8j9j2RJOnK2k8J9k5K4j7J6PqTKjnJ1oMJ0j2J3p
6.83686GNqTN%lj8L5j6Jj3J3j1OK9k1K0l0j0RJ3j5NJ6mj8QLJ6j5j%RqKj7L2q%jKj6j0
$$ y = [23, 1, 21, 1, 16, 12, -5, 1, -3, 0, -7, -1, -1, -2, 10, 6, 11, 6, 27, 20, 12, 26, 39, 31, 30, 27, 3, 10, 0, 13, 19, 7, -2, -5, 19, 7, 4, -1, 0, 6, 7, 2, 3, -5, -8, 12, -1, -2, 8, 15, -6, 5, 0, 18, 1, 4, 6, 1, 0, 4, -15, -1, -1, 7, 17, -1, -4, -10, -13, 17, 14, 6, 1, 8, -11, 28, -16, 6, -12, 2, -9, -14, 12, 6, 5, 29, 14, 16, 28, 21, 19, 35, 30, 24, 22, 6, 10, -3, 18, -23, -4, 5, -13, 12, 3, 15, 13, 22, 20, 4, -4, 28, 9, 32, 3, 18, 11, 14, 2, -16, 6, -14, 32, 13, 43, 49, 47, 56, 31, 48, 21, 5, 0, -3, 5, 2, 1, 1, -6, 8, -2, 12, -14, 7, -32, -1, 4, 12, 14, -6, -2, 9, -2, 18, 0, 11, 6, 3, -5, 5, -2, 17, 3, 14, 1, 3, -11, 14, -5, -3, -16, 4, 9, 19, 0, 15, 11, 0, 6, -9, -1, -3, 0, 14, -9, -23, -13, 6, -21, 1, 4, 0, -3, -16, 12, -7, 2, -1, -13, 0, -30, 10, 11, 13, -18, 10, 21, -5, -9, 4, 6, 6, -11, -5, 15, 5, -10, 2, -3, 2, 5, 14, 10, 2, -4, 3, 5, -4, -5, -14, 3, -10, 19, -12, 9, -20, 5, -14, 10, -23, 13, -1, 17, -6, -17, 16, 9, -12, -11, -8, -11, -10, 0, 1, 7, 12, 0, -18, 1, -2, 16, -3, -15, -6, -5, 1, -4, 18, -10, 9, -16, 8, -9, 7, 14, 6, -2, 0, -1, -6, 5, -1, 3, 13, 1, 14, 7, 12, 4, -4, 1, 1, -2, -20, 15, -1, 0, -13, 0, -11, -5, 24, 3, 23, -7, -17, -8, 5, -10, -5, 11, 7, -11, -3, 0, 16, 1, 0, 0, 9, 1, 3, -14, 18, 10, 10, 9, 11, -5, -15]
6.81499a5K4Ok1Lm%jPqJ8j7nLL4k6Qj2OJnJ7Ok3qJ5Nj1NkNnMj1K0pJ2l1KL0k4lJ7qr
6.79260hJ8Ok1kRkrJ0J7k1lJ1%TnJJ7qk1J0RNk4Ljj2PK0mJj2kK5k5K5l4J4OKJ2l2L0
6.77124A2l1K8nRn%J1j9J2k3kJJ0k0KL5l5J6J7pTK1k0j0J0%JOPj0j5J1JLJ0k9J2RmL
6.75089Ej5PJ7k9OJ6njJTj6J7j7J1K6k5J6Lj3j6K4j3nJ3ljJ8k7mK0j0MLj1Qk4L0j8K3
6.73105A6knl2M7k6MoRoLO%Mkj9J3qK3k2K1k3QOj1J3j4LJ5j0j3PJ4m%j3kKOJ0rJ4k3
6.70968fJ7j3QmOrJ7l1J8KnkjL2j8KoJ3j5NJ3l5K6pPj2JoK7k7J6rpJ1J7q%k0J8o%kR
6.68781A6k2PL7l8KoPJ4nj6J0rK7j4lmlOTk0J1MpJ8k2K5l5J8Qj2mJ2kJjnJPRNm1K6J6
6.66593B4j1kNOpJ2nJK0j3J8j5K2mMqJ6%oJ4JMkPL2j8M7j1O1R0K30M24P38P53K33J2
$$ y = [-15, 9, 15, -6, -3, -7, -7, -8, -1, -9, 9, -8, -13, -10, 24, -2, 6, -6, 0, 1, -4, 13, 19, -4, -12, 3, 8, -3, 2, 0, 5, 0, 4, -7, 13, 6, 18, -13, -11, 19, -5, -8, 9, 1, -8, 10, 16, -5, -7, 2, 0, -9, 1, 18, -3, -6, 5, 5, 5, 0, 1, 18, 10, -11, -1, 8, 13, -11, -8, -9, -21, -14, 6, 2, 3, -9, -11, 14, -11, 14, -20, -6, 0, 2, 14, -18, 12, -19, 9, 4, 13, 8, 8, 19, 0, 12, -11, -13, -12, -2, -22, -20, 15, -20, -4, 13, 6, -1, 20, 0, -10, 0, 0, 1, 7, 14, 4, -11, 0, 1, 4, 14, -15, -3, 6, 2, 5, -10, -3, 14, -15, -9, 7, 2, 1, 2, 3, -13, 4, -13, -2, 24, -1, 15, 18, 5, -11, 13, 0, -5, 8, 5, 4, 22, -5, -9, 11, 1, 5, 8, -3, 5, -19, 11, -7, 16, 14, 9, -23, 24, -2, 2, -4, 5, -1, 2, 8, 8, 12, 10, -9, 4, -4, 19, -3, 18, -5, 3, 9, -2, 11, -3, 0, 15, 5, -8, -1, 13, 9, 9, -4, -6, -4, 2, 12, 3, 17, -6, 11, -2, 6, 2, 8, -1, 16, -15, 3, 5, 0, -2, -3, 29, 11, 13, 7, 20, 5, 10, 23, -12, 14, 7, 14, 2, 3, -3, 24, -3, 13, 4, -3, 8, 25, 17, 17, -3, 15, 9, 9, 7, 16, -6, 1, 38, 0, 2, -4, 3, 17, 12, -4, 6, -3, 24, 10, 7, 3, 0, 6, 12, -8, 3, 7, 0, 18, -4, 21, -14, 4, 12, 0, -4, 8, 6, 7, 6, 1, 2, 9, 18, 23, -18, 8, 24, 13, 11, 16, 22, 15, 27, 22, 23, 43, 30, 48, 33, 55, 51, 55, 47, 63, 63, 57, 71, 72, 76, 74, 81, 113, 95, 142, 131, 192, 282, 512, 936, 1674, 2427, 2660, 2672]
6.64762B672J23R3J87Q2k25l39k62n14n98m25k76j55l4j6N6R9K90N11Q09M48P6M6R3
6.63592B741Q7J90p7l19k83l49n73n41l62j53j33k7o3Mm3k4J3j4rk3OoJrj1NrK3Lj9
6.62066B6j3QJ9k0nk3L9k7J1k2K3j3%rlJ8Jqj4mlL4j3K1k4Qjnk2J2QJ2Jj1J9k9mKJ2
6.60082AoTJ9pJ3j5TJ0QkQMj0Mj6QJ0j2J4J2l1J8l0M4j6lk3K6j9K5j2J6r%OkJl0K8Q
6.58047A9j0Mj4K1j0J4j3%j0J6j2J8k5J8koJ5Rk7J6l3J4k0K7l0L8l3L6r6R1j%j9K2j3
6.56267DlrJ5k0L1rl%TQj3K3k3Rj1K3k7K8m8L1%kmMrJ3MrLj9J5nJ8l4J1K2rk3J8nQJ
6.54130DJ0k3OJ3lj0pK1oJ0Kj5RqLmPk%TMj0k2QJ7JoJ4mj1J3j1J0j1J0mJ3k6K3k1J7
6.52044A1j4K1k8K6%j4K1l0L0j0j2NK1k2KmqmJ4klKJ7j6lj0J4k1K6njJ7k0K2j7J2mj3
$$ y = [2672, 2795, 2888, 3075, 3157, 2932, 2593, 2331, 1817, 1219, 794, 518, 363, 329, 313, 369, 468, 758, 1269, 2078, 2526, 2602, 2648, 2741, 2828, 3018, 2941, 2622, 2339, 1990, 1417, 876, 514, 361, 228, 201, 138, 142, 99, 75, 88, 74, 65, 42, 48, 42, 43, 34, 23, 28, 19, 42, 45, 26, 13, 21, 40, 20, 15, -8, 31, 4, 15, -7, 16, 3, 3, -6, -9, 9, 10, 2, -12, -16, -19, 15, 2, 23, -1, 7, 6, 1, -21, -9, -1, 11, 12, 1, 20, -9, -13, -11, 1, -5, -11, 8, 1, 14, -1, -16, -6, 2, 0, 8, 12, 2, 6, -10, -2, 8, -4, 10, 22, -9, 9, -21, 23, 7, 4, -19, 7, -12, 13, 1, 17, 8, 8, 14, 12, 13, -17, 11, 19, 9, 13, -1, 20, 10, 24, 11, 11, 1, 17, 5, 23, -2, 16, 14, 8, 23, 32, 5, 21, -12, 2, -18, 9, -21, 17, -16, 20, -76, 15, 14, 14, -5, 17, 4, 1, -8, 7, -13, 18, 9, 6, 6, 6, 14, 1, 24, 1, 10, -1, 22, -5, 23, -25, 6, 6, 4, 0, 4, -5, 8, 12, 3, 6, -13, 2, -3, 15, -19, -8, 14, 5, -18, 0, -5, 3, 4, 14, -9, -3, 10, 7, -3, -10, 11, 5, 15, 17, 2, 11, 3, 6, 2, 9, 7, 7, 7, 11, 1, -21, -13, 4, 5, -1, 13, 9, -2, 11, 0, 10, -1, 9, 5, 18, -8, 15, -6, 11, -3, 18, -10, 16, 16, 2, 23, -7, 23, 13, 1, 6, 27, 5, 7, 3, -5, -9, 5, 3, 0, 2, 19, 3, 0, -10, 4, -17, 9, 4, 3, 20, 0, 22, 5, 17, 13, 0]
6.50111@%Ojk1J2NJMlJ5j6J5j7ljPlMJ3j0mrjPLj2KLJ4k2%K0Noj0J7k5J1%K2j9mLjj1
6.47822a0K1k2JJ2OnTKRJj1NmQj6OLj7QJ0Mj%Jk9K5j2Qj7L4k5K2j8JNj1R%KrJ8qj4K6
6.45584A3j0oLj0KJ2oj6J9KJ5j3j2qJ0K0kj1jj2J0oK1k2J2KToJNpQj9J0nK2k4KlJ6j
6.43498Gj8J0Tjj7NL%KRjJ3k9K3k2%J1MTk0J2pj0K0k3K3Pkj6J0Ok7J3JpMRokjNJ0qj2
6.41260hJ3jj0OJj7J3jJ1J6l6K8k7J5Ok5K6jnNj2LjJj7K7Rk0J0k0J0Mj3J0nPlj9K3J0
6.39225A3k7K8k4jMJ5njj9J5QmjljLk3L0k8J6NJ7l4K9ojj2KrROrJ3j6J6jj0oJ8j9lo
6.37088b2jJ9lnlJ9k2J7jnk3J9J1lRrJ1pQrnK3k9J1pQJ4k1N%J6Pk2J0kJ0Pk1K0j8K0
6.35002B6l3K9k0K6m4L5j4J1kj8PjJ7jj1MJ7j0j4J8j4Qk5J6%j6PTMJ3j3q%J6k5jRTk2
$$ y = [0, 0, 6, 5, -16, -4, 1, 2, 6, 3, 18, 2, 17, 0, -3, -4, 3, 0, 4, 17, 7, 3, -6, -7, 0, 3, -9, -7, -4, 10, -12, -12, 8, 13, 7, -3, 14, -11, 0, 0, 22, 3, -1, 2, 1, -10, 11, -11, -10, 2, 8, 3, -2, 0, 9, 10, -1, 4, 0, 8, -8, -2, 1, -16, -8, 2, 6, 5, 5, 6, -23, 2, -10, -2, -19, 15, -10, 12, -6, -5, 0, -11, -2, -2, 0, -9, 9, 1, -13, 13, 3, -3, 0, -10, -8, 4, -2, -18, 1, 3, 18, 5, -7, -15, -5, 15, 13, 2, 1, -11, -1, -7, 14, -8, 4, 6, 8, 2, 3, 8, 1, 9, -10, 0, -5, 17, -7, -5, -8, 8, 7, -11, -1, 9, 8, -9, -4, -1, -1, 1, 10, 9, 22, -7, 16, -6, -6, 5, 9, 13, -7, 5, -2, -12, 8, -15, 8, 15, 13, -3, 7, 13, -14, -1, 0, -7, -3, 6, 0, -2, -3, 2, 12, 4, -8, 5, 4, -6, 0, 1, -16, -3, -4, 7, 23, -13, 15, -12, 3, 9, -16, 10, 9, 4, 9, -3, 0, -1, 0, -17, 10, 19, -1, 9, -11, -1, 3, -10, 0, -5, 2, -1, -20, 3, 13, -14, 14, -10, -11, -7, 8, 3, 2, -17, -2, 6, 2, 1, -2, -3, 0, -23, 7, -21, -5, 0, 17, -17, 12, 6, 5, -7, -5, -14, -5, 1, -8, 5, -11, 5, 4, -6, -12, 6, -13, -16, -22, -23, -4, -7, -12, -15, 4, -18, -1, -2, -7, -30, -11, 0, -3, 6, -3, 8, 1, 9, 0, -5, 18, -11, 0, -7, 1, 15, -6, -1, -1, 15, 22, 0, 10, 8, 18, 25, 4, 24, 6, 26, -7, 22, 2, 28, -16, 19, 5, 16, 14, -4, 3, 2, 19, 18, 7, 11, 28, 18, 4, 22, 8, 16, -9, 7, 7, -9, -2, 5, 9, 22, 9, 1, 1, 17, -8, -9, 0, 9, -13]
6.33018a3M3m1J4jj4J1J6l7L7k9L8j9J3l9J6%QPrL0m7J7MpJ2k7K2j9KK3l1K1j4K4j8
6.31238gjkJ8j3LJ7j2J5k5K9m8K9oQk1J5nJ9k0J6j6J5rLOk1J9j0K3k7%kK6k9J1jMJ8
6.29305A9k3Rj2RlkK4m6K5J5k2MNQk1K0k0RkPRl2J2%RMqj6K4MQrj3J9qPk8K3pOp%jO
6.27066EjlJlk5L3pkRjrOQk0nj1M5j7MnJ4Kj7OJj7NJ0olRj0J3k8L7k3J4k1K0rQj1J2
6.24879HJOl2%J2NRj0JnrJ3jL1k1qKkomRpRTqLk5L7l6%J6MrK2j1rojKK5j1TJ7joj7K2
6.22488GrjoJ4nJ2j6K8j6mKkoK1j0j7J9j0jRj1RrpJ0Rnj5%NJ5pLrMrJ2%jk0PJ8J0j0
6.20250HrJLknMnLPlj2mNJ9j3J1jT%j6K8j0okKNj8mRQk9K8Pk6J8j5J2lPjJ1j1k3K3N
6.17960ERj5TJ3M%rJ5k0J0JK0k2K0m6L3j4PQqK0j1lK4k9qJK7k9MJ8j5NJ0JokMnqknN
$$ y = [-13, 30, -11, 3, 2, -12, -1, 15, -22, 15, -14, 24, 5, 18, -21, -5, -5, 3, 10, 1, 31, -16, 1, 5, -2, 10, -17, 5, -14, -12, 11, -20, 1, -13, 11, -7, -8, -10, 8, -5, -2, 15, 3, 18, -7, 22, -26, 3, -3, 5, -16, -1, -6, 13, -7, 9, -7, 8, -1, 2, 8, -13, 6, -4, 19, -8, -8, -10, 16, -13, -2, -3, 1, 19, -4, 5, -7, 2, -1, -3, 21, -25, 0, 15, -7, -3, 2, 10, -11, 9, -11, -2, -4, 3, 12, -20, -8, -8, 1, 5, -3, -19, 5, 9, 17, 8, -5, 14, 6, 13, -15, 8, 1, 7, 0, 0, -1, 5, 4, 1, 2, -1, -26, 7, 0, -2, 7, 6, -3, 3, 11, -9, -14, -25, 20, 3, 7, 2, 16, 18, 1, 7, 8, -9, -4, 6, 0, -3, 6, -4, 9, -19, 18, -5, 9, -12, 8, -1, 7, -4, 8, 9, 15, -17, -17, -5, 0, 9, -1, 0, -5, -14, -1, -2, 29, 8, 0, 2, 0, -6, -10, -1, -8, 1, 10, 2, 5, -20, 17, -19, -19, -3, 1, -8, 14, 3, -6, -12, -13, -11, 14, 3, -8, 9, 8, 2, -15, 7, -2, -3, -9, 5, 0, 12, -4, 24, 8, 4, 6, 4, -2, 19, 9, -8, 11, 1, 0, 9, -2, 7, -2, -9, 1, 10, 5, -10, -10, -5, 10, 3, 6, -3, 1, -8, 4, 4, 3, -17, -10, 8, 18, 8, -1, 0, 3, 1, -4, 0, -5, -2, 5, 2, -10, -14, -9, 10, -3, 8, 7, 6, 6, -10, 18, 8, 2, 0, 2, 7, -11, -15, -6, 2, -27, 1, 8, -18, 0, -15, -3, -6, 1, 0, 11, 0, -23, 0, 5, 14, -1, -16, -3, 1, 1, -8, 7, -13, -3, -2, 18, -4, 16, -30, 3, -11, -4, 4, -4, 16, 5, 2, 26, -3, -11, -10, 17, -12, -8, 10, -5, 0, 10, 11, 5, 3, 7, 2, -6, -8, -13, -8]
6.15773hJ2NJ0k7J4nTMJ0j2rL3k0Pj6j0K4j6KJ3J0k2pJ3Okj6J8l5LL3pkmJ9m0PJ8OR
6.13738A3j0J4k8L7k8j0L7k0j5RJ3j5J1j1nj0LTpJ9joJ5J2l0J4j4K1j5%J1Rl5J5j0K0
6.11907FpOjk%j1K3j6J4k8J5j6J6Klok7M8j9J4kk3kJ7lJJ8NJ3o4L9j4L6l6MRj5%NJ3
6.09872IkOj5k2K0Pj4J2jNpKj3J9j9pRJ9Lk0J0j1pK8mj8rK1j4K2j7mQKJ3j8K3J2k2r
6.07837cJ5rljj3J0J5j0L7l5lrOj1RJ3j9J8qJ3oTKj8L3j3j9J2J3j1J0onJ3Oj7nJ1pk
6.05802cK3l1K1k7K0j3K1k0J1JTLjrkK2k2J7j6j0J8k0K6j4Kj1J3kjJ1j5K8m0K1J4j2
6.03971Dj5J5j4J0KQj9nJ2j5RTJ%TkK0k6KJ2k1J6j1mJLJ4Koj2K1j0QTrk6%J4PlOj7K1
6.01783A0j1nOJ7Qk2Mj8L2j6n%ToqlJ5MJl%j3J3j7N7m9OqJ1pj0NJ0njNj1J7lj4L2l9
$$ y = [-8, 4, 9, 19, -8, 6, 1, -4, 0, 10, -2, -11, 22, 2, 9, -7, -17, 7, -9, -7, 6, 16, -6, -13, 0, 6, 4, -12, 6, -29, -26, 7, 0, -2, -6, 13, -27, -20, -2, 4, 13, 3, 17, -11, 26, -2, -12, 25, 5, -10, -1, 12, -3, 8, -3, -8, -18, -15, -12, -19, 0, -1, -7, 8, 20, -10, 4, -10, 11, -4, -4, 7, 16, -19, -4, -14, 6, -1, 5, 4, 2, 2, -9, 14, -2, 12, -16, -1, -17, -1, 1, -2, -8, -35, 13, -6, 8, 6, -17, -19, -2, -5, -4, 14, 19, 32, -32, 7, -7, 29, -7, -3, 6, -9, -9, -4, 9, 7, 13, -2, -24, -4, 3, -11, 1, 0, 5, -2, 0, -13, 6, -13, -20, -11, 8, 11, -9, 1, -10, -17, 11, 7, -11, -20, 1, -13, 9, -8, -12, -4, -2, 11, -7, 16, 28, 6, -3, 12, 3, 0, -1, -14, -4, 11, 1, 38, 3, 0, -9, -3, -14, -5, 8, -11, 7, -1, 12, 6, 0, 2, -16, 17, 4, -15, -3, 10, -1, 9, 3, -2, 11, 17, 0, -5, 6, -1, -3, 20, -11, 10, -17, 3, -10, 11, -9, 2, 3, 4, 7, 6, -3, -5, 17, -5, 12, -4, -14, 4, -16, 10, -4, -2, -13, 0, -2, -3, 8, -7, 21, -19, 2, 16, 4, -11, 4, -10, 0, 2, 10, -9, -14, -2, -17, -8, 1, 2, 2, 2, 0, 20, -6, -4, 8, -13, 3, -8, -12, -11, -8, 6, 8, 2, -10, 11, 1, 9, 17, 8, -18, -18, -4, 3, 0, 6, -11, 10, -1, -6, 0, 17, 25, 3, 7, -11, 21, 5, 0, 0, 0, -6, -14, -17, -2, 2, 3, 0, 0, -13, 0, -17, 40, -9, -3, -11, 0, -7, -17, -12, -2, -7, -8, -3, -14, 3, 0, -14, 18, -21]
5.99647b1J9%qj3M8l8K0j7QRk8K0LJ2k6J7knNkj0K2j9MJOk0J1mK9j8nJ1j9PmNJ4qTM
5.97561@MmoJ1j3J1jkjj0K5j3J2l0RkJ4k7L2rJ1k8K1j0nJ3JTKoRonmk%J3J0l4RJ6j7
5.95425a1RJJ1okNp%L%Lj3PMmJ5k1Mj4LNK5l9L6j4mMJ1j1J7rj5J1PNj3nJ5j4oJ0%J6
5.93237A9k6K0l6L5l5J2J4lj1NjRkTKJmOKj3%J7mKnk1K8rL%jj2K0j6J2pQj2J5k3M1l8
5.91100a0J9j5J1j6K5k3NoJ1k0K2pJ0rK5m3J3K1l0L1j6qlNJ6kJl%j5J2k3K6lpOjJpL6
5.89066B9l0lNrLMNJ4j0j2NRj1%RKpJ2lj4J5j8lQj1NJ9j5Lj3QLJlj2J2K2l9J2J5%pj4
5.86878a4J1J4k0K2k8J6JkpmJ1joJ6j1J3j1JKNj5lJ6Pk0K1j0j4J2RJl1K7j8Rk1J5J6
5.84945IPLj2knkk8J6M1l1%Ok1K6nJ9l6J2j0K1KrOj0mKTj2L%K5pj3j4K3J7Rk4j5J7j2
$$ y = [-21, -2, -2, -10, -23, 25, -13, 7, -10, -2, 7, -21, -1, 2, 14, -12, 5, 3, -2, 3, 1, -9, 13, -6, -2, -1, 5, -15, -4, -8, 21, 3, -2, 9, -10, -3, -7, -2, 12, 4, -4, 0, 4, 0, -6, 5, -8, 3, 2, 0, -1, -11, 14, 1, 13, -17, -8, -10, 4, -23, 9, 0, 11, -17, 4, -6, -11, 2, 3, 4, 6, 0, 9, 3, -2, -6, -8, -8, 5, 15, -19, -10, 6, -11, -2, -1, 10, 4, 2, 7, 0, 0, 3, 3, 6, -7, 0, 4, 0, 15, -6, -2, -16, -13, -8, 17, -22, 14, 0, -4, 0, 11, 0, 17, 8, -7, 4, 11, 16, 3, -2, 13, -1, -7, 3, 3, 19, -7, 13, -23, 12, -23, -11, 3, 0, -11, -6, -7, 2, 0, -2, 0, 1, -3, 3, 5, -8, -8, 9, 5, 7, 2, -19, 9, 0, 3, 3, 2, -10, 10, -6, 6, -1, 7, -5, 10, -13, 28, -10, 9, -6, 5, -11, 14, -9, -4, -10, 1, -19, 3, -4, 6, -3, 22, -21, -8, 13, -17, 14, -2, -10, -13, -8, 8, 6, 7, 4, 4, -11, 1, -22, 4, 1, -6, 0, -1, 0, -7, 29, -1, -4, 1, -8, -5, -1, 4, 18, 8, -4, 1, 10, -1, -1, 8, 10, 3, 15, 12, -2, 13, -5, -8, 0, -11, -6, 13, -2, 1, -12, -4, -1, 0, -3, -15, -3, 19, -20, -8, 7, 7, 0, -14, -3, 11, -9, 13, -15, 1, 2, 0, -7, -11, 0, -1, -7, 9, -2, 11, 0, 1, 3, 8, -7, -10, 6, 13, -7, 14, 4, -10, 2, 11, 12, -19, 8, -10, -1, -22, -7, 9, 16, 19, 7, 5, 0, -2, -30, -14, 27, -4, -4, 2, -19, 7, 2, 21, -15, -3, -13, 8, 10, 1, 7, -3, -7, -5, -3, -15, -12, -12, 13, 6, -7, -21, 2, 19, 28, 4, -11, 6, -6]
5.82859fkQLkNjTNl2K6k0K2nJTRk5L0j8n%TKLKj4RJ7k0J4j6J9JoLj0J0j7K8j2oj3L5
5.80672B2k6Lj3NJ7Jj2lk3L4Ql5J2%oK4lj9LpJ2L1l7M0m0NlK1qNkoK0j2lnqmNTJmkJ6
5.78433Ik1KMrL6l8K6rkNqJ1j7J8lMj0J0k2K0jNk2OJOQmnmK8m6K5lk2J4Tk1J9rJ3m0
5.76297c2N6k4kQjpKJ4j1lTLJ1mj4j0K1j0j1K9ll5L1k0J7Pk9L0%j3j0QjK0k1J7k6L0
5.74364A4j9KkJ1O%k0J4k5K5nj4K2j4L7k8J3k9J0%nK2j6KJ4j8jTpQMmjNJ1l4K6Rk1L2
5.72329B3l1J1Ppk1PJ9rpJJ1K3k8KoOknJ1lnK4j7J1k6J1j0QJ1k7M7k4j9QJQpMkJ%Tn
5.70141fJ0j6jJ8lqj2K1Mmj2%J6k6J7%J8j4Jj3j2NJ9l2L7m0J8J1klJ3j0K2j6qjj5L9
5.68208A5l9L8k1JLNMnj0J5j9J7j1K2l2J7LjoLJ3j0TKJ0Lpjj5J8jNPkmpj0J3qPMj5j
$$ y = [-6, -8, 0, 3, 1, 6, 5, 4, 9, -23, 3, -17, 5, 0, 1, 2, 11, -14, 16, -2, -7, -7, -7, -5, -2, 0, -14, -5, 12, -8, 6, -10, 9, 10, 4, 7, -3, 7, -10, 18, 6, 0, -13, 22, -4, -1, -14, -9, 8, 9, -3, -6, -29, 5, 13, -22, -10, -10, -16, 8, 5, -14, -11, -18, -6, 25, -12, 28, -12, -7, -10, 11, 3, 8, 6, 0, 20, 8, 5, 0, -8, -12, -7, -2, -1, -5, -7, 9, -12, -10, -6, -15, 21, -17, 9, 0, -2, 3, -5, 6, -11, 7, 4, 8, -2, 8, -14, 6, 5, 10, -12, -6, -5, 1, 9, 5, 0, -4, 24, -22, 3, 0, -22, -8, 6, -15, 4, -5, 8, -32, 24, 0, -2, 6, 5, -2, 0, 14, 3, 0, -3, 0, 11, 7, -7, -17, 4, -6, -17, 12, 9, -26, 5, -15, 2, 9, -20, 10, 10, -3, -13, -5, -6, 14, -7, 10, -16, 14, -5, -3, -5, 6, 12, 12, -8, 6, -19, 6, 1, -13, 9, -5, 32, 4, 17, -12, -2, -2, -7, 15, -1, 1, 15, -3, -4, -5, -12, -4, 0, -4, -5, 0, 11, -23, 3, 12, -9, 23, -8, 3, 10, 3, -18, -11, 8, -1, -8, -7, 4, 27, -1, 1, -5, 1, -1, -6, 5, 2, -3, 21, 4, 15, -11, 0, -10, -2, 9, -18, 29, 5, -14, -6, -5, 3, -4, 0, -2, -1, -1, -1, -6, 4, -12, -13, 5, 2, -6, -18, 3, 7, 3, -9, -9, 7, -19, -2, -2, 16, 2, 3, -10, -22, -17, 2, -30, 7, -33, -15, -4, -6, -9, 4, -6, 16, 0, -8, -9, -24, 15, -24, 14, -7, -6, -3, 2, 6, 1, -9, 6, -13, 4, -7, 15, -17, 0, 3, 2, -4, -1, 12, 2, -8, -6, 4, 7, 0, -1, -16, 2, 1, 6, 13, 11, 7, 0, -10, 3, -5, 2, 6, -9, -10]
5.66021a0J2J1klqK0k4J5j4J%J0%mT%NKj1J7j4J4j7JkNJ2k0J9nQpjoj%LJ9k6J1r%j9
5.63833b2LK3j0KJ5j1J6Jj7pMKQk1J3mJLJ5k2oKQMLk3J8k0J7rK4rKj2RqRj5NJ6k7K0
5.61697@mkRk2J8TnOmk2NKj2K1j1jj2J8j6J7j9J5J0j1Q%j0KJJ3%l4K9plmPJ5l1M2l5
5.59611iJ1jKPk1J2pJj8j1K7J0%j2J3MoNkQl2K2KJRk4Qoj6L2l2K1LlpL0l4J7rJ6lnj
5.57424BjTrRJjq%L2k9MnOlj3J9oJ8k1jRj7J9nMj3KJ6kqJj2J7LPj1oj7L4j1KnJ1pqr
5.55084a3K9mnJ7l3K0k3LOKk1K8o%j4K4Pl0J4lj5J1K1Pj6kTJRk5NJKN%J0k2J6j6J0k1
5.52998b3L3j3J9j5pRpJ3qJ1rjJ5j4%k1K1j5J4nJ3j0%TOj0NJ1j0Noj0j2K7Rk9K3j6j0
5.51014a7J6pK1j5qJ4krK5k5J9l2K0j5K4k0K3k1K1j0lLNTj6KJ0kmqJ8j2%oQkQk5QNJ7
$$ y = [-10, 2, 13, 11, 8, 0, 20, -4, 11, -3, -2, -2, 8, 8, 4, 0, 0, 5, 7, -4, 13, -1, 13, -4, -3, -5, 0, 12, -8, 11, 6, 14, 7, 6, 0, -1, -1, 2, 21, -5, 6, -3, -3, -22, -19, 4, -6, -4, 11, 0, 16, 17, 0, -7, -3, -1, 7, -14, -1, -5, -4, -1, 14, -8, -14, -12, -4, 0, 3, -20, -2, -22, -5, -14, 10, 1, 3, -9, 0, -8, 1, -14, -9, 7, -20, 0, -4, -6, 3, -19, -1, 17, 12, 18, 14, -8, -3, -1, -13, 8, -3, -4, -16, 2, -14, 3, -16, -1, 9, -2, 6, 6, -4, -2, -1, 12, 12, -22, 7, 0, -3, -7, 0, 15, -16, 26, -9, 2, 1, 3, 10, -11, 1, -6, -5, -23, -34, -7, 3, 3, -9, 4, 8, 2, 7, 5, 13, -19, 3, 5, 6, 15, -9, -1, -7, -23, 9, -23, -2, 1, -2, -9, 21, -13, 4, -5, 11, 8, 3, 2, 1, 0, -9, 0, 1, 0, -8, -8, 24, -5, -1, -6, 0, -3, -16, 3, -3, 15, -6, -7, 2, -15, 4, -1, 3, -10, -8, 8, 6, -2, -1, -13, 4, 7, 14, 3, -3, -20, 14, 3, 5, 0, 11, 4, -4, -13, 16, 12, 7, 24, -9, 11, -12, -9, -3, -1, -22, 6, 0, 0, -14, 10, 17, -13, 1, -2, -17, -6, 15, 22, 6, 4, 2, 3, 12, -13, -8, -7, -5, 0, 0, 10, -12, 4, -12, -2, -23, 10, -3, 16, 1, -6, 3, -4, 9, 1, 12, 3, 2, 17, 3, 3, -18, 3, -12, 2, -3, 10, 0, 0, 0, 6, -4, 1, 12, 2, 7, 1, -9, -21, 6, 15, -14, 9, -7, -17, -1, -8, 13, -2, -10, 4, 2, -7, 18, -7, 12, -20, 0, -15, 9, -11, 12, -9, 12, 2, -1, 2, 7, 12, -4, -2, 8, 6, 2, -6, 12, 0, 0, -6, 2, 0, 8, -17, -9, -4, 13]
5.48928A3k4K4j8J5oRKj0j5J4k6L2j6klJ0%lmJ2m%jKlOk0M3m3K1nPk7OJ4jLj2QJ3rk
5.46792@RkNj1nK3j7NknLj0K3rLj3LJ1mj7K0poJ0Tj7L9j9qklj3QK1k1J4lk0%ULoLK1
5.44502A4k3LNlQlLRKj2j8J4Kj0J5j0j4L5l1K5j8K4rJ6l5J2Nj1mJ5Pk6Rl1N5j6J1j3
5.42569BJ8k5J4j6%j3K5j0K4l5K8pK1k2Kj4Rj1J3KOl0J8QJ4k0Lj5QLrJ3j7K0k8OJ2J7
5.40636A4j7pJ4j6K7pRpj9%MnrK0NRk0qL1k2lj0LOJTOkQJ3j7JOnJ2l8L6l1J6J5j5pO
5.38449bk3L1qJ5j3j7QJ0%Ol2M6k9Nj5J6Kk3K5kJ5j4OJj2Qk3K8k3K0nNk6K3j4K0k4M1
5.36516B6l8K4j0J7j0j6LTNRj9JlQLmJ0j2Rpj0J6k3J7LpK1pJJ2j9Rk4L2j3j9OKLqJ4
5.34430Elj4LRmrJ0J1nMpj%qK1k1L6k9K7k0QJl5K1Qrj4J5J3j6Njj2OKJ1k2PnK5k3KK8
$$ y = [13, -11, 13, -5, 10, 4, 13, 15, 5, -10, 4, -22, 10, -6, -8, -11, -1, -1, -4, -8, 4, 0, 0, -1, 1, -2, 4, -16, 27, -16, 5, 0, 7, -20, -14, 0, -1, 2, -10, -2, 11, 2, 0, 9, 7, 12, 1, -4, 19, 2, 7, 5, 0, 3, -7, 16, 7, 10, -3, 0, 11, 7, -10, 10, 3, -3, 7, 17, 0, 39, 20, 12, 10, 7, -6, 2, 23, 2, 16, 13, -7, -7, -7, -7, -4, -10, -7, 14, -9, -6, -1, -4, 4, 1, 4, 13, 15, 3, -15, -1, 1, -9, 6, -4, -18, 17, -14, 11, -7, 17, 8, 24, -11, 1, 6, -5, -9, 6, 13, -13, -4, -35, 20, 4, 15, 2, 20, -5, 9, -7, -7, -20, 5, -5, 19, -16, 12, 5, 26, 4, 6, -8, 1, -10, 3, 5, 11, -19, -1, 7, 21, 1, 4, -11, -3, 0, -9, 4, -13, 7, -21, -15, -3, 14, -3, -10, 4, -12, 15, 8, 17, 10, -9, -9, -5, -10, -19, 1, 6, 15, -5, -13, 18, -4, -7, -17, -14, -8, -7, -6, 0, -2, 6, 19, 2, 3, 9, 4, 16, -22, 14, -17, -1, 14, -1, -8, -2, -25, 6, -2, 13, 0, -17, -9, 1, 1, 7, -25, 21, -8, -3, -18, -2, 0, -23, 2, 0, 15, 1, 7, 8, -4, 4, -19, 9, -14, 6, 1, 6, -20, 3, -11, 9, -15, 26, -12, 12, 2, 19, 9, -7, -4, -1, 4, 13, -6, -5, -8, 0, 3, -1, 9, -3, 6, -1, -11, 5, -18, -1, 2, -5, 16, 9, 10, 22, 3, 12, -12, 20, 7, -12, -6, -4, -1, -9, 5, 2, -12, -9, 0, -4, -13, -3, 8, 3, 7, 0, -1, -1, -9, 12, -9, 27, -2, 25, 5, 13, 14, -21, 0, 8, -1, -15, 0, 13, -3, 2, 1, -11, -5, -3, 8, -14, -7, -12, 13, -10, -8, 20]
5.32242B0nj7Kj7lJ4rK6j5J2Qj7j3J4Kj3J7l2L6j2OmOj6J4jj2J1j5J1jlQrR%oNj1J7
5.30207Gj0LjJ7k8J2pK4j0j5QlQmMpNKkjk4L5rJ3kLj5MOj1oQoJTJ4l9L3k3L0j4NPTN
5.27918B5l4K1k2J2j9K1k0J7NlnqNj0nK9lj6NLJQTj7J1j2Lj1L7k4LqLlJ6nlMm%kJ7j4
5.25731FJ1j8K4m6M2j6qQJ9j5lq%J3j8KPT%nJMj1J4pqLMj0mJ2jPj8J7ml%nJMK5k3LK
5.23442EQj8NknK1k2QkpK4l9M9k8Rk5K0j3J3nkJ9l2K6nj6K5k3J2j4J3qNPqJ2J5j1j2
5.21458aKj0mlK9Nk8PQqLOj7K1rQk3J3j4J8KJ3k6M2k8j5j6K7kNJ9j9k0K0qnOoQK5k2
5.19372Ck3K4j4lJ1kKNqknONrL1j9J3k6K4Lk2Oj0KkJ1j0%J5j3NLj1%JoK0nKj9J9koK
5.17134dJ0qlkK4j7%j5J6JnJ2Ll0J8MqMj1K6Jkj7NnK2j3l1J1L1rj2K6OJ0K2lj4k4K5
$$ y = [20, 15, -2, 0, -17, -20, -6, -15, 11, -4, 8, 16, -1, -14, 0, 2, -11, 6, -26, 10, -2, 4, 0, 6, -10, 4, 3, -9, 2, -13, -2, -3, -6, 2, -7, 2, 2, -4, 1, -10, 7, -3, 0, -1, 16, -12, 0, -7, 17, 7, -8, 0, -3, 5, 1, 5, -2, 3, 5, 3, 2, -22, 13, 4, 17, 15, 18, 3, 7, 13, 2, -4, 4, -2, -1, 0, 14, -25, 8, -15, 15, 1, 6, 13, 20, 25, -9, 12, -10, 2, -17, 4, -16, 1, 6, 3, -2, -10, -5, -15, -20, 9, 6, -10, -5, -2, -1, 7, 15, -2, 9, -3, 0, -11, 26, 2, 5, -3, 0, -3, 13, 8, 5, 9, 5, 5, 3, 20, 6, 17, -1, 23, -23, 19, 3, -5, 3, 22, 7, 4, -4, -4, 9, -9, -7, 0, 7, 7, 2, 3, 7, -4, 10, 3, -5, -2, 2, -8, -12, 0, -1, 6, -12, 5, 1, -2, -2, -7, -6, -2, 23, 0, 3, 5, 13, -5, 0, -2, -7, 14, -8, 0, -2, -9, 15, -24, 25, -3, 6, -19, 1, -12, 1, -4, -6, 13, -19, 7, 2, -14, 11, -12, 0, -14, -1, -9, -4, 3, -5, 7, 22, 11, -1, 1, -9, -13, -16, 13, 18, -10, -3, 5, -3, 0, 6, -11, 10, 1, 9, -14, -1, -15, 3, 5, 18, -8, 34, 6, -9, -25, 2, 0, 5, 24, 5, -15, 5, -3, -8, -2, -8, 0, 25, 3, -20, 4, -10, -13, -2, -4, -2, 3, -5, -7, -12, -6, -1, -10, 21, 2, 15, -11, 13, 16, -6, 0, -10, -8, -10, 1, -9, -9, 6, -7, -2, 1, -10, -10, -9, -15, 5, 0, 2, -17, 2, 0, -6, -4, 6, -2, -5, -7, 17, 0, 0, -15, 1, 2, -3, 9, 12, -18, 0, 4, -4, 0, -11, 15, 16, 14, -3, 2, -3, 19, 6, -25, -14, 17, 8, -4, 22, 28, 38, 60, 57, 43, 19, 44]
5.15099D4k4pOJPm2J4KJ9j4J8K1mJ3Kk6mj3kNk0K6l4J2%Qk0L4m4M1n0L7j5J1lOTj2%
5.13115aQj4J4j2JTkNnNQj4J5j0JNOpJ0k9K0lK2l1KTLQlJ7j8Lj1J7jj7J%KJ8j1kJ3l7
5.10876b1J0TLMJ7k5lj5K0Mj1J0l%J1j3K3j4j3qRPJ3k9J5lj6LJ6pJ4oKorJ9j2MnK9l6
5.08791a2K7j6J6k4J1pOpQmpJ8j9L4k3kLPj1NmPmjnJ0j5L9j1l4L2k4J9l0J8qK1pj9L7
5.06756B4rj9j4L0j9J3J5l1LPK0j8ljOj0K0j4J3mk0K9k7RMqrO%QJ2pJ4l3J2kQJ5k0%
5.04721@j8J1J5oMj2RpJKPj5K8k0RnTJJ2Kj1TJ3QpMrJ6J8l2K1k0J7m0K2rLKK8j8rPo
5.02533@mTL3k5rLJ4NqMp%kKj2J0KOKrJ0k8K0J3rjqJJ3LJj7J1j0J4j0MJ0j4K6m0J1m
5.00346clK0omj7J5j5L0m2M4j9K1l0J2lJ3jK4l2pNlJ6Mpj0j3LL1j2rLj4K6k8L7k0J2
$$ y = [44, 20, 13, 19, 20, 27, -15, -1, 1, 20, 6, 24, 45, 41, 54, 56, 30, 26, 13, 11, 16, -4, 22, -12, 0, 0, 8, -12, 22, -22, 19, -31, 6, -9, 2, -1, 5, 11, -1, -1, 7, -7, 7, -5, -4, -3, -5, 0, -5, 0, 8, -6, 9, -1, 0, 5, 11, 4, 14, -15, 5, 2, 24, -7, -5, -3, 0, 8, 5, 22, 4, 7, -4, 13, 12, -5, -4, -4, -2, 16, 5, 3, 16, -21, -11, -1, 2, 6, 23, -2, -5, -20, 0, 4, -7, 3, 0, 0, 11, -2, 21, 7, -6, -14, -5, 2, 15, -14, 1, -2, -18, -15, 1, -6, 8, 2, 4, -2, -11, 8, -4, 0, -5, 24, -12, 15, -1, 15, -9, 2, -5, 1, -6, 2, -2, -9, 9, -10, 24, 1, -1, 2, 9, -2, 3, -1, 6, 2, 1, -4, 6, -9, 30, 19, -15, 17, -7, 12, -18, 0, -8, 13, 6, -13, 24, 15, -4, -18, 12, -7, 6, 21, -10, -7, 0, 20, 2, -1, -2, 4, -6, 14, 0, 13, 9, -11, 18, -9, 0, 4, -4, -13, -7, -7, 1, 13, 6, 20, -13, -1, -3, 5, 20, 0, 0, -18, -7, 8, 2, 6, -6, 3, -4, -3, -1, 6, -9, 19, -1, 8, 3, -2, -1, 11, 13, 2, -9, 4, 12, 5, 9, 0, 16, 34, 2, 23, 3, 20, -20, 2, -7, -4, -2, 26, 8, -1, 6, 0, -4, -8, 25, 0, -9, -6, 8, 13, 5, 9, 2, 2, 0, 2, -10, 0, 2, 8, 10, 1, 11, -17, 3, 16, 7, 6, -2, -1, 12, 15, 16, -1, 10, 0, 14, 4, 8, 18, 4, 30, -10, 1, -3, -6, 14, 8, 4, -13, 2, -13, 17, -25, 19, 0, 21, -9, 3, 0, 13, 12, 36, 4, -3, 2, -1, 15, 19, 12, 2, -11, -8, 23, 11, 2, 5, -9, 17, -11, 26, 6, 18]
4.98413A8%mk0J9MqJ3j2Oj0J8lOk4J5nLoJ0k0K6k5J8j7J5nLqJ3JkqR%j0Kj2K9j7mNp
4.96276Fj0L9l3jK6k7J3JJ7k9oj2K7j4K3j2K0j1J1j4Nnj4J9j1J1koJ1k4K1qrMK3l6K9
4.94394B2j6LJ6k5K2pJ1J3rJ9k3mqJ3Nk6QK4j0J4mL6m2N7j0j2J3n6L6l3M2lK4rK1QL6
4.92512A46K1L7K3M4M1N8L4L7O9J54K75O23J238K259K582J937N24m39j171j756k059
4.91444D677j711j023n42k36p8J03K77O16J376K312K508J588K88o85j345j925k123j636
4.90528B441r81m99k89j49n6l1k5o9o6j8n4p4l4l9J0k2qmK1j2JNoM6pkj7oK2l9lj1P
4.88849C2olojloMJ1j1J2l0M4k1Rj8N2j0O7%K7k4Kk6k1j5l4J2nj4MTmK3J4K6N0j4Nj5
4.86865A11%l7k3j4j8lj4lT%RnK3l6K8k7J3K1Jk3J1Qk9L6j8mJ0j4LJK5k8K5j5JJ6k4
$$ y = [18, 18, 14, -6, 13, 17, 9, 22, 10, 16, 6, 24, 21, 27, 3, 18, 13, 16, 10, 20, 0, 26, 1, 19, 2, 17, 12, 15, 7, 20, 21, 19, 11, 20, 20, 10, 12, 0, 29, 12, 8, 13, 6, -4, 35, 2, 1, 27, 0, 13, 14, 31, 2, -4, -16, 11, -3, 20, 8, 28, 17, 28, 14, 19, 14, 0, 19, 8, 19, 17, 11, 22, -2, 19, 11, 2, 6, 29, -7, 22, 6, 9, 25, 0, 22, 15, 26, 39, 30, 49, 26, 22, 14, 27, 32, 6, 14, 38, 28, 42, 38, 74, 32, 89, 79, 67, 80, 24, 60, 27, 69, 66, 90, 81, 102, 110, 146, 167, 204, 227, 271, 312, 370, 404, 441, 510, 664, 939, 1562, 2800, 5059, 7641, 9578, 10102, 9663, 8492, 6736, 4677, 2966, 1943, 1401, 1165, 1087, 1190, 1467, 2083, 3459, 5771, 8279, 9867, 10155, 9470, 8125, 6200, 4077, 2441, 1460, 961, 672, 523, 467, 436, 411, 342, 276, 258, 204, 130, 96, 57, 67, 45, 37, 33, 54, 42, 43, 48, 42, 88, 81, 79, 62, 56, 78, 39, 36, 25, 32, 26, 23, 17, 16, 13, 7, 11, 22, 11, 23, -7, 37, 16, 25, 7, 59, 49, 116, 116, 143, 119, 121, 95, 74, 59, 25, 37, 32, 18, 22, 26, 22, 45, 59, 85, 135, 121, 126, 111, 111, 74, 51, 37, 19, 16, 2, -1, -4, -4, 5, 0, 23, -13, 15, -12, 1, 22, 23, 0, 11, 19, -10, 26, 8, 4, 14, 0, 3, 4, 29, 1, 26, 11, 12, 28, 4]
4.84983DK8l9M7m1PK6j0rJ5%Jj1K3j5r%j0J0pkJ9j0j7lMK1lJ6l5K1pJ8pl0K1k2K1j9
4.83050dMk0J6J1Mkj0nK1j9K3j7TL1j2onMTjk1L7mj1J2%j0J7Mjl6%JJ4PqlJJ7k3nJ4
4.80913BJ2rjK4k3nlPK3j9Pk1J1j6LOJ2jk9K0%K4k7KOqQNkk7L0k8%J1J7J4j5J8mj2q
4.78827DJ6j1Nj6J6%j4jJ4J6j9J4k2KLJ0rK4j3Okj1j5K8j4mQnl2M7j9kk3K0J0j1OJj1
4.76843dK3j2lj3MJ3Mj7Pk5K6Pj6K0k1K1l0OMJ4j2jJ4kj8J1jOj4OmNOMqTRLJ4rj2J4
4.74707A1k0Rj1J5LJk0QJ1%pmM%J6pj3QkKK0jj1j2j0K2j0j2%L4j6lj9J0j1K3oj3J2J4
4.72672A5l2J1jQKj0J4nNjo%MkKj1PJ2Lk3J2pkLTOj8NQJKQj2mk1K4k4M5k4J5j6lJ2n
4.70434@J3%j7J7j8JMJ0%k3kJ7k8L9j3L0l0OrNJ3oJ6k1jj0J4j0J0rJ8k2qJ3%J3k9K4
$$ y = [4, 32, -7, 40, -1, 6, 32, 22, 13, 28, 28, 29, 18, 41, 26, 17, 17, 7, 17, 10, 8, 27, 17, 0, -3, 1, 22, 19, 35, 0, 21, 14, 32, 25, -5, 16, -6, 15, -4, 0, -20, -4, 7, 11, 9, -1, -6, 15, -4, 19, 2, -15, 16, 4, -2, -7, -3, 1, 0, -21, 16, 12, 1, 13, 13, 3, 20, 24, 23, -13, -13, -12, 2, 9, 1, -2, -1, 16, -7, -12, 2, 14, 5, 4, 28, 5, 0, -3, 4, 27, 8, 15, -6, 5, -11, -8, -2, 10, 9, -20, 0, 0, 24, -3, -1, 5, -3, 5, 10, 8, -19, 11, -17, -17, -6, 11, 25, 10, 28, 24, 12, 4, 20, 9, 14, -2, 14, 14, 0, -1, 13, 29, 10, 24, 2, 4, 7, 17, 8, 32, 19, 25, 23, 12, -3, 25, 11, 7, 15, 10, -22, 25, 6, 4, -19, 1, 11, 0, 6, 7, -4, 19, 7, 4, -9, -5, 8, 12, -5, 2, -23, 3, 10, -6, 14, -7, 14, -16, -10, -6, 8, -4, -5, 9, 7, -11, 0, -1, 5, -9, -3, -7, -2, 4, 8, 0, -8, 1, 4, 18, 9, -3, 11, -9, 0, -11, 4, 7, 8, -12, -4, 7, 7, 0, -4, 0, 0, 16, 9, -4, 4, 2, 4, 24, 23, 12, 0, -10, 12, 2, -10, -10, 24, 8, 5, -14, -4, -15, 8, 2, -11, 1, 15, -17, -6, -7, 1, 3, -7, 7, 2, 7, 6, 0, 0, 4, 2, 4, -7, 0, 12, 15, -8, 4, -3, -5, -2, 1, 7, -11, -6, 2, 3, 5, 13, 1, -3, -24, 0, -24, 21, -3, 12, -4, -7, 5, 0, 13, 13, -4, 13, -5, -4, 0, 10, 10, -13, -15, 2, -26, 13, 0, 30, 0, 6, -3, 2, 15, 9, 25, 4, 3, -7, 7, -3, 7, -2, 16, -6, -14, -1, -1, 12, -17, 7]
4.68501Gl%rTLK2j2kK0j4MnK0K3Pj2JO%j3j7MJ3j3k1J6j2J0j0J6MJ8JjkJj6Lkk6OqL
4.66313AoPTk0RpK7j7Oj2Oj0QMJ8l1K1j1Ppk2L0rJ7jJ0k0j4pK9Lj6JrL5k3kmpL6k7n
4.64177e%J3j2MJ5j9J9l2L2j5KJk6K7j8K8j5Nj7J2Tj3mOK3l9K6k5LJ3LOj2Kj0j2K5r
4.62243fJ4j6J0prJ2rL2k4Lj2L4k7KJ3Rj2rJRj3Qk4L5j6kMJmJ6knj5J8Kpj0LpJ1j0K9
4.60107B0k8QJ4j0J4k8J0jmPNj3%J3jmjj3K4k9J6LOTj3lQj7L4j2j4Pj0nlmJ3Lj2J2J
4.58021aj1j0K0j1J0TnkmjK1m6L9oNk3OJ%Rk1L5j8Kj3J1Kl3L6j6K3j1LqK3l0J8J6l1
4.56037a1j1J2RJ6l9J6J8j0j5K6j8LPlqJnK5j5jkJ7j7NTj5L3l9K3j6K3Jj5J9m2L4m1
4.54155c0J9nK8l7L9l1L7k3%LJ9j9%j4J4mJ1m%lj4PJ8pj1J3Lj4L4j5j3j1OJ1pk8L0k
$$ y = [7, 4, 4, -5, -14, -11, 11, -1, -3, 17, 3, 7, 2, 22, 45, 52, 40, 41, 47, 47, 34, 17, 21, 34, 21, 0, 16, 4, 14, 4, 20, 24, 42, 43, 42, 40, 41, 25, 28, 26, 0, 6, -2, 1, -5, 2, 9, -11, -2, -9, 18, 1, 7, -5, 1, -9, -1, 3, 21, -10, 11, 0, 7, 0, -22, 8, -1, 16, 15, 25, 5, -9, -16, 13, 16, 0, 1, -8, 27, 4, 2, -2, -9, 27, 0, -5, -5, 8, -4, 0, 15, -4, 15, -17, 15, 0, 2, 3, -23, 4, -14, 14, -1, 4, -13, -1, 11, -2, -6, 0, 23, -16, 10, -15, -12, 1, 4, 10, -2, 0, -10, -22, 3, -6, 8, -8, 2, -5, -14, -2, -11, 21, -3, 0, -12, 22, -5, -3, 10, 19, 7, -2, -1, 8, -5, 3, -21, 14, -2, -4, 0, 1, -3, 13, 11, 6, -9, 9, 11, 4, -6, -3, -10, 1, -9, 20, -8, 0, 14, 4, 18, -10, 0, -1, -5, 2, 7, -6, -6, 7, 6, 2, 1, -12, 12, -17, -1, 2, 8, 14, 1, -2, 6, -11, 23, 11, -3, 4, -6, -11, -14, -18, -5, -2, -14, -2, -1, -12, -22, -2, -13, -3, 7, 2, 0, -4, -5, 16, -30, 9, 3, 8, -15, -9, -8, -8, 1, -20, 15, -3, -1, -14, -3, -1, -34, 2, -14, 9, -2, 1, -7, 16, -14, 4, 20, -11, -22, -10, -1, 15, -24, -8, 10, 0, -15, 11, -7, -4, 3, 0, -8, -7, -12, 13, -2, -3, -5, 12, -5, 0, 5, -10, 23, -16, 7, -9, 14, 15, 0, 19, -23, 11, -30, -11, -16, 12, -25, 14, -17, 20, -3, -3, 0, 19, 0, 0, -14, 0, -4, 7, 3, 3, 0, -14, -7, 11, 4, -7, 6, 9, -5, 29, 14, 1, -10, -4, 7, 0, -28, 2, 0]
4.52222@%k0L2l6M4k5J1lK0n6K7Oj7J3mJ0nTK1k6L0l1joL0l5M3m4K3K0oj9PlKJ2j1m
4.50289fJ6j0Mj4J3JrjrK4j5qJ0nJ3kj3J1j5K0nPqmNJ3j5JoqL0oj3k0M2j6jrj0K0Qk3
4.48152a3J3oJ9j1Lj1jJ9pk2NJ7l1K2kjj8L6qpj7L0j9oJ4J1j5Jk0M3j2KrNqj1MJ0Op
4.46117bnTK0n0K2J9k0L3pj2pML0l0J1j1K1nKrnKJ0j7J3qjJ2Qj3oJJ3k1jlJ0kJ6Nl3
4.44031b1NJ1rP%TkTjK8k0mJ7Mj8PNmj4K2k1K0rlNmj5J6Pj7MTL0k9j3NLQJ0j1kj8kJ8
4.41793cPj3J3oJ6j7j1K9j7J1%j2Mk3K5J0Ll7K1nJ4j9jQj9J1jJOJ9kOj5koPOj3J2qr
4.39707a0nKqJ8mk0L2Pj2q%Q%J5j9TJ9LpPJj5J9j1J2j6K2l8M9l9L2k0PrJTJ0pj6K4j4
4.37622hKL3l3RqMJ%k3M3k8%Pj6nK2j0K8l8K3j5RKPj7OJ4j8nrK2%JoJ8j9J5k6OJ2k1
$$ y = [0, 0, -20, 12, -24, 20, -5, 6, 3, 23, -33, -6, 0, -17, -4, -8, 2, -3, -8, 13, -13, 17, -14, -15, -21, 9, -26, 17, -27, -4, 16, 10, -9, -2, -5, -3, 9, -2, -6, 10, 0, 4, -10, 3, 4, -5, -6, -15, 9, -6, -14, -4, -9, 4, 2, -11, 0, -15, 5, 0, 7, -1, -5, 0, 13, -2, -1, -7, -15, 15, 9, -4, -24, 18, 2, 1, -8, -18, 2, 10, -13, 0, -6, 13, 2, 5, -6, -7, 12, 5, -17, -12, 5, -26, -4, -6, -7, -25, 11, 3, -4, -21, 9, -10, -16, -2, 9, -6, -5, -25, 18, 6, 8, -1, 4, -4, -15, -11, -1, 5, -2, -7, -12, 8, -42, -20, -1, -21, 12, 5, -7, -14, -10, 20, -10, 1, -10, 11, 6, 8, -1, -6, -4, 6, -11, 2, -6, -7, 5, 13, 0, -6, -5, 8, -13, -14, -17, -7, -9, 7, 12, -21, -16, -5, -14, -7, -7, -7, -9, -11, -12, 16, -4, -8, 9, 13, -5, 2, 7, 3, -11, 11, -10, 10, 1, -2, 3, -1, -16, 0, 7, -10, -6, -2, 28, -1, -14, -9, -6, 2, 12, 1, -1, -19, -21, -3, 4, -9, 4, -2, 14, -3, -14, 15, -2, 9, 9, -3, 1, -22, 3, 13, 16, -21, 0, -5, 9, -10, -11, -3, -22, -11, -12, -11, -5, 14, 12, 18, 3, 1, -5, 2, 8, -5, 7, -1, -10, -15, -13, -21, -3, -7, -27, 5, 12, 0, -8, -8, 0, 0, 15, -4, -23, -4, -1, -8, -1, 0, -15, 4, -7, 5, -11, 11, -27, 22, -17, 15, -5, 2, -7, -6, -5, 5, -2, -18, 6, -8, -6, 27, -6, 3, -5, -1, 0, 0, -23, 20, -8, -8, -1, -17, -22, 0, -10, 18, -20, 3, -12, -3, -1, 6, -11, -5, 9, -9, -14, -23, -1, -1, 0, -6, 12, -7, 8, -18, -12, 0, -21]
4.35536b1J3NmJ2nk1J7K9k5J5j9L4l3J8j5kj8K1jnj2J3MNj0K4k1Jk9L3j3QjlJ2o%Jp
4.33552fqKJ0LoOknJ0jLNMKnj2qLNOoJ2qj5kJ6j5K8j5nJ1lqj6K6qnrOJ7rjJ8j8j5J1
4.31212gJ5j1%LJ1j2JQj0%LTMj4J3j6MRmRj8j0J2OKj3J9k9L3j4J2qLqjnQNMTj8OKn%
4.28923dJKj0ONJ9k0Nj3jJ0Nj1LMrJ2jJ8l2OJ9Rl8K2j2%mJ2j3K4k0Onj8Q%K8k1J2jk5
4.26786b2J0MJ6j0kj3J9j0K4k2J4MQj9TJK7j5J5j5NK0l4K4j0Oj3QLKj4qK4k2J0qPjl
4.24802iK6j0j5QJ8j5Pj9K2Ql6K6k1LJ1lj0J8pkj5J2OqJ1J0k9J7j2JmOj9K3J4j8nK6
4.22869A6j0J1l9K2jLToKLjkj5K9k3J1jkKkJ7j8pj1N5m2rK4Pll8J8PkpK3j4J6k9L1j1
4.20783GlrK1j1jNk4L4k4J4qLl1K7j8K9n%kj4J0pLjJPj2L3k3JNOj1kQMNLjQK1K3N6M2
$$ y = [-21, -8, -3, -7, 5, 0, -21, -4, 25, 0, 15, -4, 30, -3, 15, 0, -2, -20, 1, 0, -5, -17, -4, 0, 5, -5, 19, -2, -1, -30, 3, -10, -2, -3, -6, 6, 0, 0, 1, -6, -14, -12, -2, 1, -5, 1, -1, -6, 4, 3, 6, 11, 15, 17, 12, 0, -8, -5, 0, 6, 0, 12, 4, -11, -13, 3, -12, 16, 1, -4, 7, 4, -4, -20, 6, -2, -7, -16, -10, 7, -2, -3, 15, -3, -18, -7, 8, -3, -3, 0, 11, -1, 0, 8, -2, -2, 1, 4, 8, -6, 7, -9, -5, 4, 0, 9, -9, -19, -7, -1, 1, -12, 7, -22, 11, -3, 9, 1, 4, -4, -5, -10, -2, 3, 7, 11, -7, -1, 1, -4, -4, -3, -1, -11, -5, 0, 19, -1, 4, -9, -10, 0, 5, -6, -3, 1, -8, 4, 3, 21, -11, -5, 14, 23, -15, 7, -5, -5, -9, 3, -10, 14, -6, 0, -5, -23, -15, -15, 13, -8, 4, 3, -22, -12, -8, 8, -2, -4, -17, 2, -8, 16, -6, 8, 12, 20, 1, -18, -17, 10, -5, 10, -5, 0, 20, -14, 10, 0, 6, -7, 1, 4, 6, -8, -16, 8, -14, -4, -12, -5, -6, -9, 17, 7, -8, 0, 18, 3, 10, -9, 13, 21, -15, 11, -10, -7, 4, 1, -9, 9, 2, 0, -15, -3, 3, -5, 6, 16, -13, 4, -8, -7, -11, -5, -24, -1, 13, -5, -10, 16, 6, 17, -22, 0, -1, 2, 5, -1, 1, 4, 3, 1, -14, 15, -8, 3, 2, 0, 2, 0, 17, -1, -8, -19, 36, -6, -15, 9, 16, 13, -25, -7, 0, -2, -9, 14, 0, 16, -13, 18, 7, 4, -5, 16, 5, 4, 9, -15, 19, -5, 9, 1, 4, -27, 0, -18, 11, 6, 6, 4, -10, 0, -7, -4, -5, -4, 3, -9, 24, 1, 2, 7, 13, 2, 0, 8, 12, 17, 20, 19, 27, 48, 71, 127, 169]
4.18545A69k9Lkn7l0l8j3K9m2J2mQrJ4k0K5j1lJk5PlK6qj7J7Lj5K2j0jLj8%J6pqK5k1
4.16561a1mK1j3OQJ2k0%KNoj3J8j4J0j5K5nk0QLRj0mj1J9Qj5J3Rrj0LqR%j3qQJ2J9k9
4.14424a1J5NqL1j3k0qMLk3K6oLjmMPJPnk2J3QNrjJOJ6l1J1MqJ1k5kJ0J8nj0J1Kk2P
4.12186eNkNlTPNmj3J4MnqPJ8k9K0k4K9j1TnLTKJ0Orp%qJ0j5K1k7K9j9K7l2J1LJmJ2
4.09948Hj1J3KOj2oqJ4mqK5oPlnLl4K6k0J3Kj0PTK0j5J2l7L6k7Qj5J3Qj3LPo%K5k3o
4.07811dJ8j0J3lLTk0PkLPqnJ8J0j6Ok0NnqK9j6jJ7j3nNpQj6KL3l1RLJ1j1J8j9Omjo
4.05573CkRJ3qj4M%nJ7jqJ4l4K4k6K4j5K7m5K9k4L7k3L3j6j3J3kj0nlMK2k4RKJj7J6
4.03589Fj3K4Oj5J7qPoJ5l2j1K1j1NMj9K4Mj1k2K5Kj3J9j7J7k1K5j5oJ2%j5pK5j9L6
$$ y = [169, 140, 143, 141, 84, 54, 16, 3, 32, -10, 2, -2, 6, -3, 11, -9, 16, 5, 2, 3, -22, -15, -18, 8, 0, -17, 0, 3, -12, 10, 0, -1, 2, -16, -16, 0, -7, -15, 10, -11, -15, 6, -7, -1, 7, 19, -1, -1, 1, 6, 0, -13, 5, -9, 1, -14, 11, 6, -14, -6, -3, 6, -4, -8, -19, 0, 8, -7, 6, 15, 6, -4, -1, -9, 0, 0, -13, -21, -13, -1, 18, -11, 4, 9, 1, 32, 19, -1, -9, -5, -2, -25, 1, -5, -2, -3, -7, -3, 4, 5, 12, 7, -15, -2, 6, 11, 2, 1, 2, 8, 24, -7, 4, 8, 0, 11, -14, -16, -6, 12, 7, -3, 8, 10, -12, -5, 0, -2, 3, 0, -3, 4, 9, 5, -8, 6, 10, 5, -3, 4, 22, -7, 13, -11, 18, 7, -4, -9, -6, -3, -1, 9, 15, 6, -1, -1, -9, 1, -14, 7, -20, 9, -10, 17, -15, -4, -1, 0, -4, 8, -3, 10, 12, 18, 6, 0, -8, 6, 2, -6, 19, 13, 20, 17, 12, 15, -19, 7, -13, 0, 2, -8, -1, 6, 26, 11, 23, -14, 22, -5, 3, -12, 1, 9, -4, -1, 6, 0, 0, 25, 2, -4, 14, 4, 17, 14, 17, 20, 0, 7, 5, 8, 15, 7, 2, 20, 30, 14, 20, 0, 5, 0, -8, 21, 5, 4, 21, 8, 3, 8, 1, 9, -7, -5, 28, -3, 6, 9, 20, 9, 27, 8, 14, 10, 9, 3, 1, 10, 23, 15, 1, 5, 5, 0, 17, 16, 8, 22, -12, 12, -14, 10, -5, 22, -23, 6, -18, 19, -4, 29, 13, 0, 13, 11, 1, -4, -7, -3, 19, -5, 4, 6, 7, -10, 6, -7, 17, 23, 8, 25, 17, 24, 18, 33, 1, -10, 11, 0, 5, 9, -10, 14, 18, 7, -15, 10, 12, -1, 18, 1, 18, -3, 22, 7, 1, 13, 13, -2, -9, 16, -3, 33]
4.01707C3k1j2kJ5j1QJ0l0O4l1j8MnK7MKJk2JoJ7j7PRj5J9j3RqjQj5J7j2JjJ6Kk7K3
3.99672C0k1L3n0L7k3Qno%lRQJlMk0K6J2l5J9j5RpJ6krK0oTK5j5J6k8J8j6j4RkmK0M
3.97586C4pk4K8j2jLkj0KJ2lP%OJ3J2j4J5j1KLJ0k7J8k0L0m1L1k2J8oJ9K1l4P2n5Qm
3.95653G1J1M6j5Q8M0M4J38R6K08p2K6L3L6l7p1J84K3K72K20N20R56J944M936Q614J3854
3.94381C2165O02k865o78m294r304o646l947j928j182n26k63j78l2j92o9j64q4j06j17
3.93415A92o5n1K7l3J1J3NJ3pjk4MqRKk6j4RTj1k3J6nJ3k9JMj0j3PJ4l6L0rJ3%j7J8
3.91481B8rmjqK4j9jnRMLk0JJ0j3K6nk8L2k7K6l2L5ok6L4rKk8L3k5J6k1NJ5j4rKJ6J2
3.89447B3k8M0l4J8r%jk0J5j0K8k1K5rj6J2k1L6k8K1jQj9K7qNMJ6pKljroj8K4j9JTj2
$$ y = [33, 12, 0, -2, 13, 2, 10, 20, -10, 54, 23, 5, 9, 4, 31, 35, 37, 38, 16, 17, 11, 28, 11, 18, 27, 12, 31, 18, 27, 19, 18, 26, 11, 28, 16, 17, 16, 32, 34, 7, 30, 9, 42, -8, 29, 6, 14, 9, 3, 3, 0, 9, 17, 18, 15, 19, -1, 25, 37, 2, 21, 6, 15, 8, 24, 22, 13, 33, 27, 21, 46, 31, 47, 19, 37, 21, 7, 16, 14, 10, 30, 34, 27, 3, 31, 19, 18, 21, 19, 9, 11, 23, 20, 27, 27, 33, 46, 58, 44, 59, 48, 50, 53, 63, 36, 54, 34, 64, 23, 54, 32, 50, 44, 63, 84, 50, 122, 67, 75, 71, 82, 128, 113, 201, 241, 285, 423, 519, 727, 655, 681, 714, 750, 713, 642, 826, 849, 1121, 1341, 1861, 2817, 4761, 9697, 18311, 32165, 32767, 29902, 29224, 24930, 15626, 8980, 5033, 3105, 1923, 1397, 1134, 956, 924, 732, 663, 499, 415, 309, 192, 127, 76, 103, 70, 81, 94, 99, 112, 105, 104, 80, 84, 76, 85, 87, 61, 47, 56, 65, 54, 31, 47, 42, 55, 26, 27, 31, 21, 8, 15, 29, -7, 23, 14, 27, 27, 10, 28, 19, 15, 14, 6, 30, 11, 10, 5, 14, 18, 21, 1, 2, 12, -1, 25, 20, -8, 24, -3, 23, -9, 26, 20, -6, 28, 19, 21, -7, 26, 1, 17, -4, 1, 16, 2, -7, -5, 11, 23, -5, 35, 1, 19, 10, 10, 9, -11, 4, -6, 22, 1, 26, 17, 1, 13, -8, 28, 0, 21, 20, 28, 9, 36, 28, 33, 37, 53, 46, 48, 45, 44, 35, 29, 11, 35, 16, 17, 18, 6]
3.87412FK9pK0l2L0m4K4kM5k8K9m8P%Nl0qJK5pqJ9j7k0J8MPl4ONK2j4lJ1j3lrK5k5J4
3.85377@K9k9J6j0K3j6lJ2j3klkJ9k1rK6j3NJ3j2jRj3j8J9rJ2nLqK0k1K5l5L1j5QrK
3.83393EJj1LNKmK2l8J4kJ6Jk1J3k8M2j4K3k8K8k7J4nKLmL1m0K1%k1KK6nj6K9k1J4p
3.81409B5j9MK7Kk9%KToJ4j5mL9k9jj2J5K6l2K2k3jMk7J6J1l3K2jqJ2nL%Pj6K%oJ2L
3.79323Cjj0j7K9JQj8oLJL1%k6ORj0nJ1jJ2k8QjpTK7rKJk6QJ3j6J0oK9k2K6j8jpJ7k
3.77136A1klMj0KJj3K1Mj5%K0j1kj7NK0j9LkmJ0oJ1Mj3JJ5j8Lj1Rj1K6rK9k9Opjj3J1
3.74999@J6qk%Qj6J1Rk2J4ljlpK9k5J2Mj6mPRmrJ7J6j9M8r%K6l7JKK3JPj5Rj7k3J6k5
3.72812B0K9rL4j1J9j5J0k4mJ3K6kqk3kk9rJkJ1j8Lk5OK7jj4j2K8l7K4j4mTK6j3oL1
$$ y = [6, 35, 28, 48, 16, 46, 2, 26, 24, 69, 41, 70, 22, 29, 29, 34, 4, -4, -3, 22, 15, 7, 26, 9, -11, 7, 11, 18, -16, -10, -5, 17, 3, 0, 11, -2, -5, -14, 11, -14, 0, 29, 0, 16, 6, 29, 13, 10, 22, 9, 7, 4, 2, 21, 0, -9, 17, 4, 9, 22, 10, 9, 18, 5, -13, 6, -3, 9, 4, 7, -1, 19, -2, 23, -12, 19, 4, 12, 3, 5, 6, -5, -2, 3, 5, 1, 23, -15, -1, -3, 13, 14, -7, 6, -22, 20, 6, 29, 1, 29, 2, 16, 11, 13, 16, 12, 43, 3, 24, 24, 3, 5, 31, 26, 10, 39, 18, 32, 25, 6, 10, 37, 39, 10, 10, 12, 14, 8, 22, 7, 3, 42, 13, 12, 0, 15, 41, 9, 31, 8, 7, 11, -16, 0, 11, -22, 0, -1, -9, 3, -2, 1, 1, 8, -8, -6, -6, -12, 0, 3, 2, -8, -25, 4, 5, 13, -5, -11, -8, -7, 24, 24, -2, 4, 13, 3, -2, 9, 8, 20, -8, 0, -1, -8, -15, 12, 3, 5, 6, -20, -12, 1, -15, -5, -11, 18, -4, 22, 4, 3, -4, 13, 11, 9, 6, 10, 0, 2, 3, -10, 11, 15, 0, 0, 20, 9, 7, -10, -5, 15, -4, -1, -3, -7, 3, -3, 8, 12, -1, 0, 15, -3, 0, -11, -2, -13, 13, 4, 33, 4, 10, 3, 2, -11, 0, 16, 8, 6, 6, 14, -2, 9, 18, -4, 10, 7, 6, 3, -4, 25, 0, 12, 16, 0, -4, 3, 12, 8, -1, 16, 32, 13, 61, 52, 52, 78, 41, 42, 44, 67, 68, 75, 60, 69, 52, 29, 45, 20, 49, 40, 74, 63, 82, 67, 77, 53, 49, 62, 88, 86, 78, 55, 53, 24, 15, 16, 14, 25, 7, 10, -15, -9, 18, 17, 3, -9, 19, -18, 6, -8, -12, -16, 10, -3, -9, 22]
3.70879B2j4nj0PKPj4PTLJnK%qNrJ5j3L6j3Q0N4K1k2Jk8j3m3m2k4LkJ2Pj7Mj5Jj0J6
3.68793FnK6l7NnK2l4MTK9lrRj2Pk6J4QLJ2Kj5L7QjqjTl7Ok3M3j9nj4NK0j1rJ1N%Tj7
3.66554fL1k2k5QL8k5j3J4%K6k6%qPlMJ2M6lk2M4j3j5k5olj6mJ2k0nK3joKjJOl%pJ1
3.64418GJ3k5J3nKk3K7ormqL1j6K3j1L0rRpk2J2MKl5PpPTOl0K3mpmqJ4mRj6NmJ3Qj9
3.62180a1L1m2K0mK0k4J3Mm%k0L6k2N2n6L4l1K3k2K8l6KMNj4QjPqPkPpJ3j0pQj0J1j9
3.60145a7mJ9kK4l1%J1kJ4j1Rm0L4j6J3rJ7oj3J4k1J2Rj7Oj1J9Pj6%k0L8j0LJ1j2j0
3.58262hjnJ4lQk4RJ4k5L1j7K3k2RlK4k6Rj6PKnj0J5M%J0k1RJ2k0NolrJ3K0j4Nj0Rm
3.56126@j2NK2j4pJ5J1l5Rj5J8lj1J1Ql4M7j4LkJ3j6J0l2J1J8qpJ8j8QRj5OJLMJ0l3
$$ y = [22, 8, 3, -7, 0, 2, 9, -5, 2, 9, 12, 13, 8, 10, 10, 2, 7, -2, 13, 0, 36, 23, 103, 157, 178, 156, 157, 129, 116, 73, 31, 7, 10, 8, 20, 27, 10, 14, -1, 0, -10, 6, 1, 27, -10, -5, -10, 12, -22, -18, -14, 15, 12, 3, 12, 0, 7, -19, -5, 3, 6, 18, 20, 5, 42, 50, 49, 41, 40, 39, 2, 8, -15, 28, 9, 4, -10, -5, 15, 4, -5, 6, 11, 11, 11, -6, 25, 3, -22, -14, 24, -1, -14, 0, 0, 26, 0, 0, -8, -1, -4, 0, 12, 58, 55, 33, 77, 64, 49, 24, 18, 15, -1, -5, 7, -13, -18, 5, 4, -2, 0, -1, 0, 6, 3, 3, -4, 7, 20, -5, 8, 3, 5, -18, 9, 3, -6, -10, -18, 13, -3, 20, 9, 39, 30, 39, 32, 10, 22, 26, 28, -7, 0, -7, 0, 7, 13, -17, 6, 2, -5, -9, -17, -3, -7, 2, -14, -9, -13, 0, 8, -11, 20, -22, -2, -6, 14, -10, 3, 7, 3, 3, -17, 19, -3, 49, -7, 27, -4, 19, -3, 25, -11, -9, -5, 0, -14, -6, -7, 0, -8, -1, -3, 4, -3, 10, 0, -7, 1, -9, 2, -17, -21, -2, -4, 20, -11, -11, 0, -2, 12, 1, 10, -30, 4, -12, 1, -8, 9, 3, -10, 4, -17, -5, 4, -13, -7, -18, 1, 8, -8, -8, -28, 10, 0, 3, 14, 2, -8, -9, -14, 0, -3, 5, -19, -10, 4, -21, 10, -7, 16, -6, 3, 0, 24, -2, 7, -9, -2, 0, -5, -15, 0, 4, 4, 14, -7, 2, 14, -6, -1, -7, -10, -19, -6, 14, 0, 5, -5, 4, 0, -12, -7, 15, 1, -6, 9, 20, -15, -6, -21, -3, -6, -17, -6, 2, -32, 15, 1, 4, 2, 15, -1, 9, -23, -12, 6, -2, -9, 9, -9, -1, 8, -7, -1, 0, 3, 7, 17, -16]
3.54142a6J8oOj2MqlJ2TqorJ0k6M4k1J0j2J1Noj1J0k2L4j8j3K5j1nKLJ5rnJ1J4n1M4
3.52158A2k4K9j8j1Pj2NOJqJ4j5J3MJ2k4J0nJ0qj7K4Kj0lOpJ6nL%j7RjJJ0nj6J4%kk1
3.50021b1L4j5Qk2MJ5Pj2Mk2J8Lj0mPJ6pj1J2j1J1k3J6j2J4nJ3pK4k2Rj4mJ2pqKJL%
3.47986dQjj9K5j5OpjJ1J%j7J2mNj1J1nlJ2oJ0j7J1J2l4J7LmnK3%k6MJ4nJ8l4NlK0%
3.45850GKj3JJ0j8lMJ3jMpjMj9LMj6M2l6K6LqTJ4jj3K1k0QTqK1rj0pJ0n%rK4j4j2K1
3.43662A2m7L4pJ2pPMj1J4l3L9l5K0njNrlKK7k4J5k6K6j9PoJ1J3l0K0mqKOmJnJ1MmJ5
3.41526A9j3Momk0K4j7OJ0pMJ8j2pq%J6k0L5k7jmJ3J2k3qJ0j0Kj9M4kLl0rL5k3j2L9
3.39542A2oj5J6l2QToK0%j1rMKJ2k%j1J3lj3J5Rlj5JmQj1K3jr%qJ3nPk1Nqj2L6j3Rk8
$$ y = [-16, 2, -4, 2, -10, -6, -14, -17, -5, 7, -1, -7, -16, -6, -32, 12, -9, 1, -11, 0, 5, -1, -12, -2, -24, 10, -8, -21, 4, -7, -12, -10, -7, 8, -1, -6, 5, 19, -32, 12, -12, 17, -1, -12, -5, -17, -12, -6, -5, -13, 1, -14, -1, 3, 15, -9, 1, -4, 6, -2, -19, 5, 7, -3, -6, 0, -7, 9, 4, 7, 7, -10, -1, -2, -1, 9, 4, -12, 2, 2, 0, -21, 13, -2, 6, -16, -12, 3, 10, -2, 2, -20, -2, 1, -9, -13, -6, 10, 3, -8, 4, -7, 4, -19, -3, -15, -1, -6, 7, 0, 24, 2, 11, -3, -7, 5, -2, -10, -8, -7, -4, -4, 4, 3, -16, 9, -6, 0, -7, -8, 3, 4, 4, -13, -1, -5, 0, -11, 0, -5, -8, 4, -2, 8, -9, 2, 14, -20, -3, 0, -4, -9, 14, 14, -12, -8, 6, 1, 19, -15, -10, -13, 7, 7, 9, -4, -3, 7, -11, -14, -10, 3, 2, 6, -1, -2, 2, -17, -14, -10, -26, 16, -20, 6, 9, 1, -7, 7, 6, -7, 14, -6, 2, 10, 2, 23, 14, 4, -3, 7, 2, 2, -7, 17, 3, -9, 12, -35, -1, -8, 4, -3, 4, 8, -3, 11, -22, 17, -18, 2, -3, -4, 1, -8, -11, -9, 18, -6, 9, -17, 9, -10, -3, -9, 2, 15, -15, 5, 1, -7, -5, 1, -3, -2, -7, 4, 8, 4, 19, 6, 10, 4, 0, -20, 4, -13, -7, 3, -4, 0, 18, 6, -1, -9, -9, 7, -13, 22, -5, -6, -10, 3, 15, -8, -16, -6, -16, -14, -33, 11, 9, 12, -18, -27, 8, -15, -27, 12, 6, -9, 7, -25, -17, -9, -15, 5, 5, -6, -15, -11, -9, 3, 1, 1, -10, 3, 0, -13, 2, 11, 8, -7, -6, -10, -2, -13, 10, 9, 0, 0, -8, 5, 0, 7, -14, -9, -17, -29, 7, -6, 3, -25]
3.37303b5L1j8RLj3LoK2nJ3j0j3Jj2L5k4J6j7J4okJ7Nj4k6J3QJ2j2Pj4K6qj0rRk3L5
3.35370A2j7rK2J4l2KQj0J1J5m0K2Tk4j0QK2k3JJ8j7TL0pjj6J3Pj8K5j6J4j3J3j5LJ7
3.33488A4j4Nj5Pj2L2pRk9j1J8Mj3J5Mlk0J5pJ4j9jTOTlJ7k0JJ2k2L5Rl2rL0k4K2k9
3.31504a6K4pRj0rJ2J5j5j2J5OJl4K9j6M%Nk1QJ9KqmMJ6k2J9kj5j2K1k3J3rJ1nrNK4
3.29469A3j2j7K6l2J5lMLj3K4qO%KTjk1J2J0j5NJj9L5k3KQlmJ0Kj2J0j8OlQj2J5pj6
3.27384b0L1k0NnK9k4J0j%k7L9k2J7k2J8j2Jj3K4j5%J1j7J3pK4j7jTK0k2J8Nl1%lK1
3.25501Fj2J8k4K1oOj3j0rJ9j9LK1OQk6Mj2K0qK9n1K8qRl1L6npNPqJ0j1pJ1j1J1mJ0
3.23466Fj8OTokKQnJ0j8J2r%oJ3NLlj0LTj0K2mqKNkk7J7j2K7m6M2%Tj8%NkKJ2%j3L1
$$ y = [-25, 6, -12, -3, 0, -13, -10, -16, 6, 1, 14, 4, -9, -8, -20, 15, -9, 7, -10, 4, -2, -4, 13, 18, 4, -22, -9, -1, 11, -1, 6, -8, 18, 10, 0, -9, 0, -23, 12, -5, -14, 8, 22, -10, -8, 0, -10, 1, 16, -24, -2, 20, -4, -14, -6, 16, -7, -6, 12, -5, -22, 8, 1, 0, -16, -3, 4, -14, 11, -5, 9, -4, 9, -6, -3, 14, 0, 5, -10, -3, -15, 17, 10, 19, -10, -21, -3, 1, -12, 3, 7, 4, -16, -1, -8, 6, -13, -14, -15, -9, -3, -6, 11, -9, -8, 4, -18, 17, 26, -6, -15, 15, -9, 13, -16, 8, 1, 10, 0, -9, 3, 18, 3, -9, 6, 12, 13, -21, 8, -8, -4, -4, 1, -20, -12, 7, 9, 1, -3, 1, 17, -5, 14, 12, -3, -15, 6, -17, -4, -13, -2, -7, -16, -11, 13, 1, -16, 10, -22, -7, -10, -6, -3, -16, 8, 0, 6, 6, 8, 10, 9, -12, 0, 10, -5, 0, 1, -18, 17, -6, -4, 4, 1, -3, 7, 9, -3, 7, -11, -5, -8, 0, -12, 3, -4, -20, 11, -9, -4, -9, 20, -4, 6, 5, 5, -22, 17, -5, 12, -10, 8, -4, -3, -16, 8, -7, -7, 4, -13, 0, -7, 17, 0, -1, -2, 18, -4, 14, 19, -12, -12, -15, 6, -6, 12, -12, 9, 3, 9, -4, -14, -23, -4, -23, -20, 1, 7, 15, -11, -7, -19, 1, -7, 22, -29, -1, -9, 0, -31, 5, 0, -7, -2, 5, -3, 7, -4, -11, 0, -11, 0, -4, 6, -12, -6, 0, -6, -8, -6, 2, -3, 7, -11, 1, -8, -8, -14, -1, 4, 7, 4, -6, -3, 0, -10, 12, 8, 0, 2, 7, 5, -22, -5, -17, 10, -36, 6, 6, 6, -12, -12, -7, -9, -7, 5, 5, -8, 23]
3.21177B3oj7%Q%j8J0lMmJ7l3K9j2MqL0k2j2K8n2M8l4K9k2J4k3K6Ll%k8M5m1L1j8JJ6
3.19244A0k5J2j5K9l5J2PKk5LL5j7J6k7J7JqpJ5%kmNqJJ3pKTkj2J3mKJJ6j5KmMk4J5
3.17108fnJ8Qj9qJ4qQoKrPOmJ1k0L4l9K0jLrj4K0ql%Pk3K6nQNj4J7Mj1LPj5k7K6j9K4
3.14869Ej9J2qLOk0k4M9Nk0j5K4%nK1qj1OoKj2K1j7Rj5J5OnJ0j5J1j5J5l7K8MmJ4rn
3.12834dqL1j8k0M3m1K0l1K5j8K0qPOj9K3j4J0j3QRKrj1K3l3L6k7K4k9M1j1j4MmroJ4
3.10901aoOMlrj3L0j3NqoJ5kTJkj6J2qJ2pMK2j5J2k2Rj0K6nlk5OK0j7J3oK6k2k0K8l4
3.08765b4K4JOpqJkpJ3j6J1mK0k2Rlj0RoL4l5Mj1L9l6J6J8Qj1rj5K5j3Qkk1nK8j7K3
3.06730A3l1LK4pOl1JRJ5J1%j9jTj0PK6j7J2Jk6J3Qj5QJnK0k0J1kOj2MnJj0J5pRnko
$$ y = [23, 17, 0, 0, 8, 8, -10, 0, -3, 1, -3, 14, -19, 10, -2, 2, -6, 24, 2, -10, 18, -34, 14, -20, 9, -13, 1, -22, 4, 7, 4, 4, -24, 21, -20, 11, -7, -6, 10, -15, -3, -18, 11, -24, -12, -5, -3, -28, -25, 10, -7, 9, -18, -1, 0, -8, -15, 0, 0, -2, -6, -1, -9, -8, 5, -2, 0, 2, 0, -12, 1, -3, -1, 0, 16, 1, 3, -1, 3, -21, -6, -11, 7, 15, -4, -12, 2, -6, 2, -4, -2, -11, -4, 2, -2, 9, -11, 23, -16, 4, 3, 6, -3, -17, 3, -5, -8, -8, -1, -24, 2, -3, 5, 10, -4, 13, 17, 6, 9, 16, 1, -26, 0, -19, 5, -14, -2, -10, -7, -1, -21, -45, 4, 9, -11, -26, -2, -2, -7, 14, 6, -5, 1, -5, -3, -15, 6, -11, -2, -17, -2, 4, -1, 9, -6, 5, -10, 5, -32, -4, 0, -4, 10, 1, -4, -12, 19, 1, -19, 24, -17, 3, -28, -3, -21, -1, -9, -2, 4, -15, 8, -6, 4, -9, -1, 8, 10, 1, -10, 13, -20, 16, -11, 13, -16, 25, 14, 0, 4, 0, -9, -15, -1, -7, -1, 3, 0, -9, -22, 8, -5, 0, -8, -14, 1, -1, -3, -2, -4, -20, -8, -16, -4, -11, -7, 15, 0, 12, -10, -1, -11, 15, 10, 7, -18, -12, 8, -9, 4, -2, 24, 2, -18, 10, -24, 0, 1, 7, 0, -8, -7, -9, -16, -3, -19, -8, -12, 8, -14, -5, -8, -18, -9, -15, 19, -16, -12, -23, 16, -20, -4, 14, 22, 11, 2, -13, 12, -1, 7, 5, -16, -21, 7, -10, 13, -18, -15, 9, 2, 8, -23, -22, -13, 2, 13, 13, -6, -7, -8, -18, -11, 15, -2, 10, 11, -15, -2, 6, -9, -1, 0, -5, 15, -5, 6, 4, 10, -2, 2, -3, -2, -12, 3, -4, 5, 0, -2, -8]
3.04542hK2k5pK2l1N4l1J6k7RK2j8%j1NljPNlKRj1J%K%j0JJ4J0pk4K7l1L3l6K6k1J6
3.02507bJ7kl2J6J8k1JK8k1j4NnJ2qK3Qk9jK0j9QPj7J1j2Op%Ojj0J5pPpnPJ9qTj4L6
3.00371B0k9J2j0Oj7J1mPj1RnPJnKJ3pj1PJ1j2J1Mj4rJ2kK3jj4jmTj4RnOPK4j8j6nm
2.98183b0L1k6Oj5L0Qj4oRj0pM%J8k3J9Rj8rJ7jnJ5k1J4mJ6j3mrJ1j9QRqQj5K4pmPK
2.96047GKpj5K3j1qNkoK1k5J8k3L7k7J5%ljnRj1JkJ5j5LNj8L3j5j1LrNkK0j1KMJ2mj2
2.93859cKJ2m2L7o%rKTrPJ0Ll0N1m0J4k3mK1KQjk1J7k3K9j9J0k3K6j7J2j8J8j%MmJ2
2.91825Fj3k0K6jj3JJ1J7m0L4l2L3j0Ok6kK8NqRrLJqoj3OpJ9j1K2j2k0J3J0rRMrJ3o
2.89739AoRk2J6j7J3j0J4%J5Ok7mJ3J4j1j4K2j5J4j3lqK2k2oRJ5%j1Rj0K6k4nJ7qRn
$$ y = [-8, 14, -11, -18, 4, -27, 27, -4, 12, -15, -6, 16, -2, -2, -13, -8, -11, -12, -5, 0, -3, -1, 8, -3, -2, -2, 0, 0, -10, -9, 5, 15, 8, -16, 11, -20, 13, -23, 3, -18, -2, 15, 13, -19, -3, 15, -6, -5, 23, 2, -12, -7, -12, 0, -8, 15, 23, -6, -7, 13, -6, 2, 9, -8, 3, -9, -3, -10, -10, -4, -5, -15, 0, -7, 0, -7, -12, -5, 14, 6, -2, -16, 20, -9, 3, -7, -1, -18, -7, -11, -4, -15, -6, -11, -4, -3, -8, -6, 7, 0, -11, -4, 7, -5, 6, 10, -4, -13, -1, -3, 20, 19, 5, 4, 0, -4, -18, -9, -14, -8, -1, 23, 5, -11, -16, -20, 11, -15, -9, -24, 6, 14, 0, -6, 3, -7, -14, -10, -10, 8, -15, 4, 13, -5, -14, 3, 2, -3, 12, -9, 5, 1, 17, 4, 0, -9, 2, -17, -9, 0, -8, 0, -15, 9, 2, -2, 5, 7, 9, 2, -13, 10, -1, -9, -4, -6, -12, 9, -16, 2, -21, 16, -11, 4, 4, 1, 0, -5, 4, -7, -6, -8, 7, -8, -5, 0, -18, 15, 0, -11, -8, -17, -12, -14, 6, -5, -3, 1, 13, 9, -3, -1, 11, -31, 6, 0, 0, -9, -7, -5, -14, -7, 3, 6, -24, 27, -13, 1, -22, -26, -5, -3, 5, 4, -17, 0, -23, 6, -13, -3, -26, 0, -17, -5, -23, -5, -6, -6, -2, -6, 6, -7, -27, -1, -2, -15, -14, -3, 14, -26, 8, -24, 9, -1, 5, -21, -23, 5, 10, 2, 11, 2, 5, 6, -2, -8, -21, -15, -22, -3, -14, 8, -4, -24, -11, -1, -10, -1, 3, -6, 7, 1, -5, 4, -18, -2, -19, -6, -16, -2, -2, 13, 19, -8, -12, 1, 15, 4, -10, 12, -3, 11, -2, -5, -13, 9, -13, -19, -10, 5, 5, -6, 3, -7, 19, -5, -10, 7, -1, 8, 3]
2.87755C%Kj5K1j3LorK8j2KJQOk0Qj0J9kj1qNj5K3j1j0J4J2rJ5lJ3j1J2j5Nj9pK1j1
2.85720Djlj8J7j%jOMPj4J2pKpmJ4j3J1k0PqNJ6k0J1l2J6JL4k2nMkNJ5k9mK2p%j3K1
2.83533Ck5L5opjm1M4%J3k7K5m2L6nLoJ5mJj2Jj6J2Pkj9M5l1Mj7K0kTJ3j4J0j9K4k4
2.81549a1J2j9K4Kpj3j8K6Mj1K7l5J9J1j4j2kJ9lj9J4Lj8J9k3K1J1k5LJ6j0K2J3m0J8
2.79768Doj8KNJ6J4k1JJ9j7Kk%J7l0L6m8J6OmPloQMj2J3j8K5k1J3j5J2j4J8Ok1J4j1
2.77784irJ3JMoJ9k1kKJ8l0K3mJ1j4j3K1Rk3nJ1TRj9LTRmk9K6k0J6l%j8J7J8roj1K1
2.75698A0j0jrJ1kpJ2k7K0j2J6nRJ1l2K3j8QoK1l1K0JPlkmLlK1l2J6k7K5rJ5j4K8k3
2.73714@lPTj1%oJ5j0K0k2KOJ3k3k4M8l5J5J1Lj0Oj5J5mJJ0j6%j9L6k8P%Tj1MJ2rlJ5
$$ y = [3, 3, 5, -10, 11, -2, 1, -5, -14, 14, 2, 4, 5, 13, 19, -1, 7, -3, 16, 14, 3, -5, 0, -15, 8, -3, -13, 1, 13, 4, 19, 16, 29, 18, 30, 15, 20, 1, -6, 15, 4, 3, 0, -18, -1, -2, -2, -3, 3, 7, 14, 0, 12, 5, 7, 0, -4, 10, -3, 8, -12, -5, -13, -8, 8, -12, -1, -33, -17, -16, 18, -4, -9, -5, -7, -2, 13, -16, -20, 2, -5, -5, -18, 3, -22, 13, 7, 0, -1, -42, 2, 2, 15, -12, 13, -29, 7, 2, 5, -1, 14, 10, 11, -1, 0, -16, -4, 3, 1, -18, 27, -4, 0, -17, 3, 1, -1, 12, -2, 8, -11, 13, -11, 1, -18, 6, 8, 1, -12, -30, -4, 0, -11, 16, -19, 0, 11, -3, -15, -17, 2, -1, -20, -6, -3, -21, -2, -25, -4, 7, -18, -15, 1, -9, 13, 26, -14, 4, -2, -20, -18, -13, 3, 17, -4, -3, 16, -1, 1, -1, -1, 16, -14, 22, -26, -10, -4, -8, -1, -4, -10, -2, 2, -10, 3, -15, 10, -11, 2, -13, -1, -15, 3, 9, -12, 2, -9, -18, -5, -4, 0, -6, 13, -8, -10, -8, 10, -20, 3, -1, 10, -4, -17, 4, 13, -10, -15, -4, 7, 16, -3, 0, 3, 12, 8, -21, 5, -15, 1, -2, -2, -20, -3, 15, 6, 0, -11, 10, 0, -1, -10, 1, -1, -8, 4, -23, -3, -15, 1, -4, 5, 16, -16, 7, -11, -3, -9, 12, -19, 1, 2, 9, 6, 4, 0, 3, 0, 21, -11, 5, -22, 3, -6, 9, -5, 23, 0, -3, 4, 11, 0, 0, -6, 9, -1, 19, -3, -1, 5, 18, -5, -29, 19, -16, -1, 10, 13, 3, 9, -6, 9, 5, 6, 16, 0, 0, -19, 17, -11, -4, -4, -4, -15, -11, 1, -8, -11, 4]
2.71629Dj4J6pTQj2LJ4j2MjrJ7j1J4oJj1J2pKkrKoJ6j1J6pK1n7L6PK8l4%Rk1K1kpql
2.69441a3J7RJ5l4J8j2jj9L2j2j8L8k7J4JQk2J7l2J8oOJ5l3K0OKj3j8QK1Qj8J1j4Rq
2.67559gKRmoqKjMJ8j0O%j4J0oJ5j4J5qjj4J2j2J4jj1KopJ6lMmQl%j4Mj4K5qL4k5Jp
2.65270gJ1j3rK3jKjj4K3k2L4l9knJ9J3k0NPMj0K0l2PnL%nJ7j0KjJ8j6k1NJ6j2L0k3
2.63235iJ3j6J9j3J5r%Pl0LJ2j2L3mj6jKj4mL7npj4M3m8K3j9K7k3K0%k4MQrJ7j1K1j2
2.61251Dk0J9qPj5jlK4k8J0TMlnj2K4%k3J5rL2j5j2j8K3oJ0Pjk5L9n0J4j7M9m0K7j3
2.59318fm%J9j1K4l5K4j5MTqKJTmRj0LNj9jRj5K1RNpOoj2K8k5lj5K2k7K9pJ2JkKj4J
2.57079ekpL2k2NlJ6k5L4j3j1OMj9OLJ1kJ5k9J6Pm9K9pJ1rRLj3kJ3oJ7lj4MnRpkJ2J9
$$ y = [4, -10, 6, -1, -8, 0, -12, -9, 5, -7, -3, -4, -13, 4, -7, 7, 1, 2, -9, 3, -4, -2, -4, -13, -11, -17, -1, -12, 4, -3, 18, -39, -3, 4, 32, -2, -2, 7, -14, 7, 5, -2, -10, -13, 4, 13, 28, -6, 12, 0, -1, -20, 12, 0, -18, 20, -7, 7, 8, 16, -6, 11, -21, -3, -9, -3, 12, -21, -1, 5, 7, -6, -24, -16, 5, 13, -5, 6, -8, 1, -7, -5, 4, 0, -6, -14, -12, -13, -9, 9, -1, 5, 5, -9, 1, -5, 10, -4, 11, 3, 2, -12, 0, -12, 2, 1, -10, -8, -14, -21, -5, -8, -4, -8, 0, -3, -3, -17, -13, -27, -2, -10, 24, -1, 0, -7, 4, -9, -18, 5, 4, 6, 5, -9, 14, -8, 26, -13, -15, -20, -1, 12, -8, -3, 4, 8, -2, 18, -14, -7, -12, -9, -9, -14, 3, -7, -5, -6, 12, -4, -25, -20, -4, -16, 14, -9, 4, -12, 7, -6, 9, 0, 0, 7, -23, -20, -8, -20, 13, 9, -7, -8, -6, -20, -24, 13, 8, 1, -13, 30, -18, 5, -14, 13, -10, 10, 10, -14, -10, -2, -11, 6, -5, 16, 4, -16, 3, -5, 2, -13, -14, -17, 7, -21, -11, -1, 3, 0, -5, -17, 7, 7, -16, -1, -10, 22, 7, -5, -23, 0, -6, 4, 11, 10, -15, 24, -26, -12, -29, 20, -20, 7, -6, -10, -10, 9, -2, 22, -13, 11, -4, 0, 4, -4, -2, -1, 0, -4, 5, -5, -2, 3, -16, -17, -8, -23, -2, 7, 12, 5, 11, 5, -7, 21, -4, -7, -22, 0, -27, 2, -5, 7, 8, 6, 8, -6, -5, -7, -14, 18, -4, 1, -2, 14, -11, 23, 10, -1, 5, 9, -10, -4, -1, 10, 8, 23, -6, 10, 17, -32, -3, -10, 1, -8, 1, 4, -9, -11, 2, -4, 13, 10, -4, 0, -5, 4, -3, -5, 7, 26]
2.54892B6l4J2j8J3J7mk5kOjK4j7koQlJ6rJj8K3j0lmNRMrjK8l8M6m4M2l0kj4J2klJ1
2.52806DMkoRpM3j9jNkj6k9K4j6J7J2k1Oj9K9k2QJ2J6k6Mj7L6k7PJNjk6%J2PQjJl4M2
2.50670B0j4Jj0J3%Ujj1mJj6L1j3J6j7LkNK3k9MOMj1Pk2K0jj7K4j0jJ5j4j2J2LKj9M0
2.48584B6l3K8j6J1j4Mj6QJ6k3J3k2M0Pl8PMJ3j9Pj2KJ5j2K2k7PLQk6K4j8J0KqJ9j5
2.46702cK0j8J6j9mL8l0lLjJ4PqRJ2mkk7J0J4K2j1TK6J9OP8R4K65M50R26M86k84J7j67
2.44921A940n16n59l44j49p7k6KL2R3J95N86J038K194M13o25P3m55j402j076n63k67
2.43853E07j84k3l0K7M3J51L26N75R12J8k27m2l48o55m79k23j56o9l0k5pPj2j1K0k9
2.42530C6K3m3J4k6KJ3k5K2j4L2l7j1J4%Oj9J6Jl0K6pJ3Nnj3K8l6J0J4plTJ5l0K6Rk4
$$ y = [26, -8, 4, -14, -1, 16, 12, -13, -15, -9, -10, 14, -3, -5, -11, -3, -6, 10, 1, 2, -16, 7, -3, -6, -10, -5, 4, 8, -1, -2, 26, -12, 34, -10, 32, 2, 0, -14, -2, -4, -7, 4, 8, 6, 0, 9, 2, 45, 26, 25, 30, 28, 12, -17, 7, -9, 8, 20, -1, 5, -14, 15, -7, 1, 13, 29, 3, 7, -10, 26, -1, 6, 7, 12, 11, -15, -15, -3, 4, 12, 11, 12, -22, 20, 6, 7, -3, 10, 10, 10, 10, 9, -2, -6, -5, -21, 10, -3, 13, -4, -1, -3, 2, 25, -4, 0, 6, 10, -1, 6, -16, 4, 3, -14, 10, 0, -1, 14, 0, -12, 0, 3, 5, -14, 26, -7, 21, 5, 16, 2, 6, -10, -2, 14, -9, 4, -18, 22, 29, -9, -2, 2, 15, -4, 3, -9, -7, 8, -4, 18, -9, -2, 1, 9, -17, 7, -11, -1, 1, -7, 12, -3, 17, -1, 15, -4, -8, 30, 0, -3, 0, -1, 13, 20, 12, 21, 33, 29, 27, 0, 10, 24, 46, 35, 24, 50, 69, 75, 153, 247, 512, 962, 1888, 2374, 2090, 2107, 1940, 1424, 865, 521, 372, 295, 269, 271, 303, 396, 591, 1177, 2215, 4409, 4822, 4197, 4270, 3815, 2413, 1337, 774, 507, 323, 300, 270, 297, 340, 491, 817, 1392, 2304, 2322, 2095, 2053, 1705, 1050, 571, 348, 192, 123, 93, 68, 61, 68, 56, 45, 65, 36, 59, 16, 30, 4, 6, 19, -6, 16, 2, 34, -3, -14, 0, 0, 6, -13, 3, 4, -26, 0, -7, 6, 11, 6, -7, 21, -15, -5, 9, 2, -1, -4, 11, -19, 7, 16, -8]
2.40648hJ5j7K7j8L4m3kK3nMj3Lj4K7k1J3j9J1oRjqLOQJ1mj6J2k8K0Jq%kJ3j4KNj0J9
2.38562Ilj8j4L6mlRk2NMJ1k0K2Jj3%KJ0j9K5j7k4L5j9J0j1J5mnK5l3J9j0K7k1K8k2
2.36680A1Qj2O%J3j6moNj3J4RljJ0nJ3rJ7k6mj3J5rqlKj0K1nJ4j6NJ8j6KPk7J3OLk1
2.34543a5J2mJ2j9J5jK5l7L9k8J9k8J0j5J0JQpj5L6m5J1MTKj%J7j5Nj2J0PnRn%j0kq
2.32509a6OK3j2orOQKnjojOJ2jj6J5k2J6j8J5Mj3J5L0l2nOqlJ0OJ5k1Qj2J0Oj4pJ7o
2.30372BlJ2j4mnJ8qK1m6L5k4K6j9j0L2J6l9J0J2l9K5Nk6L1pJoRnk8J5MJ3j5K3qMmj4
2.28388a0pNOlOL0l2LrJ2k3K6pNmNk%k2J2jJ6nJj8j3J4OnJ6k1RJ5j7K3l6J4j7L6j6J7
2.26302Il6K1mJ4Pj2j5K8j2Rlj2LrJ9k8J4J2Tl2J7J6l0J2j3K2l0J2KJ9k4jKoJ2lTL0
$$ y = [-8, 7, -10, 17, -1, 33, -10, -12, 11, 6, 10, -3, 0, -14, 13, -8, 5, -14, -3, -9, 0, -1, -9, -6, 0, 8, 19, 15, -1, 11, -17, 3, 4, -4, -4, -6, 7, -7, -5, 0, -10, 9, 6, -12, -26, 10, 6, 3, 12, -10, -5, -1, 10, -10, 12, 13, 0, 0, 2, 12, -7, 18, 1, -23, 12, -7, 3, -8, 7, 3, -2, 23, -10, 9, -1, 26, 5, 33, 11, 19, 7, 13, 13, 26, 10, 6, 0, 5, -8, 6, 15, 12, 11, 21, 16, 29, 20, 37, 11, 7, -6, 9, 0, -8, -11, -9, -19, 2, -3, 11, -5, 0, 18, 2, 4, 11, -16, -3, 3, 6, -15, -3, -7, 5, -14, 1, 0, 25, -12, 27, -1, 18, -10, 0, -15, -5, -4, 4, -3, -18, 18, -27, -16, -12, -8, -6, -7, -7, 10, -5, 0, -12, -2, 5, 0, 9, 4, 4, -6, -8, -16, -10, 13, 1, -5, -14, -8, 0, 2, -3, -4, -10, -11, -5, 7, 6, -10, 5, -17, -1, -19, -4, 0, -13, 2, 32, 0, -5, 1, -7, -10, 0, 6, 21, 0, 8, -4, 6, 12, -2, -9, 8, 2, -1, 11, -3, -7, -12, 6, -2, 19, -27, 8, -16, 10, -9, -19, 13, 29, -10, 0, 12, -27, -2, 3, -23, 8, 1, 2, -4, 5, 0, -28, -13, -9, 4, -11, 12, 4, 8, 4, -10, -17, -12, -6, -9, -3, 27, -5, -2, -11, 1, -22, 4, -3, 2, -2, 3, 1, 1, -21, -9, -10, 6, 1, 2, -16, -29, -15, -9, -14, 2, -19, -10, 5, -12, 11, -25, -11, -28, 8, -8, 9, -27, -6, -10, 4, 11, -1, -16, 12, 0, 9, 6, -6, -3, -12, 7, -21, -7, 5, 17, -15, 2, 18, -12, 0, -13, 9, -21, -9, -7, 12, -12, -13, -11, -17, -5, -8, -11, 19]
2.24369A9j9k%J5l1K6j9Kj4L0m3L8j3Qk4K8jj4rJ5Qj3J8qJ5j0LKk5K0j4MQMJnjJj1P
2.22334dKRrJ1k0J2j6K0pJ1j3l%ML%Rj9J0j7%K9l3J6QJj4KOJ9l3J4j4K7j0mnLoj2L2
2.20249I%oplmQj4PNORJ0k7K0l9L6j3pmJ8nJ2j1LJ9mj0nmrK0JKj0KrK8QlJ1NK1j2kk3
2.17959B9k4OKTqjMTj3mPJ0J2Mj2Kj1ko%lpK1k5K7j4Pj8J2j9J2KTj2J5j1J6k6K0jJ0
2.15874Ij9LJ7lJ6n6L1rK4qlj3P%oJ4j7J8oPqj3K0k2qK2J2j2KK4k9K6j5Lj3Ojj4RmJ1
2.13788Bk5J9Kj3oK4j1K1j9ONTjj4J1k2J5j3J6j6J2j8J3J1k2J3j5L6j1J4k9JKJ2l7L1
2.11957aj5RJ6Ol5K2lk7L8j5lQk5L1k2mLJ5T%j0lTmJ2j1K2j5kmK2l8K9qJ4l6MJL0jj7
2.09871ePnPj0OLMj7qK3kTj0J2rPj5J7j7QJJ1r%Pj0jKjQTk1OJ2k1%Nj2K7jKRJ2m6J3
$$ y = [19, 0, -2, -2, 13, -18, 8, -11, -9, -23, 7, -36, 2, -11, -3, -27, 1, 0, -14, -23, -8, 0, -13, 5, -3, 12, 2, 5, 7, -18, 2, -12, -8, 0, 4, 5, 0, -1, 0, -11, -4, -2, 7, -2, 9, -11, 1, -15, 5, -2, 9, -4, -7, -7, -3, 0, 0, 9, -10, 0, -17, -17, 12, -21, -5, 3, 4, -10, -8, -2, 17, -16, -2, -16, 11, 1, -3, -8, -5, -11, -23, 9, 9, 3, -4, -7, -11, -3, -17, -10, -5, 1, 10, 20, -7, 13, -26, 10, -3, -10, -14, 4, -1, 11, 0, 3, 22, 18, 8, 3, -1, -10, 10, 11, 13, 3, 5, -4, 24, 32, 29, 40, 45, 66, 54, 52, 29, 5, 11, 13, 15, 7, 6, 10, 14, 1, -3, 4, 14, 26, 30, 18, 20, 9, 7, 1, 1, -2, -9, 12, -13, 14, 0, 7, -11, 1, -18, -6, -4, -2, -14, 1, -10, 6, -20, 0, -1, 9, -10, -7, 10, 7, 23, -33, -2, -11, 13, 5, 2, -11, -4, -4, -10, 4, -13, 5, -1, 6, -2, -15, 5, -17, -25, -3, 9, -3, -1, 23, -6, 20, 5, 8, -5, 1, 0, -14, -5, -9, 2, -23, -4, -2, -15, -21, 3, -8, 13, -6, 0, 5, 10, 9, -5, 6, -16, -1, -14, 2, -14, -2, -20, -7, 4, -18, -5, -20, 16, 5, 19, -10, -9, -7, 5, -32, -1, -16, -7, 9, 15, -20, 2, -1, -28, 10, -5, -8, 0, -25, 6, -16, -20, -17, -2, 13, 13, 3, 0, -3, -7, 5, -6, 16, 1, -1, -5, 17, -21, 8, 0, 14, -22, -18, -17, 13, 12, -5, 2, -3, 4, -6, 0, 3, 7, -10, -18, 5, 3, 1, -9, 3, -6, 1, -14, 3, -14, -6, -5, 6, -3, -3, 4, -6, -7, -5, -6, 2, 10, -11, -5, 7, -14, -14, -9, -21, 6, 5, 7, 16, 28, -18, -5]
2.07582eJ0mk4J5N%k2J1K5l1lJ4oOJ7j6j5K3%mj2j1L6ok3K6opm%Rj2J2qLP%j5qJ3kQ
2.05445dkjj7J4K0j2K2l5J5J0Ol7K4l6L9Nj1KkqJ1pj0J3OJpLrnJ4j5PQpQqJ6Qlm5J4
2.03308a5LK9j8%j5lK1k0J9PNMj0qJ6k4K0l2K7lJ5j7%NqK3kPqjpQj8J5Lk2NRj2mPJL
2.01121ElmMkOljRl3K0j0%lRKLnjJ1j4rK2j3K4j0JMj2K4l1PJ4j6Nj0NlORp%Tj2J8jp
1.98781bj5J6j1pQoJ7mj0J7j7J%K4j1jk3J7PnJ5j6k%K0k2J9j8R%j3QKJ1j2L3m4M1k6
1.96797@mMpJJ1J0j3ok3J8kMJ3j9J9j3lJ3Lk2K9j7j1LJ1%rKK1l1NQJ9k5MPnj1j4J9J6
1.94711Ej2Pk3K6j0%JJ2mTM%k8L6j1J3k6PJ4k7L4k2K8k2J2k2Q%KJ7k1J1mQl8L5k5PL
1.92727inP%k1L1%Tl3L5k1K7Kk0Rj6J5Nj9J3J2j5qK3k0mK3j1oL4m6K0j1J4k7K6pNk6
$$ y = [-5, 5, 1, -23, -8, -3, -3, -25, -14, 11, -20, -23, -9, -15, -9, 8, -8, -23, 0, 0, -4, -16, -27, 9, 3, -20, 6, 0, -7, -11, -11, -2, -14, -2, -10, -7, 0, 0, -15, -23, -10, -12, -4, -6, -7, -24, -10, 10, -2, 20, -15, 0, 10, 16, -21, 3, -33, 6, 11, 0, 2, 0, -8, 3, -4, -14, -1, 5, 6, -1, 2, -7, -12, 2, -13, -6, 2, -5, 3, -5, 11, 19, 16, -29, -15, -12, 17, -1, -1, -16, -19, 2, -18, 1, 8, 13, 17, 7, -1, 15, -9, 11, -21, 6, 3, 18, 1, 1, 6, -2, 21, 19, 26, 18, 17, 10, 18, 0, 15, 18, -4, 1, 10, -2, -6, 1, 2, 5, 2, -2, 2, 0, 6, 3, 2, 11, -22, -2, -12, -12, -15, -6, -4, -1, -6, -7, 4, -10, -19, 3, -10, 14, 4, 5, 9, -3, 21, -10, -3, 11, -5, 0, -10, -5, -8, -2, 7, 0, 0, 0, -12, 6, 5, -2, -17, -1, -12, -19, -11, -17, 0, -4, -14, 3, -14, -13, -13, 11, 0, -1, -24, -7, 0, -5, 10, -6, -8, -8, 12, -10, 9, -9, 0, 0, -13, -5, -3, 8, -4, 29, -15, 26, 0, -4, 0, -7, -6, 5, 15, 2, -4, -27, -9, -11, -7, 6, -13, 6, -7, -10, 3, 6, -16, 13, -4, -15, -12, -1, -1, -10, -8, 13, -18, -13, -5, 14, -11, -7, 0, -5, -16, -30, -11, 5, -7, 0, -23, 3, -7, -7, -6, 6, 2, -2, 2, 2, -26, 10, -1, 12, -14, -7, 7, -20, 14, -8, 20, -2, 10, -12, -4, -4, -2, 15, -6, 5, 1, 9, -29, 6, -19, -12, -9, -14, -7, -7, -28, 3, 3, 3, -30, 5, -16, 11, 13, -7, 2, -14, 1, 6, -13, 0, 12, -3, -11, 12, -8, -12, 11, 0, -6, 28, -18, 2, -9, 5, -22, 4, -3, 2, -24]
1.90794b4K5pJ0j3J5mNpjj0nL0k6J2lpMTJ%Jkj2J0Rj1Kkj7L6k0J7k2Rk3M2k8%J6%qJ5
1.88658A1Kj7J4k4QJ0j0oL2l0J9j4K1l6K7k2J2krJ4nj2L2l1J0j0K3k0J0kKkk3L9j9K1
1.86826A3k3J0J4kqj8K4mjl1K5j0Rkj9K1nPNJ4j2rnJ8j8Rj0J7j5jKRj2NkjPj0J7kj8
1.84740a2LlJ4jj2K9j5KJ0k8PNJ6Mj0%j2J4l4K2Qj5NnmKJ8j5MOj0j4OJ6lk4L2j7Qk5
1.82706b8K6rJQjoK9m0J0K5l5K0j0oRj9OQoPj3J8Oj3j2K4%KoJ0knj0J2j2K7l9K7k1J6
1.80671bJ5j9J1Lk2K2pJk7L7nQk3kKoJ6kJ2j2j6L5rk0rK6k1K2rTJ1mkrJ5oJ5j6J0kTo
1.78534fNLjkJ9m3L2j9K9k1Kj0K2j8oMK3m6L8k2LJ2j7M8m9QPNj1RJ4m4L9Nnk1K9k0N
1.76550@KmJ1%j0rNLj1K7k9J2L%mKJOj7QJ1jj7Kj2pK5k0K3OJ2k8k4L4J1lj8mJ4lJ7k4
$$ y = [-24, 1, -6, 4, -9, 6, 2, 7, 0, -1, -11, -16, 14, -12, 0, -3, -10, -6, -2, -1, -1, 0, -2, -14, -4, 5, -6, -4, -6, -23, 13, -7, 10, -12, -3, -26, 16, -12, -12, 4, 4, -4, 11, 13, -4, 10, -14, -6, 4, -6, -12, 20, -10, 9, -5, 16, -20, 7, -15, -3, -5, -14, 0, -5, -17, 15, -16, -6, -16, 7, -13, -3, -5, -3, -5, -28, 11, -8, 13, -10, 0, 14, 12, 4, -14, 10, 6, 5, -26, -1, -11, -2, -4, -23, -2, -7, 0, 5, 19, 7, -2, -7, 11, -7, 2, -8, 9, -6, -7, -5, 4, -8, -3, -5, -6, 1, -9, 8, 6, -12, -9, -12, 2, 1, -11, 18, 3, 5, 15, -13, -6, -1, 15, 19, 9, 9, -3, 11, -23, -1, 7, -8, -3, -8, -12, -10, 8, -7, -3, 3, -7, -21, -15, 1, -2, -26, 6, -11, -3, -28, -2, -11, -10, -2, -3, -9, 20, -20, -10, 15, -20, 0, -10, -16, -7, -26, -20, -12, -18, -11, -24, -6, 0, -13, -25, -1, -1, 1, -5, 5, 3, -2, -12, 0, -12, 15, -24, 3, -18, -2, 13, -6, 5, 8, -14, 8, 1, 2, -25, 12, 7, 15, -8, -10, -8, -14, 2, 0, 12, 0, -16, 19, 10, -10, -19, 7, -14, 8, -1, -10, 1, -3, -5, -14, 1, -5, 10, -6, 4, 2, 0, -6, -1, 2, 1, -1, 18, -25, 7, -12, 17, -4, -2, -12, 10, -8, -14, -10, 13, -33, 5, -17, -14, -2, -19, 29, -20, -12, -5, 0, -11, -2, 12, -32, 7, 12, 7, -14, 15, -5, 0, 2, -2, 9, 9, -1, -10, -5, -2, -13, 14, -15, -3, 0, 0, -4, -2, -1, 5, -12, -4, 7, 6, -11, -9, -21, -28, -3, -23, 0, 6, 18, -10, -34, 0, 11, 8, -10, -14, 0, -3, 14, -10]
1.74414a0J5jOj9k2M2j9mkJ9j5J1j2J4j5J8k2j1J8nJ7lqmOnJ1J3Jj7LQj2PpNjLOmj7
1.72328a2kK0Jk4J7j4K7j5mJj4L0J5j1j0j6J3%JLJ8k9J4k5L0k0j5nL0mL2k8jnJ5k8K2
1.70446Gk1L8m2j0K4oJ6k0PJ9pJ4k5J2LoJ5k3rJ3j4J4j5J5%K1j9oj3J9oTK1j3J5j9J7
1.68563A0lOk2K1j2JRK4m3j6M9k0oNJ3l2J3j0K7l0L6k0L5k0TJ4j5kj0J8ok4L6rJ4oj0
1.66681eJOrQoNklnlQPRql7K2J0%jKJnQrpJ6J2j5Lnkj9K6j8K7k1Qj2L3rTnRMpJ6j8j
1.64239@j0J7qJ5k1Rk0J4Ok1M0k4LoOJ0l5K3J1K9m9J6j5J7j1R%mj2NMj1J9j0JTJ5j7
1.62306dJ4k0%TK6j2KJ7j6jk0L2j3mKmlJ4k3K4pK8m8K8j6MJ1l%qkJ3j4LTJ4k4nPJ0J
1.60220FJ6qk0J6JRl9K8qRj0K0k4J0QMj9K9k9RjMqOLKj4Rj6K1K%pJ0J4j8nJ3LoQk4L1
$$ y = [-10, 5, 4, 10, -9, -31, 11, -8, -12, -14, 5, -10, 1, -11, 3, -12, 6, -16, -27, -9, -14, 3, 0, -8, -12, -6, -11, 0, 13, 14, -3, 0, 8, -4, 3, -4, 1, 0, 3, 9, 5, -12, -14, 6, 7, -17, 0, -14, 13, -2, -6, -5, -19, 11, 26, 15, 5, -11, 2, 2, 3, 6, 24, -5, 9, -16, 14, -6, -21, -26, 4, 0, 32, 4, 3, -2, 13, -15, 7, -14, 24, -18, -28, -4, -10, 6, -14, -7, 12, 5, 19, -6, 6, 9, 3, 18, -5, -14, -1, -15, -1, -16, -1, -1, 20, 1, -5, -18, 1, -5, -11, 10, -3, 12, -7, 10, 7, 13, -9, 12, 0, 1, 10, 34, -9, -25, 24, 4, -2, 3, 16, -16, -3, -13, 14, -16, 20, 0, 35, 15, -5, 9, -6, -8, -18, 0, -6, -30, 6, -3, 11, 5, -5, -4, 2, -7, 1, -5, 0, -2, -5, -10, -13, -5, 2, 11, 3, -34, -12, -2, -2, -3, -1, 0, -5, 3, -6, -13, 3, 15, 0, 3, -2, -4, -23, 3, -15, 12, -9, -1, -13, 20, 11, 2, -3, 6, 10, 3, 19, 1, 0, -10, 7, -1, 14, -7, 2, -18, -4, 2, -19, 21, -3, 0, -6, 0, 10, -25, -2, 9, 38, -11, 5, -10, 7, -4, 5, 5, 1, -11, -6, -2, -13, 6, -4, -3, -2, 13, -4, 10, -10, -10, -10, 16, 4, 6, 23, 7, 6, -14, 18, 5, 1, 3, -1, -4, 10, -13, 11, 4, 32, -16, 12, -4, 0, 11, 8, 8, 0, -2, 11, -3, 0, 3, 17, -7, -12, -5, 5, 6, 22, 14, -6, 10, 11, 20, -19, 9, 1, 10, 0, 20, -4, 6, 14, 18, -1, 28, -1, 8, 7, 11, 3, 9, 12, 14, 0, 9, -7, 14, 16, 16, 9, 19, 33, 15, 10, 23, 26, 20, 28, 4, 35]
1.58033C5lJ3mTJ1k3K6K1Pj6LM3Nk2M1K0TKL3KM5K5R7O6R8J22J15K15K45K68L26L05
1.56405B137K48J51L3j24j85k62k60k71k00j98j32j65p4q2o0p4k3n9j7l9Tnl2Knmj1
1.55032B50mK3m2K8k3Qj1J6NMj1J1K7j8K2M2jJ9JL4M7lM8N6K4M6N1JL4J6N0Kj0KJ7k9
1.53200G32j7k6k9m6n8k9m8n0k3o3k8m9k7l4j7k2j4l3Kj0rj1l6NJjk0NJ2l8J9mk4K5
1.51471C5l%l1J9k1RK6k6Mj7L3j0rnRj7J0mMkljmOJ5k5K9k1j1K7J5m1K4oqMK5j8Ror
1.49385EKj1j3J5%J7j4QPj2J2k3K2nj3j0K4mTjJ0j0j8K7rj2J5Qj7J0k4QnJ8lk0K9Ok5
1.47401a0J2p%Pj5L1j7J5J2l1K0l7L9k5N%K6m5K8%Jj1j4J8j0J6k7K0j2oJ7NpJ0j4lq
1.45519a7L4j4J0j1nlJ5Lj3oJnMqJ2j5M5m1J6j3J7qKlJ0kj6K1J5o4O5n1K5j7J2rJ5q
$$ y = [35, 32, 45, 41, 37, 48, 25, 51, 72, 79, 63, 66, 109, 114, 92, 133, 153, 173, 175, 208, 210, 255, 280, 377, 443, 541, 663, 778, 993, 1238, 1506, 1832, 2137, 2385, 2536, 2569, 2445, 2260, 1998, 1738, 1467, 1267, 1069, 937, 772, 698, 616, 556, 482, 459, 400, 383, 344, 305, 300, 268, 270, 265, 261, 250, 246, 269, 227, 255, 232, 240, 229, 245, 250, 254, 243, 254, 281, 263, 285, 327, 326, 345, 346, 380, 427, 424, 472, 528, 552, 598, 649, 650, 684, 700, 750, 752, 742, 744, 761, 732, 715, 689, 660, 614, 556, 527, 479, 429, 406, 343, 315, 266, 239, 205, 188, 166, 152, 119, 121, 111, 102, 91, 55, 60, 61, 60, 40, 45, 57, 19, 38, 34, 10, 35, 32, 32, 1, 20, -1, 8, 34, 8, 12, -5, 28, 18, 9, 4, 13, -4, 6, 2, 6, 4, 1, 0, -4, 2, 17, -8, 21, 0, -11, 16, 31, -10, 14, 8, 0, 4, 29, 11, 20, 14, 5, 7, -4, -17, -2, -2, 15, 1, 9, 16, 4, 16, -7, 15, 10, -3, -13, 11, 7, 3, 2, 12, 2, -16, 11, 2, -10, 5, 13, -4, 6, -18, -10, -15, 3, 0, -20, 9, 15, -10, 2, -5, -5, 2, -13, 18, 1, 16, 28, -3, 17, -20, 19, -6, -1, -1, 25, -20, 8, 8, 9, -2, -16, 2, -8, 8, -19, 1, -11, -17, 0, 5, -2, 8, -6, -9, -17, 17, 3, 13, 2, -3, -6, 9, 12, -1, -7, -6, -11, -7, -15, -3, -18, 27, -14, 2, -11, 6, -2, 0, -3, 7, 5, -11, 10, 25, -39, 26, -25, 0, -17, -5, -14, 1, -7]
1.43586gOJ6Lm6K8o%j3K3m%j5J9J0nkk7J9lj1j5L3Qpj7K7l1J1j2PKK3l0J3jlj7K5j0
1.41602ikKRoLmK2n4K5J0Nj9J8mj0RLJ4j8OTj9kJ1Mj1NPj6J5J0j0MopJ9nKk5J1kJ3K5
1.39414B9l0Oj7J1k9L2k1RP%JJ2rlPoj2K0rnrJJ3kmKJ5k5KR%mRJ1j9K3m2K4j8LL1rj5
1.37227a1J5Rk1J2%KMj4j2NOj0PJ2j3oJ3J0koJ2k6J1Oj2K5j6K2l6L0m5O0m0rK7j5J5
1.35344Ij0K7n0M3l2K8k0MPp%J4%k0j1K6j3KOJqOj0j8J8OKj4J1j1J2J1kpJ4j3nlJ2j7
1.33310a2pJ1j0J7j3J1pJ9qJ2j9K7j1j2Qk9L0knj4OK1k2J0k1L3qj1j6K6j2lOPj1j3K1
1.31427aj1L0l0OJ%J7k1J0Tj2qMoTMJ7lj2NK4lk4Nj2RNMl1K3j9K8k0KL0m2M0j4KrK4
1.29342A6k9J7oj2%K4rjLJ4j9j8OK5j2J7l3K9l8K5Pj7LJ2j3J4k9L1j8K9k5J4mKnMj2
$$ y = [-7, -1, 15, 18, -28, 0, -6, -6, -19, 4, 0, 0, -15, 4, 14, 9, 7, -20, -1, -4, -15, -30, 3, 11, 4, -13, 14, -17, -6, -18, -11, -9, 14, -16, -3, -4, -7, -24, 1, -9, -11, -9, 0, -6, -3, -7, 15, -39, -14, -4, 1, -18, 0, -4, -14, -5, -2, 12, -6, 0, 6, -13, -15, -4, 0, -11, -6, 1, -15, 0, 10, 0, 4, -2, -9, 10, 5, 7, -18, -7, -9, 4, 29, -1, 5, -12, -1, -30, 2, -19, -10, -3, -3, -2, 10, 1, -2, 5, -1, -13, 7, -2, -7, -16, -15, -2, -4, -8, -6, 9, -16, -14, -5, -5, -9, 0, 11, -8, 15, -27, -3, -21, -18, 13, 4, -11, 4, 13, -8, 4, 4, 6, 10, -4, -16, -11, -5, -15, -8, 4, -9, -15, -2, 8, 6, 0, 12, -14, -3, 3, -9, 16, 0, 22, -14, 16, -29, 31, -9, -18, 9, -6, 9, -1, 26, -24, 19, -13, 15, -5, -1, 6, -1, -1, 13, 13, -7, -18, 8, -5, -3, 3, 4, -4, 2, -8, -26, -8, -2, 0, -14, -3, -14, -2, 9, 7, 0, 14, 1, -4, -7, 5, -12, -19, -8, -18, -1, -14, -3, -10, 9, 1, 13, -6, 21, 10, -2, 6, -23, 7, 5, 0, -14, -8, 13, -9, 1, -20, 13, 5, -6, -22, 4, -8, -11, -5, 2, -9, -22, -1, -12, 18, -12, -6, -5, -5, 12, -9, 1, 11, -1, -9, -5, -11, -17, -13, 4, 1, -11, -6, 18, 15, -9, -4, -16, -7, -2, 2, -29, -6, -25, 3, -17, -15, 15, -27, 13, -1, 1, -8, 16, -13, 4, -2, -14, -14, 10, 1, 0, 3, 17, -2, -20, -14, 11, -1, 16, -17, 12, -26, -1, 6, -11, -8, 4, -9, 5, -24, 7, -11, 18, -7, 7, 3, 5, 0, 4, -8]
1.27459hpPQ%K0l6L7j9%k2N1j5J1kpj0K8nj0pMkj6LRk6L5k1JoMPjLnj0j6K7J3%j5Qj0
1.25272@oJ3k6K4k1K8oj9J3nJJ0%k1K9k5K5ok0K4Kk4J1Qk0PpJ1LPk1O%J7j8J2j1J2k
1.23288Ej7J2k0K0j2J9k6K2qj0ROKj9NJLJ0k1TL9J0j8Qk3L5j7RmjJ3k1K0qj0Nnj9K7
1.21304@pk%KJ3l0J6jRnJ1j2Oj2K9m4K0J6jqKPk0J1MKj0j2K7l6K0k3J7NRk2J4J6oKm
1.19218ClLK4m4J0J2k2L2j3k3K5qKTJ0KmKm4L5j6J9PJk9J0J1k7L9k9L2l7K1jkmQJ1n
1.17234A0j2J0JqNjk1pK6k1ONlj0J7OnKkLj0OTJ1Ojj6K4k2LJ2lK7k7O1P2J57K95J33
1.15250G35r6k0o6j76j77p3p9j8k4J6oJ4k6%TKJ8j6K3k7PRj1JKj6MJ1J2Kk6K2j5K3J4
1.13470D3K2Q5J53K87J11o4k0n3j81j67q8p2j4k6K4k2rJ4Mj8KnknJj1J0J6j8L2k5Oj
$$ y = [-8, -15, -8, 0, 0, 20, -16, 21, 2, 2, -20, 31, 16, 27, 25, 18, 8, 36, 31, 21, 14, 18, 16, 0, 3, 12, -14, 21, 0, 1, -5, -1, 6, 5, 8, 3, -7, -23, 4, 17, 17, 2, 10, 0, -6, 7, -19, 5, -16, 12, 6, -13, 0, -5, -4, 6, 6, -15, 14, -11, 14, 8, -12, 12, 14, -10, 1, 9, -11, -4, -11, 0, 3, 10, -11, -5, -5, 12, -6, 6, -5, 7, 5, -12, 0, -20, 0, -12, 7, -19, 3, -5, -15, -6, 0, 2, -17, -12, -11, -8, 2, -19, -40, -1, 9, -9, -1, -24, 11, -6, 3, -1, -2, 11, -10, 10, 2, -8, -3, -8, -27, 0, -7, -9, -9, -7, 6, -24, -8, -9, 0, -5, 6, -6, 0, -12, 17, -27, -7, 9, 8, 0, 2, 9, -11, 0, 4, 6, -4, -16, 11, -25, -5, -28, -11, -6, 3, -19, -5, 11, 5, 7, 3, 0, 3, 27, -17, -7, 5, -17, 15, 2, -21, 4, -4, -2, 0, 10, 12, 8, 10, -34, 1, -15, 4, 11, 12, -17, -7, 4, -23, 16, -13, 19, -18, 3, 2, 0, -4, 4, 15, 10, -2, 8, 9, 1, 6, 5, -16, -23, 3, -18, -12, -7, -10, -20, -3, 3, -2, 0, -2, 1, -9, -3, 3, 14, 20, 19, 3, 27, 5, 8, 20, 17, 44, 17, 78, 150, 307, 602, 735, 639, 619, 553, 377, 200, 127, 48, 30, 6, 22, 16, 30, 4, 4, 4, 6, 24, 8, 31, 4, 11, 20, 9, 10, 12, -4, 0, 11, 23, 25, -1, 21, 6, 29, 43, 65, 150, 303, 590, 701, 637, 617, 564, 383, 216, 128, 56, 42, 16, 40, 18, 9, 23, 27, 9, 11, 6, 4, -1, 0, -11, -1, 15, -3, 29, 4, 10, 9]
1.11791INj2j5Kj2K3l0N3l9L2n1K4NTlj5L4Mk7j7K3NJ2m1L8j9K3qk2NMj1K8j0j5%J8
1.09909E%j4j3K3Lj4jJ5j3J0ok%KK8mk7K4l6J7L0l9%OnqJ6k1L2jj4PTLk0J7j9J8JpR
1.07823Ik0LKRj7jP%j0K4j6LJJ4k2j6M8l8J3T%j6J6j6JjJ7Jj2pL0Kk0mnJMJjJ8j0j1
1.05686fpQpJ5mnK5l4pJ2Q%pJ3%Qj2K1j7J6j3k8M0k7Qj9K4j4PJ2m0L5l1L4k1QlJ6lj
1.03652DJ7k2mMj0j2lJ3OPRmk3L8k8J2j0OnoK2j1Ol2JK6Lj3jTpJ1mkMJ0kl3L6l1L6q
1.01515aj0J2k5OTnmJ0K0j6J6k6J1nL3m2K0pK3%k4nJ1J3l6K0qQj2LTK1j8j0K6J3l5J3
0.99582aJ0OQj5kJ2k3mJ7k9L7k5J7k2j3K6qolK3l2K4rJ6k0QnTK0k0K5m3M1k3K4j3k2
0.97700b9N2l2mOpJOLj3K4j5pj3K8oJ6k3LMj1K5k1nK5j5J6pLKjTmjJrJ5j5K9k1j9J1
$$ y = [9, 14, 2, -13, -11, -23, 0, -30, 23, -16, 16, -35, -11, -6, -1, -4, -19, 15, 19, -8, -25, -2, 3, 15, -26, 12, -7, 16, 8, -14, -9, -5, -16, 12, 2, -13, -13, 5, 5, -9, -22, 1, 4, -10, -11, 4, -9, 1, -5, -7, -7, -5, 23, 19, -8, 16, -20, -3, 27, -12, -12, -6, -11, -19, -3, -24, 8, 7, -7, 0, 7, 10, -10, 7, -12, 6, 7, 0, 9, -11, -8, -6, 3, -14, -15, -8, -8, -18, 6, -10, -7, -6, 8, -14, -30, 18, -20, -7, 6, 6, -10, 6, -10, -9, -10, 7, 8, -4, -11, 19, 21, 1, -3, -8, -7, -3, -2, -3, 15, 5, -6, -13, -5, -12, 3, -1, -6, 19, -15, -22, -10, -2, -2, -9, 4, 4, 12, 0, 21, 4, 20, 7, -21, 19, -8, 0, -19, 5, -9, -2, 10, -30, 5, -26, 8, -13, -5, -8, 8, 5, 4, 21, -1, -5, -1, -11, -23, -26, -13, -7, 0, 9, 5, -18, 20, -8, 4, -6, 0, -5, -11, 11, 0, 6, -26, -25, 1, 4, -9, -10, -11, -18, -7, -11, -13, -9, 1, -1, -34, 2, -29, 7, -1, -11, 1, -24, -18, -12, -17, -21, -11, 9, -7, 9, -17, -6, -11, 22, -20, 0, -7, 16, 16, -8, -13, -2, 11, -25, -5, -13, -5, -17, -14, -11, 10, -8, -18, 8, 21, -14, -1, 9, 15, 23, 8, 6, 18, -5, -9, 8, -21, 16, -9, 8, -14, -27, -1, -9, -15, -18, 5, -27, -3, -12, 4, -16, -8, -13, -18, 2, -18, 7, -36, 5, -18, 6, -7, -29, 23, -9, -13, -7, -14, -13, -7, -4, -17, 7, -8, -15, -28, 0, -6, 10, -13, -10, -6, -17, 8, -13, -18, 7, -8, 8, 1, 4, 6, 5, 4, 0, -1, 0, -9, 6, -9, 20, -1, -20, -9]
0.95614iL%J2jk2K0k2J1K1k9oK7Lqk0K1j2J0Kj2K3lj6j0L8l2ON%k2J0J5jpmJ6mJ6pk0
0.93579hJ9rj5J5qj3J4lMlL2l3mPMJ2j1Pj4NrJ8k0NJ2k0M3l1J3rpNRj4PJpJJ6j5QnK
0.91392Ajj5J1Qj0pJ1pJ5j0lJ3j3j4L4j8J2j8J3k2K5j4kPj2J6RNj5lj9jJ9k3J8KJ4o
0.89458@QK1l7Ll1K9kJ6j3%j2KJ3OjJ9k7JK0j0nj2J3j0Rmj4RmK0k3KJ1jmJ5j1MqPJ2
0.87373A1k3J8j5nJ6lMOnj1J8j9jQj6MqJ1J0Mmnj0j1L1j4J1Rj6NnJ0j7K1m0K5qMJ0K
0.85338BpqJ3%j%kj3j2K9k0J5k1J5j4M2k9J9k2Pj3P%TRTpmjJ3qQoj8NjJ5k0J0K3j1j2
0.83201iJ3k2J7J4j3jpoK4k0LJ0mJj1KJ9Jj9qRJ3k6lLL3j6%K0m3ML5l4K1nJ4l7K9k0
0.81217a9J3j5MK7qj0J0j0%J2k2J8J4k9Qm%L2k6Ql8J9K0j2qJ5k1J1Tj9KK0lrRPkJ8j7
$$ y = [-9, -6, -6, 6, 5, -17, 3, -19, -8, 13, -16, -22, 5, 8, 0, -20, 1, -11, -1, 1, -11, 12, 9, -7, -17, 21, -11, -5, 0, 0, -22, -12, 3, 2, -5, -9, 7, 3, 19, 12, -8, 11, 2, -13, 2, -6, -19, -5, -8, -4, -7, 25, -8, -12, -5, -1, 11, 0, 7, -7, -2, -11, 7, -13, -8, 4, -16, 27, -4, 9, 0, -7, -2, 7, -7, 0, 1, -6, -5, 11, -4, 4, -1, 1, 0, -15, -4, 4, -6, -13, -2, -9, 6, -4, -7, 6, -7, -21, 13, -5, 7, -11, 2, -20, 5, -9, -11, -4, -16, 0, 9, 14, -1, -4, -23, -24, -5, -28, -10, -8, 6, 0, 8, 29, -8, -5, -36, -7, -9, 7, -6, -6, -18, -16, -3, 3, 2, 21, -6, -5, 15, 5, 0, -12, 1, -9, 0, -4, -18, -9, -13, 7, -16, -14, -3, -4, -8, 7, -4, 0, -8, -1, 11, -12, 6, -9, -14, 2, -1, 3, 9, 4, -7, 11, -8, -9, -1, -17, -13, -21, -10, 0, 4, 0, -5, -15, -26, 5, -9, 2, 11, -5, 0, -5, 5, -12, 9, -31, -6, -14, -10, 0, 2, -5, -13, 0, 0, -1, -1, -3, -16, -28, 1, -19, -4, -25, -10, -24, 18, -11, 8, -14, -7, -20, -13, -13, -13, -4, 5, -2, -6, -7, 6, -2, 6, 0, -18, -13, -14, 1, -19, -9, 14, 3, -9, 4, -18, -1, 13, 0, -1, -8, -14, 10, -10, -7, 3, -1, 0, -11, -9, 10, 11, -8, -16, -7, 6, -20, -23, -20, 13, -3, -3, 17, -26, -22, 13, -21, 0, -5, 9, -28, 1, -19, -6, -21, -17, 10, 2, -8, 2, -8, -8, 4, -18, 0, 14, -15, -7, -11, -11, 21, -5, 3, -35, -16, 4, -8, -16, -1, -22, -11, 0, -19, -17, 3, 0, -9, 0, 7, 5, 23, 6]
0.79233Fpkj2j4M1l3L6nk4QjrJ7LmJ6l4J6k0J9oRJ1j2k%J9k3J7l0J7j4J7Kkm4L5LKo
0.77198a0J3j6POnJrOk1K2JJ0pNk3KL4nj4Lj6J4oPj7QjpOK0k5L5m3K6j9LJ5OnKj0K8
0.75062B1k8J0l3K4LKj3J6klj7OJ4j8K4j3K9k8J3k9K2k8J9%lK1k1Qj7K7rj4mL2rnJ4
0.73180A1k8lK8j3PJ1j3mj3K8l2K5rqRJ0k0L4l1J2j0J7j7J7k7L7j4jLrJ4k3qJ2L7k7
0.71348BOjOKk3QoPj3K6l0K6j7j2lK1Qk2PNqK5j8oOJJ7k4JJ7pj2lK3r%j3J1J5j9Om%
0.69161dj7J1J2J8ok2J6k8N1m8J1pqK4Kj3J7l1RJJ3jMoj6J7j1J8j7nJ9qJ7j1lLJmk1
0.67177b3LK0oj4LmL0j8lO%nOj4J2pJ7J2l8J5LJoMONj3J9j1ROk3JJ6k1J7k3KQJ6Krj3
0.64989a2KOJ9k2j0QTOPJj8J6rj0j1RoJ7j4J7oqK4kpk2JoJ1MK6j9J0l1kJ1QjPJ0kk2
$$ y = [6, -1, -3, -15, -29, 12, -21, 15, 10, -14, -6, -7, -16, 1, 4, 0, 16, -18, -2, -22, -3, -9, 0, 11, -1, -3, -3, 16, -7, 10, -20, -3, -17, 0, 2, 0, -44, -9, -6, -4, -10, 3, -13, -6, 0, -5, -4, -13, -7, -28, -6, -5, 5, -2, 3, -20, -18, 16, 11, -3, 0, -16, -2, -8, -1, -18, -10, -11, -18, -12, 8, -17, 18, -25, 1, -18, -15, 0, 6, 1, 3, -7, 21, -7, 3, -30, -6, -3, -1, -14, 2, 0, -3, -20, -14, 0, -18, 6, -7, 22, -6, 7, -22, 0, -28, -9, -9, -12, 9, -12, -4, -21, 6, -3, -17, -21, 11, 2, -3, 11, -17, -20, 8, -5, 2, 13, 0, -4, -17, 11, -21, 4, -5, -13, -4, 6, -14, 20, -11, 1, -9, 8, -9, 8, -19, 18, 4, 3, 6, -3, 11, -12, -20, -8, 29, 2, 8, 7, 13, 15, -8, 0, -6, 1, -12, 14, -16, 10, -7, -19, -22, -1, 7, -15, -8, -3, -11, 14, -4, -10, -4, -3, 14, -10, -9, 8, 1, -11, -14, 9, 0, 0, -13, -2, 13, -6, 0, -4, -4, -21, -10, 2, 20, 14, -8, 8, -20, 31, -17, -6, -13, -21, 3, 5, -8, 9, -22, -13, -12, 1, 0, 4, -2, -18, -1, -12, 6, -11, -16, 3, -5, 12, 1, -2, 1, 2, -2, -23, -20, 0, -6, -20, -17, -21, 9, -9, -12, -6, -6, -11, -5, -19, -7, -14, 3, 15, -23, -8, -5, -4, -10, -6, 0, 5, -8, 11, 0, 9, 15, -8, -7, 9, -12, 5, -18, -16, -8, 8, 10, 1, -12, -10, -4, 15, -7, -17, -9, -1, 5, 12, 13, -5, 11, 2, -8, -19, -10, -16, 1, -13, 4, -2, -10, 14, 12, 5, -17, -16, -22, -11, -7, 19, 0, 10, -21, -23, -12, -4, -5, 2, 12, 10, -12]
0.62853a2OmLJPrnK1j6J5l1K3k3L2oPk0Jj7K0P%Ll%j7MQJ8kj6j8K3rJ1JlK5m0J0j6K3
0.60716Bk4N1l1Kj9J0nrJ8jJ7pk6M6k1JkJ0j9K2j5qK3j8kj3L6kl5jJ1j3K2rPj0mJ3M
0.58732AqJ9k5QjoOMQk0K3ol%Mlj4J1l4L7pK6m1K8j0J8l5mJ6K1j5MLj9K5j3j4%RmLM
0.56596dj2Nrj9M7j6KLpnOQj2QMJKk3J1QMk2M2j9k8QOk2L3qj4K2%K0j1k8J8JPj7Rl1
0.54459c2K9j4LJ9KpOPk0MlQj1J1Pk9LJ2Po%J7j5KpTj1K9j3K6j6mj8NJ6jTj2J4%Kl2
0.52322c0L0qKJ3Jj8PRj7pKK0jTk9RJ1j1Mj2L5j0Jk0K8m8M2rNJ1%qKm3L4NJl3L2rJ7
0.50237Gk1lOmK2j0j8J1Rj2jQJ2k5%lK7k0k2M5rj2JpK5j9Jj6L9j7OmK5j1k8K6l2K3l
0.48253dj9J0NJ3j5J0k7L3oLk4J4Lj4J7qlmJ4l7L3j0J1Pk6K2oJpMK4l3K6k1MRLj3rM0
$$ y = [-12, -6, -10, -7, -6, 1, -8, -13, 8, -8, 7, -24, -1, -24, 8, 2, 9, -11, -10, -27, -7, 0, 0, 3, 0, 0, -17, -13, -5, 13, 11, -5, -23, 0, -9, 2, 3, 0, 25, -15, -5, -21, 2, -22, 29, -2, 0, -19, -9, -14, -23, -5, -6, 11, 4, -22, 24, 3, 4, 2, 12, -7, 15, 0, -8, 15, -3, -5, -18, 18, 16, -19, -20, -9, -22, 0, -9, -2, -12, -16, -3, 1, -7, 12, -13, -5, -6, -12, -6, -2, 6, -14, 9, 3, 0, 0, 4, 1, -13, -2, -36, 1, -6, 20, -21, 7, -3, 15, -20, -24, -8, 13, -2, 2, 5, -14, 11, -2, -16, -16, -7, -11, -8, -4, -16, -11, -20, -39, 8, -8, -6, -3, -10, -15, -9, -1, -13, -5, -1, 0, 2, -21, -10, -2, 2, -20, 22, 3, -25, -17, -11, -33, 0, -8, -22, 0, 0, 20, 9, -19, -1, 0, 7, -10, -1, -32, -3, -17, -14, 5, 7, 0, 6, 13, -7, -3, -6, 2, -9, 2, 9, -20, -17, -5, 2, -4, -4, 13, -2, 0, -7, -14, -25, 4, -9, 17, 1, -3, -21, -16, 0, -1, -2, -14, 0, 0, 2, -30, 0, -8, -6, 7, 8, -10, -3, 6, -11, -18, -16, 4, 3, 2, -27, -18, -7, -18, -14, -26, 9, -1, 0, -20, 8, -40, 2, -7, -2, 9, 9, 1, 3, -40, -6, -1, 0, -33, -1, -10, 7, -14, -17, -11, -15, 7, -3, -21, -10, -1, -13, -14, -6, 6, -19, -19, -22, 5, -15, -37, 8, -1, -13, -12, -19, 6, -13, -12, -28, 11, -6, 0, -4, 21, 10, -18, 8, -24, -1, -4, -23, -13, -8, 5, -10, 0, -27, 6, 0, 3, -21, -7, -4, -18, -1, -9, -12, -16, -2, -39, -6, -16, -5, 2, -24, -2, -8, -7, -14, -10, 14, -19, 7, -14, -10, -1, 2, -11, -20, 20]
0.46218B0k5RJnTplK4j9Nj6K6j7J6j1PrJ4j1RqTK4j2j5K4j6J6kqJ9j2k4OK1rpj2J5j0
0.44183a5k3L9k0MrM5l9L1j6npRMkoJ3j0J3k5J6LlnPj5PmjJ2K3k9Qj2J0%k1LMK4k2J0
0.42097dj9L1k5kL0k2J0j3NkJQoq%J5jmqjJ0j4K8j2rJ1J0m0K0K1k4L8m0J7k1mOK2j9
0.40113a5KjM4m2J7nQj1Ol4K6j8K3j2J5l3L3k9J3Tnj4J7MOj3oTJ3KMJ3k3qLJ9pTRrR
0.38028Aj3kj6L0qJ6l1J9j4KK4l1J1OkmJ1j0J5lPmrk2K7j5QMoMjJ8j7NnjoJ2jnj3Qj2
0.35840b3J6%qJ5j6K0lrJ8nLl5L5lKjk2nL7qj4K5m3J9j6J7Jkj7J7nJ3Oj8NoJO%j3J6
0.33754@%j1qJ2TLj7oJ1QMk6j1K0Lj1KJ2Pk5K1nJ0k0K0j5qRJ4nJk5K4MlqK0j2J2j7O
0.31669BLj1Om1M6j6lLJ1Roj7Ol5N0NpqJ1j6K0l6K9Noj3NRrNjMj0OPqpNL5k3rk3J2l5
$$ y = [20, -5, 4, 5, 0, -5, -12, -15, 9, -10, -5, -21, 5, -12, 4, -7, 0, -9, 5, -6, 3, -5, -13, 11, -1, -16, 8, -8, 8, 6, -2, 17, 5, -19, -13, 8, -1, -8, -20, -5, -15, -38, 1, -19, -15, -24, 21, -18, 13, -3, -8, -15, -6, -2, -4, -10, 3, -7, 6, -19, -3, 0, -3, -8, -1, -16, -9, -13, -14, -2, 21, -8, 0, -12, -2, -2, -23, -20, -16, 8, -14, -4, -23, 8, -17, -19, 11, -11, -1, -14, -9, -11, -10, -2, -8, -16, -16, -1, -2, -6, -14, -15, -5, -19, 9, -3, -12, -1, 9, -31, -11, 10, -14, 24, -16, 1, -20, -24, -18, 4, -15, -13, -14, 30, -12, 5, 0, 8, -3, 3, -31, -5, -23, 0, -12, 3, -30, 3, -26, -13, 0, -5, -19, -2, 2, 8, -5, -11, -17, -4, -2, 2, 15, -8, -16, -13, 6, -1, -8, 1, -8, 1, -12, -14, -30, 0, -8, 8, -23, -4, -18, -16, 8, -23, -12, -6, -8, -12, -1, -11, 4, 1, 8, 4, -5, -27, 0, -15, -7, -3, -9, -5, -6, 12, -5, 0, -5, -6, -12, 0, -1, -6, -19, -11, -23, -7, -7, -15, 0, -16, 4, 1, -8, 10, 5, 8, -27, 8, 5, 7, 6, -16, -21, 16, 8, -6, 19, -24, -5, -21, -4, -3, -5, -22, -5, -10, 3, 9, -9, -4, -10, -9, -3, -3, -16, 0, 0, -11, -19, -7, 5, 8, -9, -15, -4, 4, 8, -18, -29, -9, -6, -17, -15, -3, 4, -21, 0, -5, 5, -15, 5, -10, -18, -9, 5, 0, 1, -24, 0, 4, 1, -7, 13, 1, 13, -4, 2, 5, -6, 0, -41, 5, -11, -14, -11, 0, 9, 3, -14, -8, -43, 7, 12, 5, -3, 8, -8, 12, -24, 5, 10, 4, -9, -4, 5, -4, 1, 0, 4, -6, 0, 7, -1, -8, -3, 32, 9, 0, -23, -11, -46]
0.29430d6N6k0N%j4pM0j7MQmTj%j1J1j6kM1k9j0kTJ5Nlpj6K5mr%RkKMmOj4J5O%Mj5o
0.27141ilLKJ7j8Pj2J3j4JTPjKkj0Nj0K8kTk0J5J0j0Rj4lQJ9l2J0k6J2K5Nqk0K1j5k1
0.25055c2K6oRmj4K5j2QTl6Pj5M5j9K0qJ1ok2K1oLj2J4%j7J5qj1J9rj3QJ0Tj1J6k2L
0.23071erJ4k9J7K1rj5K5k9L1l0mJ7j0J4rOJ4k2J4LkoNnJ0l0J1J0jj6J4Qj3rJ5jRKm
0.21037BokjPpLJ8j4j5NJ2nTMJ2oj3J6kj5mpJK8l2K8k5K0l1L6j7J1LkJ2k0Qj4POj5J2
0.18900gLOl9M8l8L3lk0J4J2j9kJ5rJ7j3RJ4k4j9M2j8J1l3K6k2QJ3k0J9J6l6lL7j8p
0.17069gJ1rJ5k3J4j0rNJ2k5J5J4kK8k6KJlJ8o2L9j2L1k3J1j4OqJ4j7KK8k5J3k2jR%
0.15135a0JLMopR%J2MKk5J1j1Oj2J9nPj1pK7j5oJ2K4k7j6RQ%TK1n3M3j4j6lK5k2OPR
$$ y = [-46, 10, -10, -5, -5, -19, -26, 14, -3, 1, 9, 5, 1, 0, 0, -11, 0, -16, -18, 23, -6, -16, -18, -20, -5, 0, -3, -10, -26, -1, -5, -14, -14, -5, -7, -5, -1, -5, 1, -13, 2, 8, 8, 12, -3, -9, -12, -9, -7, 10, -8, -1, -13, 0, -14, -13, -12, -5, -6, -4, -6, -16, -11, -21, 7, 5, 3, -17, -2, 8, -2, 7, -7, -10, -2, 17, -15, -5, -31, -19, 6, 11, 3, -17, 4, -11, -32, -6, -12, -3, -7, -21, 4, -8, 0, 8, -28, -21, -36, 9, -10, 10, 2, 13, 7, -15, 6, 0, 3, -9, 5, 5, -12, 3, -5, -16, 3, -6, -19, -11, -1, 9, -2, 14, -8, -5, -14, 0, -29, -12, 9, 0, -15, 10, -19, 12, -18, -22, -5, -15, -1, -10, -4, 10, -12, 2, 5, 3, -3, 2, -3, 7, -23, -12, -2, -3, -19, -5, 3, -10, -19, -4, -5, 4, 6, 2, -4, -6, -7, 0, -7, -4, 14, 0, -15, -10, 2, -3, -8, -4, 8, 2, -11, 5, 3, -12, -16, -23, -22, 6, -26, 2, -23, -3, -34, 2, -15, -4, -1, -3, 9, -11, -3, -17, -10, -4, -19, -7, -4, 2, -37, 11, -27, 6, 3, -17, -3, 9, -10, -12, 3, -6, 11, -2, 7, 21, -3, -22, 20, 2, 13, -20, 6, -16, -8, 5, -15, 4, 20, -16, -19, 18, 0, -7, 4, -5, 10, -13, 1, -9, -18, -13, -1, -26, -11, 3, 1, 29, 3, 5, 6, 3, 21, -41, -2, -14, 17, -6, 5, -9, -3, -11, 3, -14, -12, 16, -9, 4, -18, -19, -10, -10, -9, -6, -2, -8, -15, -6, -6, 6, 10, 12, -13, -2, -13, -7, -19, 0, -5, 2, -9, -16, 11, -4, -10, 2, 26, -1, -17, -8, 0, 0, 0, 21, -32, 11, -3, -19, -22, 3, -19, -13, -6, 3]
0.12999Cj2%J7k0J3l1M5k5J9j5J5k6K5%jm4L3j7J8JTj2J6Rj4Pl5K7J6j3j5K1l3K1NL
0.11168Bj1J6Kj0Qj9jJ7j7L0j2kj0J0j9L5k1j0rQK4j0oprRMNj3kPJ6nmJJ1kqOJ5l8J6
0.09031clJ8k2Qj4PKRj0NJ8j5K2QK9j0kNj2k5mJ0j8j6K6j9J8j2rKQj4J4koRLj6NJ5j1
0.06945bk2K7j7J5JqNPj1j8RQTnJ6k2OPl%J0k9J9olJ5k7K0k2L1l0L5m6K1OJ4pQl0J6
0.04910dj9J0QOk8K0j5K8k7K0nLj8K6n%lk0K3l%kTNJ2mK0n4K5JTOp%j6L2l8J9pJ4lJ1
0.02774A0Jk3K0qoj6K1MlnLj3J3JJ3j4J7k4K4k1K0k1JKjj8K0j0K5k4K9l5K6j9K1pj2
0.00892irJ2NnJ6j1J%TLk3L8l4NJK2k2PJ2pj7MK0k1K3Ll6RTLk3J4K1nj4JJ2k0MJ1j3
-0.01194a3jJ3kJ0k9L6nl6K9Oj3j0J0j9J8jlK9m0K2KqLNj7pRlL7l8K3j1QK0k3j7J6j1
$$ y = [3, -9, -9, 8, -12, 1, -30, 15, -10, 9, -6, 9, -17, 8, 8, 7, -37, -4, -21, -3, -2, -1, -13, 3, 12, -2, 5, -30, -3, 13, 0, -15, 6, -27, -6, -1, 2, -9, 7, 9, -1, 7, -12, -13, 4, -13, 17, 5, 3, -7, 3, -16, 19, -2, -12, -21, -13, 11, 1, -5, -12, -21, -12, -8, -3, -16, -18, -11, 5, 0, -4, -3, 8, 6, -2, 4, 19, -19, -3, -6, 12, -10, -2, -16, -9, -7, 2, -8, -3, 15, 0, 22, 30, 59, 49, 47, 52, 40, 15, 11, 21, 3, -13, 13, -6, 12, 0, -9, -7, 1, -13, 1, -1, -7, 2, 5, -11, -6, 9, -2, -24, 3, -14, 1, 2, -6, -1, 6, -5, -23, -14, -6, 2, -3, 13, -9, -3, 4, 1, 1, 11, -18, 1, -5, -8, 7, -20, 0, -22, 9, -21, 14, -32, -11, -5, 9, 2, 10, -20, -4, -23, -13, -5, 1, -27, -7, -22, 6, -21, -1, -6, -3, -21, 5, 0, 0, -3, -23, 0, -3, -3, -5, -7, -2, 10, 6, 26, -28, -3, -2, -1, 5, -2, -2, -18, 14, -24, -5, -12, 2, -1, 10, 11, -12, 8, 0, -6, -22, -1, 3, 0, -5, -2, -15, -2, -1, 12, -2, 15, -9, 15, -6, 14, -7, -6, -4, -5, -23, -3, -13, 12, -12, 17, -18, 8, -11, 10, 3, -9, -18, -6, -1, -6, 10, -1, 0, 0, 0, 3, -20, 18, -16, -11, -10, 12, -10, -3, 9, 2, -15, -11, 9, -12, 11, 14, -22, -13, -4, -1, -24, -10, 11, 6, -8, -7, 5, -15, -11, 0, -13, -14, -1, -3, 7, -22, 14, 9, -27, 2, 8, -5, -15, -5, -24, -6, -7, -10, 19, -21, 1, 3, -5, -2, 3, -14, -21, -12, -15, 22, -16, 7, -4, 4, 24, 1, -16, 0, -11]
-0.03127a1K2j9K4j0j4Lj1pNJLK1mj2J2j7L0l5J0jJ9oJ2k0jkMj3J9j8rJ6K2k4j5M7r
-0.05010A2j7qKJ1j0Rj9K0noMPQj2Jj1J0lK8j7nJ9kl0j%J8%Rk7RJ4j7jJ0oj1K1j5Rr
-0.07095a1J3jk3K5k3oK7J0rj4K7l5N1m2K1j1jrK1j2j6L2k7K9j7JMj1j2nJ9J0jj8J4
-0.08876@k6K3J1rJqrK9k0MJ7jnJ2l5K4l7K2jRj2LK4jj3k3nMTJ8qOj6PkJ0KNmTMk9L8
-0.11063Il0K3j5J9j3LK4k9J4k6jJ8k4M0j2Llj9J4j3J3kk0J8PNJ1j4pj3J9rJ7j1m%Q
-0.12945@lJ5j1lO%j0JKpK5j7m%j3%J0Tk0jJ7J0j5j6J7QopJ8Mj4j7K2j2kj4MK3oLK0
-0.15031A7k7kjK0pLk0L2l0lLK3m9M9kKj9K5k8NoK8m5K8k2L4k6%NKqPpJK0j3J1rK2j3
-0.17066@J1k3J5k8L8l3QPj%K3j1Mj1j5%lL3j5j3PJ0Qj0LoJ6j9J3j0J7l2Nj3M1l3K5
$$ y = [-11, 11, -8, 16, 6, -8, -5, -16, -23, -18, -17, -14, 7, 3, -9, 3, -14, 16, -19, -9, -10, 9, 3, 15, -5, -6, -8, -4, -17, 2, -16, -25, -9, 13, -11, -26, 21, 12, -5, -13, -11, 0, -10, -1, -20, 0, -5, -11, -7, 0, 8, -4, -3, -14, -4, -7, 21, 4, -1, 18, 16, -14, -15, -15, 3, 3, 12, -15, -6, 8, -9, -10, 0, -6, -17, 4, -11, -2, -11, 2, 1, -22, 3, -20, -26, 1, 11, 2, -12, 15, -20, 31, -11, 10, -1, -2, -11, 10, -2, -18, 14, -13, 16, -1, 0, 4, -7, -19, -24, -5, 5, 4, -14, 0, -26, -3, 8, -1, 0, -8, -17, 12, -8, -4, 13, 12, 7, 19, -16, 8, -29, -7, -8, 1, -11, -8, 16, 15, 2, -21, -26, -22, -18, 0, -8, -2, -18, -11, -13, -3, -1, 4, 0, -4, 0, -29, 9, -21, 2, -13, 6, -7, -4, 20, -9, 5, -21, -22, -4, -28, 12, 0, 3, 0, -19, -5, -18, -5, -7, -27, -9, -2, 3, 14, 0, -7, -20, -1, -10, 7, -4, -8, -8, 0, -3, 12, 1, -2, 4, 4, -6, -5, -3, -10, 15, -2, -6, -6, -19, -19, -9, 1, -19, -20, -3, 7, -8, -24, -7, 1, -5, -12, 6, 10, -4, -21, 1, -11, -13, -27, -23, 0, -6, -3, 17, -10, -12, -13, 7, 0, 3, -17, 15, -15, -18, -15, 8, -41, 8, 6, 8, -11, 14, -14, -9, -15, 13, -32, -4, -26, 8, -18, -18, -13, -11, -19, -12, -19, -18, 2, -11, 0, -9, 13, 0, 11, -12, 3, -25, 13, -20, -12, -5, -6, -6, 17, 6, 10, -1, -16, -16, -19, 14, -1, -14, -7, 3, 11, 1, 4, -2, 14, -5, 8, -2, 15, -17, -12, -25, 16, -17, 8]
-0.18948Hj4Mj7J2PJ4qj9PLlN%Jj1JTKJ4pOl1L8k4K0j8R%jMj0%qJ0PqTJ6Jk0J7k5MJ6
-0.21187ek6K7nJ6k1POqmJ3k7J0J5j6K9j5rj7K4k1L3k6L3l0J8nMk5K8j6ONQKpJ1j6J8
-0.23120A4k6Nj8L2j3Rk4M1l8J1jJ5rmRKk1J5%mj5M2ol0J7Omk3LK7l3J4j7L7l1K5j0
-0.25002cK2j9%mj9LK5lkoj%KnJ5Jj3L4m6K3pj9K1NMJj8JkJNkJ0J1kj7lJ6roOoONj3
-0.27291hJ7qj6J2j2K2l6K9Mk5J9j8K7pj1JJ5pKj1J3onJ0k4J8KLj0J4j6J6k7J0L0j7
-0.29123@LjRm5K8%j2J3jmpJ5j1mJ3rkJ7j8qJ9k5M0j0qRj3jK6k2JjJ6j1jj4N2n2L1k0
-0.31157hLj9L2j6Pk5L0l3K7oJ5l9K3J3Lnk6J2KQP%QonJ3j8qj0PKJMPjKj1K5k3jTJ4
-0.33294DJl0QOJ9k4J2omJ9lk8L2qJ2k8K7qoMJ2k0K9l1Rjj6K4oOj9qPkRJ8j2Qj6J6l4
$$ y = [8, -6, -2, -19, -7, 0, 14, 6, -13, -6, -3, -6, -1, -1, 0, -11, -10, -9, -7, 7, 0, 6, -25, 13, -11, 9, -9, 0, 0, -1, 3, -7, -7, -15, -5, 2, -6, -14, 2, 3, -17, 0, -25, -21, -5, -31, -4, -9, 7, -14, -7, -1, -9, -13, 0, -27, -17, -2, -18, 11, -4, -13, -30, -6, -27, 6, -20, 13, -17, 1, -4, 0, -25, 3, -13, -7, -2, 6, 8, 1, 12, -4, 14, -12, -7, -25, 7, -6, 3, -21, 20, -18, -7, -8, 7, -2, -6, 3, 5, -16, -1, -1, -5, -20, 22, 16, -14, 3, 9, 5, -18, -15, 12, -21, -7, -24, 13, -18, 7, -3, 19, 0, 0, -4, -23, -20, 5, 2, 0, -6, -7, -7, -5, -10, 5, 6, -7, 27, -19, 4, -3, -22, -1, 4, 8, 9, -9, -8, -10, -9, -4, -6, 4, 15, 13, -4, -7, 9, 0, -6, 0, -6, 0, 5, -8, 9, 1, -15, -3, -15, 7, -29, 0, 4, -21, -2, -20, 7, 0, -11, -10, 5, -2, 0, -11, 2, -4, -9, 1, -23, -5, -3, 0, -10, 4, -12, 4, -23, -13, 17, 0, 3, 2, 11, -34, -6, -6, -18, -5, -6, -10, -17, -2, -13, -17, -4, -13, -15, 2, -16, -24, -5, -30, 10, 0, -8, 1, -12, -13, 13, -9, -8, -9, 7, -4, -5, -19, 33, -19, 12, -8, -5, -24, 8, -8, -1, -26, 4, -29, -2, -8, 7, -32, -9, 4, 7, 2, -24, -12, -10, -2, 5, 5, 13, 7, 2, 15, -3, -11, -21, -14, -12, -11, -7, 0, -1, 1, -10, 15, -8, -9, -10, 4, 5, -25, -17, -11, 8, -16, -4, -10, -14, 5, 2, -26, 6, -2, 10, -18, 9, 1, -5, -1, 11, -9, 20, -11, -2, -3, -19, 5, -1, 5, -14, -22, -15, -17, -8, 10, -2, 6, -10, 6, -28]
-0.35380b8RK0k0K1j4J1j6lK7j1krOJ3pJ0j2j3NnQj3K4j1J0j6J0QrNj1J2oPj3OnJ2m
-0.37364dj2K5j6nRQnk2K8k6K0Lk4MTk1K8%j9J1J9rRk2J6j3J3mnJ0pNJ4j3J7j9J3k9
-0.39297a9J4j1J7j%k5L4k0NKLnj0J6mrJ7J0k1k8J1J3K1ol2K4j7J1J8mqQqJ0j3J3k1
-0.41179a5PJ%j0K2ok3J3nlM0m2K8j7Lj5K8j2J5j3%K1k7LRKj6K3qj2J1k1J4j5K0oPj9
-0.43112a8K5k3K9l5L5j0J1l9K0ROpmPmJ1k0Mk5K7Nkl6QK7pMmjj0jJ4qK0Qk5pjJ5k7
-0.45147b9L6j5jJ5j0lJoRnQ%j9J9qLNQ%k0NJK2k6K0qkJ0k1J0K9k1j2NrJ9j8Pj7J0Q
-0.47233@Pk0KkOpK1pj4Qj8L2l3L0rk1J8jnJ5k0KPLNLj7J5OqoJ2kmpOj1MTlLj3LJ9j3
-0.49522a0LnJ2j2J4nj9M0l2RpJ0JRj1qQJ5m4J5Tk1K4k6J8MkP%krJ4oPj2LRj2J1j2K5
$$ y = [-28, -19, 1, -19, 2, -12, -1, -17, -20, 7, -4, -6, -15, -9, 4, -3, 7, -5, -18, -13, -18, -10, -23, 1, -10, 0, -16, -6, 2, -7, -2, -13, -1, -7, 0, -13, -7, -12, 0, -4, -16, 9, -7, -12, -3, 5, 0, -22, 6, -20, 0, 3, -21, -17, -13, -34, -6, -6, -25, -14, 5, -4, 5, -17, -1, -14, -1, -5, -10, 0, -7, -2, 12, -1, 16, -3, 10, -19, -5, -16, 1, 0, 0, -25, 9, -11, -6, -4, -1, -6, -16, 0, -4, -13, 4, 14, -7, -35, -24, -11, 10, 4, -28, -4, -21, -10, 8, 4, -4, 4, -4, 6, -7, 6, -15, -8, -7, -7, -17, 5, -1, -24, -11, -16, -19, 21, -21, 7, -10, -7, -22, 6, -6, 9, -4, -4, 17, -10, -7, 2, 4, -12, 11, 3, -9, 2, -19, -5, -20, 0, -6, 1, -18, 7, -16, 13, -22, 13, 3, 14, -25, -5, 4, 10, 3, -1, 6, 2, 13, -7, -3, -28, -1, 4, 2, -34, -26, 1, -6, -2, -6, -7, -17, -18, -4, -12, 8, 16, -9, -16, -17, -2, -29, 7, -8, -9, 6, -4, -7, -6, -12, -3, -8, 0, 0, -19, 0, -8, -5, 0, 8, 8, -12, -7, -6, 16, -10, 10, 2, 0, 10, -11, -1, 28, 7, -5, 0, -9, 10, -8, -1, -18, -8, 0, 7, -13, -11, -13, -7, -14, 7, 0, -14, -6, -24, 8, -25, 5, -4, -25, -7, -8, -13, 2, -18, -16, -9, -6, -1, 2, -15, 0, 6, -2, -8, 4, 2, -2, -9, -3, -14, -10, -6, -9, -6, -19, -16, 3, -10, -7, -12, 0, -12, 2, -3, -22, 18, -14, -5, -12, -2, -1, 8, -3, -11, -3, 12, -32, -17, -2, -23, 1, -25, -7, -3, -5, 2, 2, 0, -9, 5, -1, 6, -6, -3, 6, -6, 5, -7, 18]
-0.51608A8l6J5j1K6j2j1joL2k7P%Ok6L0j4oRJ2j7LjJ5jj1j6K8l7L6LJ1l3J7J4qk4L9
-0.53490B3j8nj9J9qPj5K9k5K1j1j3j1J3k0M6j4k4OL4k7J9l4L0J1m4K7qnJ6j1QmPj1
-0.55270a1K3k3qRL3m8L8j3k5J8L0l1J0rPpK5Kl9J3Okk7K1KK5j9Qj1kj6J9MoJmqL3k6
-0.57254hqJ8Jr%J9opPj6J6k6J8k7L3j9OP%JTj1MRmNj5qK2j5K0j4OrOj1J4Ok9L6k0J6
-0.59391Ij8pL3j9j8J4lOj1J4jOm3P8l1pj2J2jJ0m6M1kQk7K5l1L7k8NJ0l0L6oTJnOK
-0.61375Ak1K8j1j4oORJ1k0J8j7J6j1OJ5k6%KL0l0J3J8m0K1JOPj1lTqlQpJ2Ok4K1j1
-0.63359a1J9okml0L0qJ0kJ0mjJ5l2J3oRj2OTMq%Rj9JL3m0J6Rj4J1j1jJ7rj8M5m4J1
-0.65394hKOpj7K0MpJJ2j0J0rJ8m8M3mk2J1oJ8Nk7qRJ2j9PKOj8K4QOj4lj1KK7j8lKK8
$$ y = [18, -18, -3, -14, 12, 0, -11, -12, -18, 14, -13, -6, -6, 0, -26, 4, -10, -16, -7, 5, -12, -9, -10, 5, 4, -7, -23, 5, -32, 4, 7, 18, -15, 2, 16, 8, -16, 23, 5, 0, -19, 0, -8, -1, -16, 13, -12, 9, -2, -15, -26, -13, -33, 13, -1, -25, -19, 15, -12, 7, -27, 3, 14, -30, -3, -11, -16, 0, -11, -3, -7, 0, -11, 12, -11, -19, -10, 23, -25, 13, 0, -25, -7, 23, -8, 2, -7, 0, -7, 18, 20, -19, -6, 0, -2, -29, -8, -6, 19, 0, 8, -3, -5, -21, -2, 2, -4, -3, -7, -15, 18, -8, -16, 2, 3, -6, -6, 13, 7, 0, 7, -9, 7, -19, -1, -28, 5, -14, -8, -1, -1, 0, 1, -10, -6, 3, -1, 4, -11, -19, 3, -12, 8, -6, 0, -9, -3, -14, 0, 6, -23, 13, -7, 9, -9, -16, 17, -2, -20, -6, -9, -3, -14, 0, -1, 5, -38, 40, 9, 2, -10, 2, 1, 11, -35, 6, 4, 12, -15, 10, -21, 16, -12, -7, 3, -27, 9, 3, -3, -2, -7, -1, 1, -20, 8, -3, -17, -23, -17, -8, 3, -17, 1, -16, 0, -11, -5, 10, -16, -16, -14, 16, -14, -1, 17, -23, -2, -1, 5, 12, 1, -2, -5, -13, -16, -8, -15, -3, 3, -21, 0, -11, 8, 2, 0, -4, -34, -4, -12, -2, -4, 6, 2, 1, 16, -16, -3, -9, 0, -12, -6, 0, 4, -4, -4, 5, -14, -13, 20, -20, -4, 5, -9, 2, -9, -10, 7, -2, -20, 25, -19, -8, -6, 0, -7, -24, -4, 0, -7, -6, 6, -4, 6, -3, 15, -33, 10, 6, -16, -5, -11, 7, 12, -15, -23, -14, -2, -21, -14, -12, -6, -24, 0, 8, 14, 0, -3, -14, -12, 15, -3, -6, -4, 24]
-0.67530B4j4J2l5J6j7J6l4L0NoJmMKjMl3K0J7J2l1J5nkj8K1Rj4qK6k4J8kk6L7j6Ok6
-0.69464b1K2j3Qj8J1J7J4m7K7l0K4qJ5j7J5oJ5j5K2m7K1L1k5%J3lk3Rj7K9l4N7k8R
-0.71193Gpj8pL1Nj4j0K3lj1Pj1Qj0K5j6rJ2mJ0j5NPj7K5j6J0Lj9j4L1k1M0l3KrK8j4
-0.73126AMj6K6kj8NQj5jJ7lN%j5qK6l2J8Kj4jj5PJ2J5Qj5K4k9Oj3K3k0L3j7j1Qj1%
-0.75110hqK2j5KRkk1L7k8J7j9K6m4M5Jj0TK6j7KQj9Or%LkL2m1K6j0k9J7qNlJ5JlpK9
-0.77196A6j1TJ4m2L9l1PK6qT%J1NjrJ6Ql6K4l8J0j1L3kjLj0nJ3Jj7K5j0%rK0j1J8l3
-0.79180a5K1j7K7k7K6kk8J1oK1j6nK%J9qQj7mK0m2M2j4ROj8Qj1LoJ1Tj6LpK9k2Mj6
-0.81164a6J5mj4RoJ0JnJJ0MLJ4m3L4k2ML2ml5J3j6K2j7nJ2jkj2OJ0Kj0J4J7l5J9j6
$$ y = [24, 10, 22, -13, 3, -14, 2, -32, -2, 3, -3, -2, -6, -2, 0, -1, 3, -30, -10, 7, 19, -12, 3, -2, -4, -22, -1, 8, -6, -14, 12, -12, 6, 4, -22, 15, -1, 5, -21, 1, -12, -4, -22, -11, 6, 20, -27, 0, -30, -6, -14, 1, -16, -1, -7, 8, -7, 15, -32, -11, 20, -5, -5, 8, 5, -18, -9, -26, 3, -31, 26, -2, 7, 0, -18, -25, 6, 11, -3, -13, 10, 7, -4, 3, -8, 0, -10, 15, -1, -10, 2, -2, 8, -7, -2, 5, -12, 13, -3, 7, 10, -9, -23, 8, -13, 27, -6, -4, -13, 15, 1, 5, -11, 15, 13, -5, 0, 8, -7, -8, 9, 6, 11, 11, -4, -12, 14, -18, 0, 2, -12, -13, -28, -21, -9, 6, 14, -1, 23, -6, 0, -13, 10, -10, 23, 6, -5, 3, -8, -8, -16, 6, -9, -7, 2, 0, -21, 16, -12, 5, -14, 12, -32, 13, 14, 4, -6, 20, 3, 5, 13, -6, 0, -9, -9, -6, -8, 24, -17, 9, -1, -30, -13, -21, -16, -19, -4, -3, -6, -13, 16, 5, -6, 8, -34, 5, -26, -19, 7, -1, -9, -9, 2, 7, 6, -3, 13, 21, -15, 9, -29, -19, -30, 3, 1, 0, 3, -7, -12, 1, 2, -15, 10, 0, 0, -9, 11, 0, 18, -15, 6, -11, 16, -11, 15, 13, -15, -4, -10, 11, -5, -10, -8, -8, 11, 3, 11, -6, -10, 10, -32, 10, -4, 5, 11, -7, 1, -10, -7, -13, -2, 9, -7, -4, -11, 18, -4, 0, -16, -1, -5, -19, -10, -16, -6, -5, -10, -9, 1, 5, 8, 22, -21, 13, -9, -5, 27, 23, -12, 1, -15, 7, -10, -15, -3, -4, -6, -18, -12, -2, 0, -10, 4, 21, -14, 5, -11]
-0.83097a1oJ5k3M4rl2J8m4M8l0RkK9j7Qj2K4j8RjL%oMj0jRmMqK3k0J0k1kK0j1J4lj
-0.85132aPnj1K0k5%J1J5n0K8J8l0QoQnJ3kJ1j0kKJ6k6%nK4Pk7LJ5Rk7J8j5KlJ0Nn%
-0.87218eNklK0j3moN%rL7l5JjJTK4l4J6j0J9rMNl1M5k6jj2K2Mj4Kj3J7k4J9jmj%mR
-0.89405fQolQj4%J8oqJ0mMKok7K5%j0JK8j3j9K9m0J5L3j7lKNk2K4mrJ4%l0L3k8Qj5
-0.91491b3J9Rk9K2KPqTJQ%TMnPj5OMK2l3Rk1K2PKl9M3k0JJ2nj%J9m8J8pJ5NkrpOJ0
-0.93729@Km%J4qj9J1K2l1K1j6j4kKM4l3L9m1RJ0j6QJ5Nm8M0j5L1n1L1j0pJ7oJ5j7J1
-0.95611ILj6J6j3qkJ9l2K0RoJ3k7J8j2lqK1lJ9m0K3j8K%TmNJ3j5pJ3J0pJQqJ1j5QL
-0.97697@j0j3OK8j8Qj2LpL1k3qK4J3l1L1l3K0j8J5j6J9l5K2qJ2j5J1lTJ6rj4K7qPK5
$$ y = [-11, -17, -2, -25, 19, 10, -22, -4, -48, 0, -30, -21, -23, 6, -11, -3, -15, 9, -9, 0, -1, 2, 2, -4, 0, -10, -11, -2, -6, -2, -10, 13, -7, 3, -18, -20, 0, -11, 3, 0, -1, 6, 1, -10, 10, -15, -15, -4, 11, -39, -11, 7, -23, -15, -21, -13, -18, -5, -7, 4, -6, -8, -6, 10, -16, -16, -21, 3, 10, -17, -14, 1, 10, -17, 1, -14, -12, -15, -5, 0, -5, -5, 0, -2, -5, 15, 2, -2, -8, -3, -3, -12, 25, -10, -9, -10, -9, -8, 16, -18, -2, -12, 7, -2, 2, 7, -24, 21, -5, -6, -18, 4, 8, -6, -4, -17, 0, -24, -5, -6, -10, -11, -11, -15, -6, 2, -4, -7, 1, -13, -13, 5, -1, -9, 1, -3, 1, 3, -3, -30, -5, -5, -15, -14, 14, 1, -18, 11, -29, -14, 19, 2, -1, 1, 6, -16, 8, 4, -5, 9, 9, -21, 12, -16, -8, -23, -4, 5, -24, -2, 0, 7, -1, -9, -8, 0, 0, 0, 4, -1, 6, -9, -3, 1, 23, -10, -1, -22, 0, 7, 9, -30, 13, -7, -6, 6, 1, 0, 0, 19, -29, -11, -18, -3, 2, 0, -9, -16, -10, 0, 2, -2, -2, 12, 4, -15, -4, 18, -13, 8, -8, -22, -24, -22, 22, -11, 28, -13, -4, 6, -10, -2, 13, 18, -30, 10, -5, 26, -25, 6, -4, -11, 6, 0, 15, -2, 9, 12, -4, 12, -1, -9, -11, 8, -24, -4, 5, -1, 12, -15, 3, -9, -12, -20, 1, -2, 17, -23, 0, -18, -16, -16, -16, -20, -15, -2, -17, -24, -11, -1, -8, -7, 1, -7, 4, -11, -3, 0, -10, -23, -17, 11, -7, 1, -11, -8, -15, 16, -7, -15, 9, 22, -9, 22, -11, 9, -9, 6, -10, 9, -26, -4, -12, 0, -15, -4, -7, -10, 6, -3, -17, 10, 2, 9, 34]
-0.99579C4m6JJ1k6J2J3kmJ3j6J0qJ1j1J4Qj4Oj1j2K2j5J5nNj9L4l1ONK%j8J2j2K4j6
-1.01462hj8ROJ4j2QjJ2qoj0K3k9L9l7K2k7J8J1j6j5K5mMj7K8k6L8m3JRQmPj5J6j7L
-1.03395a2P%joj1K0J1j6K0j2K3n2M0j5J3m2L4jrK2l3K2j4J4kk8NJ9QOQk6LpNmJ9j2
-1.05328dJj1J4k2J3MlK3j6TOmJ6jmJ5l9J4j0MNJ5k1J8j8Rj0L3j7j1K6lj3nL5l4Oj9
-1.07261b4K1k6L8l5K2NJj6K9k5L3l6J6%J2j0j9oK7k8L0l4K1pK1k8J6NplK1oj9J3kp
-1.09092gK6k4Nj5J5j1K%j1J3k3L5nj7K3mLk3J8j9mK3OLqkj0%qJ1j4K7j4k6L6j7J5q
-1.11025iqJ4Km%Nj4NJ0Mj8MLj2L6k4Oj6mK7kj6K0k1J1Ljk5K0JNJ6j8j1K3k6K0J2k4
-1.13009fpoK8j0nNk6L0k1J8qJ1Ook3K4roQRjk5K0lQj2PJ3j2l1K5J8j8K2j7Mj6Oj0J6
$$ y = [34, -12, -11, 0, -26, -14, -1, -3, -7, 6, -10, 0, -8, 3, -8, 6, 14, 0, 6, -5, -17, 5, -10, 5, 0, 5, -14, 20, -11, -5, 0, 2, 2, -16, -4, -16, 8, -8, -26, -17, -11, 3, -9, -1, -2, 10, 2, -4, -14, 9, -20, 19, -18, 4, -23, -5, 6, -10, -25, 0, -4, 0, -17, 11, -15, 23, -20, -19, -10, -2, -6, 1, -14, 2, -15, -12, -5, -5, -6, -12, -23, -3, 8, -8, 12, 0, 23, -29, 11, -4, 9, -33, 1, 0, -9, 13, -20, 2, -12, 2, 0, -28, -23, -4, 4, 10, 18, -8, -5, -12, -7, -11, 8, -4, -3, -14, 0, -22, -9, -5, -8, 15, -1, -17, -11, -15, 1, 0, -4, 11, -28, -14, -24, -20, -15, 0, -21, -3, -21, -12, -22, 11, -6, -17, 9, 6, -7, -12, 23, -11, -5, -24, -3, -29, 9, -26, -4, 1, 2, -14, 15, -10, 23, -13, 3, 3, 15, 5, -14, -20, 7, -21, 9, -25, -4, -11, 10, -18, -2, 3, -4, -7, 14, 8, -11, 2, 0, -7, 19, -5, 0, -15, 0, -11, -9, -9, -20, -7, -30, 5, 0, -17, 6, 2, 5, -18, 0, -19, -23, 0, 6, 9, 1, -1, -11, -11, -19, -8, -22, 5, -9, -35, 1, -16, -1, -9, -17, -3, -1, -5, -5, 0, -14, -9, 1, 5, -13, -9, -6, -18, 18, -6, 0, -16, -20, 7, 5, -11, 9, -12, -1, 2, 1, -24, -4, -3, 2, 18, 0, -11, 12, -14, 6, 18, -6, -13, -19, 9, -1, -6, -1, -27, 3, -18, 0, -8, 3, 9, 3, -20, 4, -5, -11, -3, 6, 5, -20, 0, -3, 5, -7, 0, 13, 1, -30, -5, 13, -5, 17, 0, 4, -12, -6, -16, 0]
-1.15044@K3k7Rk4K9l3L7k8L2l4K1Kkj5Qqj0NJ4J0rJ4l2Qj1L1mTrJ1j0NOk2L9k9J0J2
-1.16977A5l0J5j0Jj0J8rJ0j2j%lJ6Nj0NlLj6qK7Oj9J9rj7QPj9J0Tj3J5k4K1J4k5Lq
-1.18961a8K8qoMk1PJ0j3J5J4k6NRj1OJ2j3K2j3j1j5JK6k0K5j5PmJ1k6NnK5j4K3k8L
-1.20844iknJ7Tl4J2J0Oj8K6k4J2oj1%J6j6nJ7j6k5N4k5RrLqMNlORpNk9L4j1Oj8K0J7
-1.22929B4m1L0j7J3qNj1J2pLk7K2qMJ0Kp%NoJ6j8rkJ2Lk9K2j9L4k3OK2k5J3nkNk1J1
-1.24964a1oJ1OJ3k2nJ1QmTRj4Lj3K7j5RmJ6j5lnPJoMpPlmJ2%J1k7J4mk7K5J7j7j5K0
-1.27101@j0KJ0k%k1K6k2L2m0K0mLj4NJ6mjK3k8Kj1jL4j0k7L0roj4K2k2K0m3M6kOj2
-1.29034fK1j5Nk5K2J0k7L4k6QlKJ0j5Rk6J8mTJ8lLJ0mj2nqL5l1J7k2J6Rj1jrJ2moK8
$$ y = [0, 23, -4, 5, -19, 10, -23, 14, -14, 18, -16, 5, 7, 5, -10, -2, -10, -20, -15, -1, 9, 0, 14, -18, -10, -21, 10, 6, 2, -7, 4, -6, -1, 5, -17, 22, -7, 3, 15, -15, 0, -10, -9, -19, -1, -10, 0, -12, -13, -13, -16, 0, 5, -5, 0, -3, 0, -16, -24, 3, 9, -10, 9, 0, -17, -9, -2, -21, -11, -1, -14, 1, -23, -2, 12, -13, -10, -18, 10, 2, -4, 0, -21, -14, -4, -17, -2, 12, -14, -9, 0, -11, -5, 7, -6, 16, 3, -8, -23, -22, 4, -16, 9, -6, 1, -3, 8, -18, -13, -18, 7, -7, 16, -12, -9, -11, -16, 1, 18, -16, -4, 6, 12, -6, 20, -4, 8, 2, -9, -9, 7, -9, -14, 3, -13, -38, 16, -9, 0, -9, -6, -14, -10, -5, -8, -2, 7, 0, 5, -24, 10, -1, 5, -13, 7, 24, -17, 13, -4, 9, 1, 6, -5, 7, 0, 3, -24, -2, -10, -6, 4, 6, -1, -1, 4, -2, 14, -4, -13, -15, -3, 0, -29, -7, -26, 8, -15, -9, 13, -12, 1, -4, -6, -1, -22, -11, -17, -6, 0, 13, -9, -14, -3, 5, 1, -3, 6, -8, -5, -18, 9, -6, 3, -1, 15, 0, -3, -8, -1, 0, -6, -2, -9, -2, -5, -9, 3, 3, 14, -13, 1, -3, -30, -5, 12, -5, -20, 0, -10, -8, 2, 0, 0, -21, 5, -17, 15, -25, -5, -9, -6, -20, -15, 1, -3, -4, 19, -9, -7, -18, -19, 15, 5, -22, 8, -1, -7, -21, 1, -21, -1, -44, 2, 0, 6, -6, 15, 0, 5, -20, 2, 12, -15, 19, -7, 1, -2, 0, 10, -5, 4, -22, -4, -8, -12, 6, 3, 6, 16, 12, 0, -5, -13, 22, -9, 8, -14, 2, 11, 0, -1, -10, 2, -2, -8, 20]
-1.31069B0j9j2J1%rJJ7mOk2PnlJ2QqjLkJ4Mj6J0j2Jk1QrJ2jJ6Oj1j7nK7j1kJ2j6J5
-1.33154DRj0j5J2Rmk2OMK3k4Pj2J4k3K5pTLrJ0K5j6l8N5k8j7K3Lj1J6Jj7J0KjJ1j1
-1.35087@J7jj3Oj0Kl2L0rLMlrRjrpK9j8J9k3JJ0kJ6k8MJ3rQj6kJ2%J0NnlJJ1j6K2k7
-1.37275a1OJ3j3oM3n1K8j5J7k8QrjK%RJ0Jjj5RlNJj4lJ8j4J4NmqojK3j6J3j1J8k6K1
-1.39361Hk7K2Ook3M1l3K3j2oMJ2j3LOkj9J5KTj2j3K2j0mjL3l7j3L0j7J9Jmj2NJ2oTO
-1.41396dJ0rMqj1MQqJ9j0NlPqkKpnpK6j2J7k6J8kk0K0Pj8K1JnNr%jJJ3j6kJ5j0kk1
-1.43634b3L6o1O6l7K6j6J1l%oJ4jj1kK1j6TK5k6J3Rnl2M3j2oj3J8%J0j7Rj0J2j7J3
-1.45465dpLnjK0k6K1K9m0K0j3J7j5j4KJ2T%j8oJ9l1L7l2oRK5k9K3k7L2j5lrJ5j6J5
$$ y = [20, 1, -11, 0, 0, -9, -8, 9, 5, 11, -11, -4, -9, -12, 0, 8, 0, -1, 2, 0, 14, 18, 2, 12, 0, 1, -20, -12, -21, -9, -10, 6, 12, 1, -16, -21, 6, -5, -7, 5, -11, 4, 13, 3, -12, 0, 9, 5, -17, -11, -7, 16, -8, -1, -13, 1, -22, 3, -4, -11, -8, -17, -7, 18, 2, -36, 19, -9, -26, -3, 0, -11, 5, 6, -11, -1, 1, 0, 11, 0, 17, 16, 3, 9, -1, 1, -31, -1, -10, -7, -3, -6, -15, -6, -7, -16, -23, 6, -12, 7, -16, -15, -5, -7, 9, -19, -15, -2, -11, -3, -19, -21, -9, -9, 1, 6, 1, -2, -1, 10, -6, 16, -11, -5, 8, -5, -11, 32, -19, 9, -6, 11, -17, -9, -18, -19, -17, -17, -8, 2, 3, 2, -13, -4, -7, -2, -1, -15, -18, 0, -14, 0, 5, 1, -7, -13, -14, 9, -7, 6, -5, 13, -13, 8, -19, 3, 9, 3, -20, 21, -12, 11, -1, -7, -3, 9, -4, -1, 5, 3, -16, -1, 1, 3, -9, -22, 0, -10, -14, -15, 18, -19, -32, -2, -19, 0, 1, -3, -15, -10, 2, -4, -10, -4, 6, -3, 1, -7, -18, -14, -6, -14, 5, -5, 0, -3, 4, -4, -6, -4, -11, -16, -23, 3, -9, 8, -18, 0, -2, -22, -2, 5, -13, 8, 9, 4, 9, 0, 0, -1, 0, 13, -3, -5, 10, 0, -2, -23, 13, -48, 18, -19, 7, -9, 2, -1, -1, -7, 7, 6, -5, -7, 14, -2, -18, 7, -19, -6, 3, -2, -34, 9, -3, -9, -22, -4, -4, 6, -11, -2, -12, 0, -17, -4, -11, -8, -13, -14, 6, -20, 1, 30, -10, 10, -3, 14, -1, -15, -13, -1, 11, 11, -7, -13, 6, -25, 12, -20, -26, -17, 8, -21, 2, -25, 7, -8, -11, -20, -5, -21, -6]
-1.47347fPolj3KK0QLj7mRopL2j6Jpj6J4J2j5K0nl6L1LJ6j5j8KJ1j3J7j8J8l2K6mqM
-1.49382iRmjL%kQj9MlK1Mk1J0NrTK0Mrj9J8j9RqK5j4j0J0j4K0j9qL1j9%KJ1j5J4K0
-1.51468A7l5J7lQl5K5rJ4Nj2J9j2mqJ0j7MK4orqK2J0j8Jl8K3qK9k3J7j7J2MPJ4l9J
-1.53401a8J9J3k8J7j3K4l1J7kk2L1k0K3j4Pljk1L2j3Oj9OJ3j9QJ8k0J7Pm6M2k5K3k9
-1.55182b1M1l3J2OL%j9QNJ6k2Mj7PLj2J2K0j7L1j5l5J0PMqK7k6K5m2K3%KJJ1lj7j0
-1.57115a9J8k3K4o%J3kqmoJ5Ql5K4k1L1k1J2k8L5pJ1k8oJ6NrNRk2J7qjJ1J2j5LNj4
-1.59099iJMjj3K6k8L9k6OkQnj2L7l2nqK9j2nKJ1Jk3L2pj8lo%K2Nj4Mj0J2K1j3KpqO
-1.61235AloJ4k9J2PJ0Tk8rJ7K5k1oJ1LqmMJJ3k5JJ0j5KjJ8k1K4l5L7qj5jJ5Kj6J9j7
$$ y = [-6, 1, -5, -8, -21, -19, 1, 9, 12, -5, -9, 0, -6, -13, 19, 3, 4, -3, -19, -5, 7, -8, 12, 7, -29, 2, 5, 21, 6, -12, -10, 1, -12, 5, -13, 5, -27, -1, -5, -13, -9, 0, -4, -5, -2, -2, -4, 4, -15, -11, -14, 7, 11, -10, 0, 5, -4, -13, 7, 11, 2, -17, 1, -18, -9, -17, 8, -6, -16, -6, -20, 0, -19, -27, 4, -15, -15, -13, -2, -17, -3, 17, -18, -1, -4, 4, -31, -6, -15, -1, 4, -8, 11, -1, -5, -13, -3, -20, -16, 8, 2, -7, -15, 7, 17, -1, 0, -38, -15, -23, 6, -17, 0, -17, -5, -1, 6, 20, -19, -18, 1, 14, -14, 3, -10, 14, -17, 0, -2, -24, 7, -13, 10, -4, 3, 0, -1, -22, 10, -3, 3, -16, -10, 3, -16, -8, 10, -10, 7, 14, -32, 10, -15, 8, -21, 20, -13, -1, 5, 8, 8, -11, -3, 2, 18, -4, 0, -17, -10, -7, -19, -7, 13, -4, 27, 12, -23, -13, -6, -2, -10, 17, -9, 16, -26, -3, -3, -1, 0, 11, 8, -9, -19, -1, -24, 0, -6, -6, 7, 5, -3, -7, -13, 2, 10, -25, -1, -22, 9, -12, 0, -28, 7, 0, 11, -17, -23, -7, -2, -11, -6, 3, -19, -2, -10, -11, 0, 12, -3, 0, 5, -9, -8, -4, -5, -18, 8, -20, 19, -7, -1, -3, 5, 0, -12, 25, -7, -12, -20, 9, -3, -8, -6, 5, 6, -17, 15, 8, -10, -13, -19, -19, 3, 8, -6, -2, -12, 0, 21, 8, 10, 3, -5, 1, -2, -8, 6, -23, -11, -4, 6, 16, -12, -21, -4, 21, 0, -6, 5, 8, 0, -4, 0, 1, 14, -11, -10, 0, -15, -13, -14, 4, -17, 7, -28, 9, 1, -14, -15, 0, 2, -14, 5, -12]
-1.63270a2J2Pj2MJ1j1qPKj8j0L1j3K8k9Qj3L3l2K9l0MJ3LprMk3J3K3kTKOk3J7k5L6
-1.65203A4j5Jl1L7kpMrOJ2Kk1Qj7J7qRK0k0j2ONojJ0Tk3K5k0j2J1j3MJ1MJ0rlKoPj3
-1.67340a3J6k2K8k9L0k0MQj8J1lnQj6K0j8K2j4K1k1pK3k1J6KK3l3%K4l5J9j3J1kmj7
-1.69171b5L7Pk8j2K9k5K6k0K1j1JlJ3j0Rk3K0moj4j5M5j1j8J%J1j0LK8k2K4j8%J5j8
-1.71003crK0j3MpK%Qk6K4kPj3J7Kj3J5k2kJ1k1J1J3k4J5j9K8j2K6l1J4nL0l5J2j7J3
-1.72885bJ5j8qRrJ2j0%NMjLj1Qk3K3j6J0j2L5j2J5Ll2K2k4J6k3J1LK5n1J9J4PqknK
-1.74869f%J2j6J9j1J2k3RMJ4j7Jj2QoNRqK4j4Qkj0Lj0rJ8oj6J7j2kRJ7Pk5PJ3j0
$$ y = [-12, 0, 7, -5, -1, 10, -1, -9, -2, 0, -18, -28, 3, -10, 18, -11, -3, -16, 17, -15, 14, -16, -12, 1, 4, -3, -12, -8, -31, -18, 5, 3, 1, 3, 9, -14, 3, -22, 14, -1, 0, -31, 6, 4, -3, 1, -8, -2, 10, 12, -9, -1, -18, -1, -9, 0, 20, 0, -12, -6, -1, -7, -8, 2, 12, -11, 14, -6, -18, -7, -20, -16, -5, -1, 9, 0, -3, -1, -7, 0, -13, 3, -19, 9, -20, 10, -10, -6, 2, -16, -5, -8, -13, -5, -21, -1, -19, 3, -11, 10, -11, -18, 5, -16, 0, 2, 25, -8, -8, 16, -19, 0, -13, -2, -4, -8, -25, 12, 19, -9, -21, 8, -17, 9, -11, 10, -1, 0, -3, 10, 0, 9, -14, 6, 2, -4, -18, -33, 12, 1, -17, -16, -16, -5, -15, -12, 16, -6, 18, 0, 0, 15, -3, -12, 8, -5, -1, -8, -6, -6, 2, -24, 0, -2, 5, -8, 9, 11, -2, 13, -9, -11, 0, -21, -10, 3, -21, -6, -25, 3, -9, 17, -14, 0, -5, 25, -10, 2, -15, -2, 13, -5, -13, -4, -13, -1, -11, -11, -6, -2, -3, 0, -11, -3, -26, -3, -19, -9, -21, 14, 2, 17, 20, -12, 10, -14, 2, -21, -10, -7, 18, -33, -14, 0, 7, -1, -3, -8, -6, -6, 6, -10, 9, -2, 10, -13, -4, 0, 14, -3, -2, -14, -6, -12, -7, 2, -6, 18, 4, 12, 10, 0, 3, -7, -16, 2, -4, -20, -3, -15, -17, -8, 9, 16, -9, -2, 11, 1]
##END= 
