##TITLE=      NH 171; Ethyl 3-Chloropyrazine-2-carboxylate  / CDCl3   APT
##JCAMP-DX=   5.00   $$ Varian Associates, Inc., VNMR Software
$$ VNMR Version 5.1 Revision A, March 1, 1995
$$ Tue May  7 08:47:48 MET DST 2002
$$ svsj version 5.1, 97/1/14; hz2ppm (NH)
##DATA TYPE=  NMR SPECTRUM
##DATA CLASS= XYDATA
##ORIGIN=     varian
##OWNER=      N. Haider, University of Vienna
##SPECTROMETER/DATA SYSTEM=   Varian UNITYplus-300
##.OBSERVE FREQUENCY=  75.4291310
##.OBSERVE NUCLEUS=   ^13C
##.SOLVENT REFERENCE= 77.009       $$ solvent=cdcl3
##.FIELD=             7.04         $$ Tesla
##.ACQUISITION TIME=  1.8150912    $$ seconds
##.AVERAGES=          128          $$ number of transients
##RESOLUTION=         0.504        $$ digital resolution in Hz
##.PHASE 0=           -123.5       $$ zero order phase correction (left edge)
##.PHASE 1=           0.010821     $$ first order phase correction, deg/Hz
##$REFERENCE_POINT=   824.215      $$ Referencing label
$$ Varian specific parameters
$$ --------------------------
##$acqstatus=    (0..1)  16 16
##$alfa=         19.9999923706     $$ usec
##$alock=        <n>
##$array=        <>
##$arraydim=     1
##$arrayelemts=  0
##$at=           1.8150912
##$bs=           16
##$celem=        0
##$cp=           <y>
##$ct=           128
##$d1=           2                 $$ sec
##$d2=           0.006             $$ sec
##$d3=           0.0010000000475   $$ sec
##$date=         <May  6 02>
##$dfrq=         299.9479281       $$ Hz
##$dm=           <yny>
##$dmf=          12000
##$dmm=          <w>
##$dn=           <H1>
##$dod=          0.00999999977648  $$ sec
##$dof=          0                 $$ Hz
##$dp=           <y>
##$dpwr=         41
##$exppath=      </export/home/varian/haider/vnmrsys/exp2/acqfil>
##$fb=           9200
##$file=         <exp>
##$filter=       0
##$fn1=          1024
##$homo=         <n>
##$hs=           <nn>
##$hst=          0.00800000037998  $$ sec
##$il=           <n>
##$in=           <n>
##$lb1=          0.318309992552
##$lb=           1
##$load=         <n>
##$loc=          0
##$math=         <f>
##$method=       </vnmr/shimmethods/z1z2>
##$np=           59904
##$nt=           16384
##$p1=           28                $$ usec
##$pad=          2                 $$ sec
##$parversion=   4.3
##$pmode=        <partial>
##$pp=           17.5              $$ usec
##$priority=     5
##$proc1=        <ft>
##$proc=         <ft>
##$pslabel=      <apt>
##$pw90=         12.9999923706     $$ usec
##$pw=           7                 $$ usec
##$rfband=       <lh>
##$rof1=         10                $$ usec
##$rof2=         9.9999961853      $$ usec
##$seqfil=       <apt>
##$sfrq=         75.429131
##$sn=           20
##$solvent=      <cdcl3>
##$ss=           0
##$sw=           16501.650165
##$temp=         28
##$tin=          <n>
##$tn=           <C13>
##$tof=          0                 $$ Hz
##$tpwr=         53
##$vtc=          25
##$vtwait=       300               $$ sec
##$wbs=          <wft>
##$werr=         <>
##$wexp=         <procplot>
##$wnt=          <>
##$wshim=        <n>
##$wtfile1=      <>
##$wtfile=       <>
##$x1=           -86
##$x2y2=         323
##$x3=           119
##$xy=           335
##$xz2=          0
##$xz=           65
##$y1=           29
##$y3=           -138
##$yz2=          0
##$yz=           -35
##$z1=           -108
##$z1c=          -56
##$z2=           -976
##$z2c=          220
##$z2x2y2=       0
##$z2x3=         0
##$z2xy=         0
##$z2y3=         0
##$z3=           62
##$z3c=          0
##$z3x2y2=       0
##$z3x3=         0
##$z3x=          0
##$z3xy=         0
##$z3y3=         0
##$z3y=          0
##$z4=           -38
##$z4c=          0
##$z4x2y2=       0
##$z4x=          0
##$z4xy=         0
##$z4y=          0
##$z5=           0
##$z5x=          0
##$z5y=          0
##$z6=           0
##$z7=           0
##$z8=           0
##$zx2y2=        0
##$zx3=          0
##$zxy=          0
##$zy3=          0
##$rp=           55.0
##$lp=           -178.6
##$rfl=          6632.3
##$rfp=          5808.0
##$axis=         <p>
##$sp=           -75.9
##$wp=           15236.6
##$cr=           5808.0
##$delta=        552.0
$$ End of Varian specific parameters
$$ ---------------------------------
$$ Y-values stored with standard (16-bit) integer precision
##DELTAX= -0.0066763383
##XUNITS=        PPM
##YUNITS=        ARBITRARY UNITS      $$ (mm on paper)
##XFACTOR= 1.0000000000
##YFACTOR=       0.001553426
##FIRSTX= 207.8365661484
##LASTX= -10.9270117403
##MAXY=          50.901126
##MINY=          -36.281829
##NPOINTS=       32768
##FIRSTY=        0.119614
##XYDATA=        (X++(Y..Y))
$$ [...]
134.77072b27j00k7M3N9k5Pl6K1J72J98K13Q7o5p4M8n3q3lj34j91k18o5J76O0J75M6J09J58m6p2
134.57043A53m9P4j88l6o4J8Q8l8M0j7R3J01j19j63J14J32k33k28R7N4n0q3M7qJ35K10J32rj11r0
134.37014Bj07O0j01K6L1p4n7m2O4jQ2K1R6p9M2l5p6m0j32j08N1P5jJ18R6n3l5R7P6r8j28k62QO2
134.14314d22o7O8J34K42Mr9k1J76O1m5J9Q6j8J90m8k57j21N8K02N4k7M2j35l5k76r5J77J32K0
133.94953ak24o5m7J60P9Q6Q9p7j2k3j62p9O3P4M0j4J69R9k3R4J03r1j07L3R7Q8j49k00j41j22P2
133.74256a91Q0m0j44j3Q6J42J09j60k89K19J81k0M5J50r7j37J8M6l7J94J71N7q0k13k81j13J15L
133.55563a99J88j22n4P5P2J66J68j1k25r8K2j09q8M0O5PP4l6n3L4K6n2j73l9J26J37N2j0j24o9
133.35534b10O0N0rk1k0K26J14O7lk9L4l9m5JP9o7l0n1J6L5r7l8K46J44jj61Tn1o0J08QJ72R8k24
$$ y = [-227, -327, -354, -311, -252, -277, -270, -306, -285, -113, 85, 298, 385, 320, 246, 294, 241, 158, 155, 21, -170, -388, -453, -277, -217, -42, 4, 113, 271, 225, 153, 104, 178, -10, -46, -110, -92, -4, -42, -2, -19, 74, 175, 56, -107, 7, 139, -94, -322, -225, -171, -221, -304, -257, -265, -130, 80, 212, 203, 92, 2, -105, -45, -146, -120, -89, -163, -220, -262, -198, -199, -117, -96, 0, -79, -37, -72, -148, -188, -320, -428, -377, -302, -303, -185, -89, -142, -177, -80, -4, -102, -230, -492, -484, -422, -489, -421, -287, -45, -41, -140, -161, 15, 76, 31, 50, 136, 118, 308, 260, 3, -118, -60, 142, 196, 169, 211, 76, 41, -235, -330, -153, -21, -1, -225, -290, -337, -177, -98, -12, 77, 0, -12, -35, -197, -276, -213, -139, -99, -113, 56, 155, 132, 226, 329, 238, 131, 164, 261, 349, 200, 0, -141, -263, -191, -111, -151, -295, -308, -222, -80, 29, -131, -420, -201, -20, -40, 5, 155, 58, -79, -61, -15, -52, 142, 313, 370, 290, 77, -204, -317, -202, -199, -11, -133, -187, -112, -40, 126, 294, 283, 58, -40, -18, -127, -215, -175, -110, -103, -29, -65, -118, -84, -58, -110, -283, -322, -196, -59, -7, -17, -141, -210, -150, -100, -109, -130, -150, 76, 190, 257, 254, 225, 259, 220, 175, 176, 255, 188, 158, 107, 123, 158, 61, 23, 269, 413, 412, 251, 90, 39, -21, 87, 95, 267, 365, 141]
133.12834A41k00K5j25P5O7K0Q0J13j19k40L3J10n2o0L5R1To6k65k4J9q3O0R8L9J9N2M7k4JK6J87
132.91470A71k3j28M8m7O8P1M9l7k39r6O5R4RJ24Q9L4j67r1n1p6m4J47k08j25J28J34p4m8L0M4
132.71441a49j45R1K91K32p6k65j44M4J21N5j96j61K1j4J12k8P6j3QR7K3J15j0r3K33M9r6N6K0
132.52079B54j61j31j26OJ08l8r5MJ61L11R8k17n9q3j43N4o4r2M4J22n2J28j16j38j45K3J23J19
132.33386a05J69L4q7J44nR8J4j69j90L4J66O0K0j08j21K6K00M6Qj90n5O9p1J36N0Rp1j67j13N5
132.13357a14M6q3J9J8k2J77N7j35r2k46j14m9J40J61J06J31J92o6k94J34J79j26m2Q1O8O4p3o0
131.94663E7P3o8j56j20R4R7j37P2l6o2J3j60j18M0O6TJ67R5QK3jMj65j41j3O4P1J53n6j6J67J5
131.73299I6n3R9J00M9j09JK6j04p4m6PM4Q3r8l7P8Ool7q6pJ9P2K7k35p6m9P9Q2n5L9Pj11J32O6
$$ y = [141, -59, -34, -159, -84, -17, 3, 83, 196, 77, -163, -130, -20, -72, -132, -97, -6, 85, 19, -246, -270, -251, -334, -274, -176, -137, -118, -66, -19, -43, -42, -16, 171, 148, 20, 68, 21, 89, 160, 209, 172, -67, -163, -98, -4, 5, 129, 218, 252, 85, -6, -57, -133, -177, -30, -238, -363, -235, -101, -175, -223, -193, -149, -294, -203, 88, 320, 244, -21, -165, -121, 0, 55, -141, -302, -281, -295, -183, -211, -135, -148, -140, -43, -20, 95, 85, -8, 225, 274, 178, 234, 254, 93, -38, -164, -158, -50, -88, -183, -179, -18, 293, 391, 174, 115, 32, -111, -57, -121, -213, -169, -47, -99, 29, -87, -225, -370, -347, -224, -105, 64, 98, 11, 155, 150, 248, 262, 93, -97, -63, 103, 163, 183, 75, -46, -20, 180, 226, 234, 44, -11, 58, -13, 123, 173, 182, 111, -56, -169, -114, -68, -151, -132, -114, -136, 41, 98, -37, -129, -375, -489, -538, -398, -237, -131, 0, 192, 126, -168, -34, 145, 19, -23, 58, 126, 190, 117, 57, 130, 62, -94, -214, -120, -23, -160, -88, -124, -186, -173, -333, -451, -411, -345, -279, -112, -17, -9, 14, 13, 17, -148, -289, -302, -238, -167, -14, -70, -86, 81, 96, 43, 142, 242, 291, 182, 183, 209, 105, 31, -15, -8, 36, 119, 21, -16, 62, 68, 62, 25, -61, -68, -49, 23, 50, -185, -261, -310, -231, -149, -204, -165, -158, -269, -137, -71]
131.49931g1J50l3j29q7j2Q8P3k6O6K4k3j2m%j70q0O0Jp3o0n2J07J28R5L48J81p6k89j02q0j8O6
131.28567a0m1j83n0J4j56j6Q3M4r0QP2K8K2L5J88kJ3O1m4o0N2p3kP1J18j10j24J00N1Q0l6j18n3
131.06535a28R3J67Pj4j60q3o7J6j56j20j19J32J45P3J03J01P8O6R5j71j26O9P2rp0j42j0M5P8q4
130.86506a19n5J2j21J00L26O8j06Q5%J03K3k22r3O6R5Q8K3j41j71L8p0r3O4Q6K23j12NRq4r7O5
130.65810eK21o9n5l0J6Rjn7k4Op5J3N1R1J22M1j41m4J20K2j48j6Ko3J11J21o3K3K5l2k4m1n0n7
130.43110ar4N6J77N8K2q7lJ15J19q5k47j25K05J18k01o2J09M3jLJ9K4J27K5q9j13o6jn5L3L8r5
130.21746c4n3m7j17k4m0Q3L08J12l6J4L5r3J64O9j95l23J25k6N4J47M8j90q7Ol7K58J18n9m9KQ3
130.01049B16j35K5R2l2Pj3r3j01p9N5r2k3J26J03K8j33j00P0m3j34J59M6Jj11j56K4K20j06o7M0
$$ y = [-71, 79, 46, -83, -170, -182, -94, -21, -47, 19, 43, 20, 8, 4, 4, -166, -246, -186, -185, -258, -318, -370, -263, -135, -40, 308, 489, 413, 124, 22, -58, -76, -10, -51, -234, -284, -270, -426, -442, -359, -315, -405, -397, -325, -297, -275, -240, -52, -54, -41, 20, -24, -84, -32, -105, -107, -36, 82, -28, -152, -52, -1, 79, 43, -75, -128, -35, 132, 139, 125, -35, -118, -185, -169, -325, -445, -564, -432, -287, -214, -111, -10, 68, 134, 229, 58, -68, 1, 73, 64, -6, -148, -158, -113, -35, -119, -174, -162, -283, -183, 143, 211, 105, 190, 190, 293, 316, 94, 1, 67, 162, 250, 273, 132, -39, -1, -71, -164, -100, -14, 209, 97, 102, 111, 27, -70, -5, 216, 147, 92, 62, 78, 87, 86, 29, 5, 11, -64, -51, 0, 91, 213, 254, 113, 69, 189, 211, 63, 47, 49, -14, 97, 218, 155, 178, 203, 171, 147, 106, 56, -1, -95, -39, 138, 196, 218, 131, 128, 243, 362, 277, 30, -95, 110, 228, 27, -35, 74, 117, 116, 119, 138, 162, 289, 314, 225, 112, 46, 45, -10, 23, 61, -34, -87, -134, -251, -275, -315, -232, 76, 188, 152, 166, 201, 108, 272, 341, 146, -177, -52, -78, -24, 123, 171, -19, -106, -100, -137, 121, 239, 180, 131, 133, 216, 81, 106, 198, 166, 173, 160, 67, -34, -113, -58, -150, -173, -47, 56, 84, -49, -149, -79, -122, -256, -97, -51, -50, -161, -317, -293, -73, -179, -246, -206]
129.81020b06P8J40k3Jp2l2k0r0QJ4J56J11j52M1J4k33K4J58K42N7p7o7k7j41O5K44o7q1r7k60M5
129.60323b47R3l2J04o2k2L4j23r7J7J30Q1M7O1m5j27J20n2%M4q7k8J56OL8M0l1rOk5j41l8N8m0
129.38291a71O6P2K0p4k34j57J0P2K3J78m3k7MQ6J55o2J8J53K8L9j8j56j47JJ42P3j42m3M9J35O8
129.17595A18j07k4L1r5j4m5N8M7L4k3%QP2r7jJ30Rm9p7j56J12J16jJ37n0r5pj54m1K4l8Q3K02
128.95563A07J51N8P6K0j20p4j41L5k2p5l2n5M3J72k05j47J12P7R3%O5l8O2Q9n1j07M1p9JM9K2
128.74866A27j07j36j2R1P2n4j2L4P7M1q0k0o9J57L8k6o9j82j51L6M2J09K6l4o0j13O7N0j06J22
128.54837a42m9o7O6pJ1q4J31L07O3k80k02J27P5o1L7R5J0L8J04O3J37p3p0L5l0j05n3Mo3J48N7
128.34141B22j4J0M4l13k4J37R3jj11J5n3k2j43j37K0N4N6J6L1J45J15J6K4j85k24n8K0K22N7l
$$ y = [-206, -128, 12, -11, -10, -82, -114, -134, -224, -216, -202, -46, 65, -87, -46, -32, -265, -241, -83, 159, 216, 139, 72, 45, -96, -31, 213, 146, 65, -32, -292, -247, -154, -186, -82, -144, -166, -132, -255, -352, -335, -205, -124, -77, -16, -61, -188, -68, -120, -120, -76, -163, -191, -35, -29, 9, 49, 18, 9, 15, -10, -151, -189, -131, -171, -105, -33, -13, -87, -321, -478, -468, -396, -373, -195, -238, -265, -261, -175, -20, -82, -64, 89, 117, 156, 138, -18, -165, -164, -22, 51, -91, -134, -85, 50, 118, 11, -13, 18, -77, -91, -136, -78, -31, 3, -20, -20, -12, 60, -37, -38, 92, 101, 52, -25, -181, -69, 47, 46, 183, 133, 38, 31, -123, -164, -140, -178, -95, 107, 258, 316, 392, 412, 292, 218, 77, 112, 90, 15, -17, -72, -29, 143, -62, -209, -97, -20, 73, 73, 138, 100, 162, 251, 200, 93, 134, 55, 56, 105, 127, 20, -116, -128, -37, 35, -19, -31, 3, 80, 121, 41, 21, -48, 109, 147, 121, 52, -130, -281, -245, -203, -94, -68, -102, -162, -275, -208, -158, -264, -142, -191, -258, -192, -199, -188, -272, -141, 166, 229, -51, -253, -126, -51, -112, -75, 20, 30, 68, 172, 235, 372, 299, 229, 264, 234, 129, 76, 80, 17, 165, 222, 208, 218, 262, -51, -75, 62, 155, 154, 43, 58, 5, -17, -160, -297, -277, -223, -167, -151, -120, 25, 140, 156, 180, -5, -229, -287, -267, -45, 12, 9]
128.14112IJ24j7p2N6K1r0j5j07l1k1j24K07J43R0j09q7J17N9M5K5p2O0m2k05j84J05P5l3j34J33
127.94083g4J70j6r0k6J34p8k85oQ0j4n6LP0J64J53K6L0r9j36J00J5L3jJ77J81j38j05M8q3j8j40
127.73386A9n4J1j8K0K6P4P1j65Q4K6N1l9O1p0o9k1K4M4q1j41J23K07m1j73o7j9mJ16p2R3O2l6
127.52022D2j67No5O0j09j00K99J39L5k56j01J1J51J9j5k3j42J15P1M7O4k01k18J09P1l7j5J06R6
127.32660iP6K7jQq9L06J05k17j97j83P5l3Q4J01K0k6k23j80M0J44J55R7o9q2Qm3J39K6nM7R7p1
127.11296A27j13MJ14M1j23j80K7K28J64J07q9k61j29j00L7k48n5R5k5J80J19N3j36k3O1j21p7R8
126.92602b25J54n9O9J52n5j92L4k0l7P6J58Q6L6p2J2M3j20j36o8k8J77Q0J1j5l7R7l1r2k9mR4O4
126.71238A23j97p3J12L3j36j09J14j05KJ01M3qm1m8J9Q3O8Qr4p9P2q4J07J85O6k52J9Lq3q1J5N4
$$ y = [9, 133, 116, 44, 100, 121, 31, 16, -91, -122, -143, -267, -60, 83, 173, 64, -23, 94, 153, 198, 223, 151, 211, 169, -36, -220, -115, -40, -73, -207, -74, 96, 80, -10, -36, 98, 20, -265, -271, -191, -205, -261, -258, -188, -24, 129, 155, 185, 86, -50, 50, 65, 98, 97, 274, 455, 317, 212, 260, 177, 159, 19, -35, -24, -42, -22, 4, 78, 149, -16, 68, 94, 145, 106, 167, 97, 28, 7, 31, 75, -6, -147, -24, 183, 142, -31, -98, -117, -121, -5, -77, 16, 78, 42, -125, -120, -185, -125, -234, -334, -35, 104, 139, -117, -218, -207, -56, -37, -52, -75, -217, -102, -31, 16, 80, -121, -339, -230, -159, -196, -211, -105, -9, 67, 94, 93, 101, 12, 318, 423, 206, 9, -174, -99, -132, -48, 53, 73, 47, -176, -356, -316, -172, -17, 80, 11, -71, -63, -106, 33, 59, 54, 101, 198, 127, 14, 18, 132, 173, 50, -130, -103, 125, 289, 396, 307, 46, -83, -183, -146, -394, -449, -354, -379, -199, -80, -27, -163, -186, -125, -246, -323, -225, -71, -130, -61, 91, 36, -156, -122, -142, -179, -103, 55, 141, 177, 105, 117, 160, 40, -96, -164, -192, -15, 65, 76, 61, 24, 121, 90, -2, -31, -35, 59, 123, -74, -147, -35, -2, -138, -247, -133, -238, -236, -135, -92, -100, -141, -189, -170, -87, -19, -11, -105, -184, -112, -196, -89, 96, 162, -90, -71, -68, -151, -232, -217, -163]
126.49874a63j75NK30J12P9r9k35n8j05K09J08J26J9N7l9j69N9J45j65J21L7J23J25K4p1j68K3l2
126.31180A23J06Q6nj38k22q0j53R1R2k2jO6n4J5n2j56j97R6J98K91N8L6r9n6r4k38K1L6J37o7o5
126.10483b47K03J56o2k3Q5K3L6j75p3J39J17l7K8Rj5r5j85k3J89Q4j93j4N7J6K05n5k1m4j55j35
125.90454b05m0O1K10J26J7o2k36j28K3J99J14j17J1J52L8j11J6K4m4L1J41k2j30l9j1j98%j50n0
125.71093c80R4J17N4L1L2P2o4j72j19J84P2p8J68N2m8j43J13J47o0r7L7LOKQ7k24j32r3M7J91K5
125.50396g6J40J29k0k27PJ00P6j4o9J30N9P9j88O4L1k34j02N5nK3K57J33j90j25l0O5j43m2m0m2
125.30367a99K5O4p6q8J1k1N7J30O1N8Rj19kk11J10j1j91p5M2TR8J26q9j51J08Q6P7R0o4J7J50l8
125.09003B6j47j02R6N4P3J74J10p8j66l8j8m8l0K0N4J16q2K2Q5P8P7n1p4m7N2Tr2k20j29qK27
$$ y = [-163, -338, -333, -103, 9, 88, -11, -246, -304, -409, -200, -92, 34, 53, 110, 71, -98, -39, 106, -59, 62, 99, 222, 347, 371, 300, 132, 155, 123, 229, 315, 310, 172, -50, -130, -283, -192, -100, -122, -123, -57, -111, -96, -148, -304, -501, -405, -207, 84, 142, 178, 79, 23, -71, -309, -288, -252, -115, -182, -247, -44, 112, 50, 27, 112, 135, 171, -4, -77, 62, 179, 142, 170, 179, 164, 69, -116, -139, 50, 134, -59, -73, -16, 0, 205, 150, 129, 85, -70, -205, -245, -184, 26, 152, 169, 107, -129, -257, -234, -35, 79, -38, -27, 125, 163, 52, 68, 92, 48, 79, 220, 198, 68, 29, 18, -180, -180, -330, -380, -286, -169, -115, -84, -52, 20, -44, -216, -335, -151, -79, -157, 11, 63, 15, -128, -15, 132, 72, -25, 12, 15, 21, 23, 110, -114, -246, -339, -292, -101, -76, 64, 193, 173, -54, -47, 53, 129, 115, 46, 176, 235, 314, 126, 190, 221, -13, -115, -60, -65, -42, 215, 348, 158, 33, 3, 68, -75, -117, -157, -199, -174, -110, -186, -274, -263, -284, -227, -97, -36, 22, 31, -88, -90, -301, -191, -202, -393, -468, -426, -384, -286, -160, -249, -400, -292, -206, -129, -39, -103, -86, 64, 26, -121, -223, -127, -73, 0, 174, 284, 206, 40, 2, -16, -64, -94, -74, -20, 96, 14, 36, 121, 199, 276, 225, 151, 104, 156, 208, 116, -104, -233, -241, -14]
124.88306a4J39l0l8j07R5K02r4j47p5Q6L8j49j43P8O4J20n3j03J22R8n2J31M4j08j61l1L9M0J01
124.68945I2K2r7q8J0N4Q3J4J5J2J11n2k27j66J71J76L2J14q7j6k53j13J76J65O9j06j09PN7J09K
124.48916A77N2L9j03q5Tp2K9O4Tq1p9J29p4q8J20O4J21pl00j10O7O1K5j29p4K6OJ38%L9j2j53
124.27552b31j05R0J03J21K8lM0n7j94j08R6N3P3rJ23K5n6k1Q9j18L4J58K0o8j8j44m3M0Q7MJ6
124.06855B5j43j35m9J45K67J08J38J51r1j56K2j18r6j30J18J85q8k74j20j9p8L9K73J84jl18k26
123.88829c87kK24K13Q7l1L1N7j27j52j77n1J00J79Q3j12j21J8m5j00N3L6Q7K07J30o4K3M0N4j64
123.69467H9j07n1qj37j00J72J10N3k1j67N8k2p0p3R4j23n4J35R1pJ62J56j12j74r7J03J21J01J7
123.50106A39M9r2m7N1k31j33l9J23J8j9N4m1J44J5j30p1l8J54o8M7KM4K1P7O4m5J35P5j88j83
$$ y = [-14, 125, 95, 57, -50, 45, 247, 153, 6, -69, 17, 55, -94, -237, -159, -95, 25, -28, -131, -9, 89, 37, 168, 212, 104, -57, -88, -49, -9, 92, 114, 17, -71, -61, -7, 76, 90, 105, 117, 228, 176, -51, -217, -46, 130, 162, 276, 189, 173, -80, -193, -17, 148, 217, 111, 2, 9, 66, 175, 177, 229, 268, 165, 80, -5, -77, -48, 16, 80, -1, -80, 49, -25, -113, 7, 71, 192, 185, -115, -225, -158, -97, -72, -201, -275, -249, -243, -105, -105, -66, -78, -231, -336, -246, -143, -22, 6, 3, 43, -14, -208, -316, -220, -167, -94, -103, 20, 45, -11, -32, 57, -61, -27, 131, 151, 83, 65, -79, -122, -82, 5, 9, 25, -118, -253, -302, -157, 110, 218, 356, 507, 416, 260, 282, 164, 68, -62, 56, 241, 153, -121, -241, -260, -338, -299, -26, 158, 157, -161, -387, -389, -165, 48, 135, 104, 135, 192, 65, -87, -264, -315, -215, -36, 47, -65, -186, -168, -213, -313, -260, -224, -137, 70, 200, 136, 159, 199, 253, 89, -18, -69, -77, -214, -314, -142, -32, 21, 0, -167, -109, -131, -201, -274, -180, -303, -357, -222, -131, -138, 24, 180, 68, -106, -203, -100, 21, 122, 139, 188, 96, 49, 100, -131, -264, -303, -180, -162, -181, -127, -168, -24, -9, -139, -210, -248, -94, -162, -115, -113, -69, -48, 29, 93, 48, 183, 258, 70, -113]
123.30077a13K72J47r3j45m3m8n3L2j5l2J0R2Qo3K7J58j24Q2J1J82K0j90o8j07l8OQ5K5M7J2j13
123.09380b9o2nj9n4m4J36J14n1J56L9P2O9r2l23j50L6J63J02j0P4r6p4k5N3o1j20l1o4mL8k9P4
122.88016b17K6P2J93J31R9oj11j05o7k0j0j40N8Q9j01q3Q4K7m1J70N6P1m9j09J1r6j30R3LJ51l3
122.67319A6j34k0J7Q4j1P9J38K1j86nn6m0J00J29j31j78r1J34K48J31l8k56j52j24r0K30K76m1
122.48626E0j25J03J10PR0j05j63m5k0L5J5J8l0m2R6P0j14o6N7J21K5j58j52n3K4K08n6J18J24p8
122.28597F4j55K7K4J63m3j72O2m6M0o7J02J18K4N8k6j57j6k6O0j35l3M5N9j54q6J11Q7k2l3l9q6
122.07900b52o7N1O1L4q2j0J29p6J00LJ2o1j69m0k3J02L8L0N8J79K8J7j04R6J05k7j4L6l3j8k9Q0
121.86536A54N3k87k05l0R7N1M5p8%K6O8K2k0J06J76j4l8l3p7Tl4K01J06M1j75k49m5k2j16MR9
$$ y = [-113, 159, 306, 213, 68, 25, -23, -76, -44, -59, -91, -81, 11, 19, -44, -17, 141, 17, 99, 110, 292, 312, 122, 54, -53, -91, -85, 0, 25, 72, 84, -29, -91, -96, -115, -169, -213, -77, 37, -14, 142, 181, 253, 322, 230, -93, -243, -207, -44, 58, 48, 122, 26, -48, -73, -20, -81, -201, -232, -296, -300, -262, -291, -217, -191, -119, 74, 205, 304, 298, 187, 82, 15, -5, -15, -155, -97, -8, -109, -192, -108, -81, -122, 48, 104, 175, 126, 17, 28, -68, -198, -105, -102, 49, 16, -118, -138, -121, -37, -48, 31, 169, 190, 4, -1, -57, -97, 3, 132, 1, -177, -268, -134, 114, 245, 207, -49, -201, -325, -415, -185, 91, 50, -75, 28, 138, 145, 235, 130, -33, -78, -98, -63, -48, -30, -60, -102, -6, 64, -50, -116, -59, 62, 87, -71, -223, -276, -252, -44, -100, 18, 142, 64, -91, -64, -40, 123, 80, -92, -30, -76, -36, -103, -1, 117, 141, 199, 173, 16, 0, -26, 34, -101, -134, -89, -30, -184, -270, -159, -72, -94, -127, -166, -252, -319, -268, -207, -173, -255, -265, -136, -212, -112, -109, -97, -158, -327, -367, -390, -288, -250, -220, -162, 17, 45, 62, -42, 54, 159, 132, 118, 154, 121, 103, 74, 154, 207, -80, -285, -315, -218, -167, -122, -200, -200, -174, -106, -84, -104, 2, 178, 164, 126, 93, 16, -61, -95, 106, 212, 253, 78, -171, -216, -238, -354, -350, -251]
121.65839b51J04J23J25Tj15o1j2o4O7K5q8J30J06q5j29j6M9q6m6J8l0P0M0j92l9o2j18J52K5o8
121.45810c03J27Kk1p4P8J3j24j14K5K3J73P9J09N6P7J43K4p4P9n4l6r8M7M0oj53j14j99j61R4M2
121.25113c00Q8K62J69j14J4J12r4r6k9M2q5k03P9J32R1J37rj67j6J32P4j5J02R6o2r5j85j45J15
121.05752C0M0P5N2p8o5j32p8Lj10k9L2l2L3Q2m6o0J2K07J27o5n3N8m8L3J27k6j7K0j55q9J21k0
120.84388e1r8o8P9P2o2LJ26Q0J00q6j42kK32K4o0jr7m0k8O7k3L3R2J19q5j03QQ3j2k8n6j27l6o7
120.61688a54%M6R2j3l5m7O7J49q0R0m8j11j09q3J2K23J22j24m7o1k16J2J11Q3L8J99j5l9l6J16R
120.40992A51k09l5Qlj3q3k5MM7JJ97K52l0j41r0Ml3J71O8r8q9l7Rk5j12N0Q1O6K1m7Tk6P6J2m6
120.17624B9K0k7K10L0R8k5j22N4q1n6j94o6J05K20j41k26j21K61Q2kq2r2l3R5l6j68P2K24k4j59
$$ y = [-251, -147, -24, 101, 226, 111, 50, 38, -26, 41, 66, -22, 108, 214, 129, 0, -16, 33, -53, -99, -81, -111, -41, -1, -193, -232, -294, -412, -260, -235, -303, -176, -174, -195, -269, -191, -178, -302, -416, -391, -368, -195, -116, -7, 49, 126, 269, 293, 219, 298, 244, 208, 110, 157, 197, 191, 38, -76, -275, -436, -342, -300, -212, 50, 219, 105, 119, 231, 137, 41, 12, 54, -31, -234, -155, -23, 68, 205, 196, 29, 13, 145, 219, 204, 306, 402, 340, 245, 60, -85, 30, 70, 145, 197, 119, 54, -78, -156, -153, -263, -292, -260, -292, -259, -177, -223, -283, -271, -64, 63, -2, -55, 3, -45, -12, 115, 89, 72, 92, -63, -152, -31, -51, -149, -217, -138, -66, -128, -125, 1, 81, 181, 95, -47, -49, 183, 207, 147, 146, 49, 9, -19, 48, 25, 58, 150, 269, 184, 81, 89, 172, 160, 132, 76, -51, -87, -154, -154, -108, -16, -29, -64, -111, -44, 105, 25, 115, 67, -44, -153, -236, -224, -1, 121, -3, -50, -111, -327, -315, -204, -121, -83, 116, 101, 62, 26, 142, 151, -58, -93, -85, -88, -101, -184, -209, -205, -158, -157, 40, 292, 262, 121, 31, 35, 2, 173, 241, 143, 54, 17, 26, 1, -111, -61, 20, 86, 107, 60, 13, -13, 63, 75, 29, 49, 22, 232, 262, 360, 335, 213, 267, 186, 130, -64, -130, -25, 195, 54, -172, -293, -32, 50, 48, -34, -126, -159, -64, -100, -268, -196, 28, 4, -155]
119.97595a55K8J32L78J08k93L5M6k0j34j98n4J2j98n9M02J48k01j04j17j08N6K0l6R3P2L0J81Q0
119.78902A44R6j25k96k7J34J69%m5nl7N9J16O5L5r4j02j11l0l2R6J34J9r5O6j5P9L2m3j53o7k1
119.58205e4l4J17N9q5L2J45q6l3j50J3J28n6M0J0O0nj31j48j65qL7R1L8K0M0N5P2JQ1M3m4Q8j09
119.36173F2o0m6l9Q4l8N6L9n8j03P3J43R8P6n4j21l1lO2q8j03p7o0R1J68j31J0M2j34n9K49J11
119.15476A59j0n8j55J2M0j24O6J43P7M9q9k09o7q6j28k1q6J05K70Q6R5k1o4j7K07J81n2j84k26
118.96115a07N0M9m4N6J57j46j36k4P1Q7J54L8k37l3J59j29k7j5q7NO1J34k4J2P3j9j63O4K44J49
118.76086C72k6j15j44j9m7J09j8oN8N0r6q7k19j16J6J00K60j8j90q1j41J28Q0m3R0J62J28j23
118.57392F4j41J0OM7J34J8l3J10J15J5k0j78j27k4Q6J23l3J6J63pr6r8J6J66J07M2jj91p9mj28
$$ y = [-155, -127, 5, 383, 491, 198, 233, 279, 259, 125, -73, -127, -115, -313, -372, 30, 178, -23, -127, -244, -352, -296, -276, -312, -219, -147, -117, 64, 144, 240, 115, -181, -208, -74, 95, 95, 50, 45, 8, 67, 183, 248, 283, 189, 87, -24, -54, -86, 10, 144, 163, 68, 134, 119, 198, 230, 187, 34, -33, -54, -88, 29, 88, 3, 35, 180, 94, 61, -89, -76, 52, -4, 36, 46, 106, 101, -30, -178, -343, -351, -314, -223, -185, -165, -125, -70, 2, 3, 84, 127, 83, 171, 62, 2, -44, -83, 1, -37, 19, 58, 0, -103, -30, 113, 211, 287, 233, 112, 81, 78, 140, 52, -51, -128, -188, -97, 71, -60, -50, -8, -142, -201, 48, 159, 149, 91, -64, -52, -12, -136, -70, 73, 150, 199, 110, -99, -166, -252, -380, -401, -487, -382, -112, -26, 69, 48, -16, -33, 174, 355, 303, 119, -107, -57, -8, -52, 4, 161, 15, -121, -145, -74, 13, 167, 205, -32, -65, 94, -35, -62, -77, -164, -159, -98, 36, 12, 24, 97, 78, -85, -21, 223, 372, 346, 231, 87, 68, 21, 130, 112, 106, 164, 214, 118, 31, -188, -304, -288, -188, 72, 54, -136, -217, -358, -230, -150, -193, -103, 59, 187, 64, -77, -67, -61, -14, 120, 138, 105, 215, 330, 345, 325, 147, 20, -4, 82, 205, 172, 188, 351, 344, 248, 150, 166, 332, 439, 481, 480, 289, 210, 206, 78]
118.36696G8J06J19O0j32j91k34k6J08JK0K13J45q4p5N6o7j44j31j13qN2J33R1o7P1J5P3J07j06
118.17334G0m0Pk02J30J88j15j03O9n5n7n1m7J53N2M2J08K4O1j34j35J1N3J82j11k39j53R1J26
117.98640g5K09J33Mm7j26j51M4J13TJ1j44k3q3Mo6K4o0K7j16J04J10N5J07l9q7K28J8k39K5j34
117.78611f1Q1J26no4p3r1r0J00M5j00J9P5P2J74O2l4p5J22p6j90J26J55r6O7J6q3k25q2P1L7%
117.57915Cj34j26k5Ok6r2K9O3J23N2L7k6j54J26%k7l7L0K9j67r2Q3O8J2m8q9J37K21J76j13j52
117.37218a13R8m8q1O3K0Q8M2J5J16O8J17J45m5l3n0l49k34m5p5L0K8J64J53j12l6m7l2M8o8P5
117.17189i8J15Rj09j0lJ17q0L1J89pL1N3j75k18L5j5M9N2l10J01K05l4k8J4J5Q6R9M0K8P7J48
116.96493D07j87j05n3MM3j99q0L1J33k6L5J87j27K7N9o7O9n1o1m4o8q3J1R3P9j17N1J2j27l4l5
$$ y = [78, 184, 303, 363, 231, 40, -194, -220, -112, -111, -91, 122, 267, 183, 108, 164, 97, -47, -178, -291, -299, -247, -114, -23, -90, -19, -4, 69, 176, 70, 30, 37, -165, -35, 153, 38, -65, 4, -51, -108, -159, -206, -53, -1, 41, 149, 173, 234, 100, -35, -24, 29, 211, 100, -139, -292, -201, -75, 134, 267, 271, 224, 98, -53, -9, 104, 217, 228, 84, 61, -22, -18, -84, -60, -120, -93, -209, -105, 5, 60, 167, 128, 41, 269, 287, 48, 73, -61, 20, 146, 141, 77, 4, -87, -177, -77, -32, -132, -113, -38, 34, 208, 270, 236, 161, 283, 207, 17, 143, 298, 202, 269, 285, 202, -23, -105, -34, 3, 3, -131, -257, -282, -276, -302, -394, -365, -302, -179, -127, -90, -116, -270, -144, -144, -171, -208, -178, -149, -316, -408, -325, -257, -245, -293, -382, -245, -24, 152, 39, -113, -15, -63, -144, -81, -61, 27, 69, 84, 200, 268, 385, 530, 485, 452, 402, 53, -181, -226, -301, -271, -243, -79, 74, -38, -74, -121, -153, -105, -173, -98, 17, 26, -83, -93, -96, 21, -59, -28, 161, 154, 185, 238, 63, -155, -120, -135, -86, -34, -344, -243, -38, -72, -100, -86, -71, 15, 114, 154, 182, 259, 407, 220, 115, 62, 66, 109, -90, -170, -139, -6, -32, 3, 190, 63, 90, 149, 82, 151, 100, 39, -5, -73, -156, -145, -52, 27, -90, -39, -27, -154, -188, -223]
116.75796b23O4Q3J3Q8k3J5L0j13K8RN7K3O0m7j52K9L3j44m7j77j9J60O0J06k0M2O5K6j58j64J79
116.55099a17M7j6j4K9r4J06j17lJ03J27J12K5M6J33m1j77L9K5n0o7q3m9j00L1O0K0R4j25n9J93
116.35070G8R8p1k21j1K9K2K4K15J33j53j20L7K4j3k7J53L4j39p6j07q8P3j41j10J71J36J87N1m9
116.15709A39m7J17j06m2m6n3n0QJ53J07N6qJ6n5m2Q4M4M5J20j25j54l7O2Mk13M3N5o7m7j92r2
115.95012c23J77J81N9j50j14J78l1J76kl0J36j2j47j66j54J63N5O1J04N9r7j34rkN6K8Tm2Pj1k9
115.74316A5p3l9L3M7P2Q7m2k00n4Mk3J25J90L9o6j32OJ57J62q4j29m6L5n8K3r9l8J48J01r6L0r4
115.52951ANJ39O2M8k4M2lj89N8K9j57n5J52j38K1J4J01n0j60M7Q2n0r0Q4L1%k6q3k0r3J51K95m2
115.30919A82k04l4Q7%j19q8K05J26j56j02mN6j09J1P6L1l8J65J30q7j24N2J19j52j73q3J8J92
$$ y = [-223, -159, -76, -63, 25, 2, 17, 47, -66, -38, -29, 28, 51, 111, 64, -88, -59, -26, -170, -217, -394, -413, -253, -193, -87, -107, -65, 0, 26, -132, -296, -117, -70, -86, -100, -71, -165, -59, -176, -179, -76, 51, 163, 188, 234, 367, 326, 149, 188, 213, 163, 96, 13, -36, -136, -105, -45, -25, 69, -56, -115, 78, 176, 105, -116, -127, -98, -76, -52, 163, 296, 143, 23, 60, 84, 71, 44, 197, 231, 92, 16, -91, -179, -106, -247, -357, -186, -50, 137, 188, 139, 92, 209, 103, 61, 15, -38, -88, -80, 73, 180, 236, 228, 244, 189, 147, 231, 275, 320, 440, 315, 161, 124, 186, 190, -23, 20, 75, 8, -39, -231, -323, -146, 35, 94, -56, -170, 8, -23, 153, 151, 121, 257, 245, 98, -68, -222, -59, -4, 57, 161, 220, 123, -11, -20, -22, 34, 62, 90, 48, 55, 44, 15, -58, -97, -64, -17, 55, 142, 100, -100, -154, -150, -173, -48, 142, 181, 115, -17, -11, 146, 308, 224, 95, 49, 84, 26, 49, -50, -88, 60, 161, 65, 95, 1, 6, 145, 207, 255, 231, 273, 270, 81, 139, 168, 11, -44, 108, -30, -9, 5, 106, 56, -104, -57, 25, -25, -115, -31, 0, 0, -26, -109, -129, -222, -71, 224, 182, -22, -56, 31, 31, -88, -176, 29, 155, -1, -103, -107, -51, -160, -149, -73, -42, -80, 85, 215, 128, 4, 56, 175, 23, -150, -233, -215, -23]
115.12226b3J05q5j28N8M8j4kr7n2J23k00j24Pn9RP9R2M6Mp1L01mk12LL8Q6J1n3J5J15j59R6K07
114.90194A60o9k72L5M8r9J39l1j66n5l0m9J11P8K02L8q0n9o2K6R1J61J04o9j8l4j39N2J21M1p8
114.70165I7k28j86L9NJ34O0PL6Q1j50r1N2J0k8J33J91q0j15L6j4J21Oj72j43rL0J99q8p2J03N1
114.49468A5o8M9Mj04JLJ62Pr0K5n3j5P5k0j88J37J64r8m2j9J24J17J21K1n1j26q8r0n4J99n0j01
114.28104c3o2pJ30l9j00Nk9M4J63l1M3P4mK6j04q0nK2Mj7J28p2r6%J25L0%o5l7R4l1P8M9j7m8l9
114.04069I9J43j7m3j12M4J29j48l0L8j1r2pj17o1J4J15o1l3K2kK4m5l5J13P6l2k75k42J61K85j4
113.83372a14r5qPR5k9J23j0QJ09p4j02J8O6m3J17J04Lr9j42nJ15l3J4J05M2j7n7jM8L7r9p5R4K0
113.60673A22M0O9P2L8J5j94k81j14P8J74J8j15m1R4J43R5Qj06lj60r9j70j96RJ7K10O5J51J00M
$$ y = [-23, 82, -3, -131, -73, -25, -39, -41, -138, -190, -67, -267, -391, -384, -443, -434, -355, -263, -217, -213, -284, 17, 13, -199, -196, -158, -72, -61, -114, -99, 16, -143, -47, 160, 91, -181, -146, -98, -197, -58, -89, -255, -310, -340, -389, -278, -200, 2, 40, -40, -99, -161, -135, -44, 117, 221, 152, 134, 100, -39, 13, 134, 175, 97, -131, -317, -278, -273, -139, -79, -72, -36, 45, -105, -196, -144, -134, -162, -29, 162, 82, -33, 3, -11, 110, 116, -56, -199, -208, -178, 21, -67, -139, -36, 15, -53, -4, 0, -104, -103, -100, 62, 69, -21, 4, -49, -64, 11, -9, -197, -60, 104, 6, -36, -55, 69, 186, 307, 328, 277, 151, 63, -27, -81, 118, 68, -33, -95, -102, 28, -11, -111, -106, -135, -91, 72, 41, 84, 158, 154, 180, 76, -4, -9, 13, 17, 0, 128, 56, -40, -40, 85, 115, 115, 50, 13, 107, 76, 154, 203, 186, 138, 99, 242, 225, 182, 70, 114, 243, 95, 65, 103, 92, 0, -7, -124, -185, -171, -56, -117, -150, -128, -130, -106, -151, -186, -73, 3, -29, -304, -546, -385, -100, -114, -209, -217, -210, -115, -144, -21, -31, -23, 86, 12, -90, -72, -6, -49, 68, 172, 175, 76, -66, -71, 44, 11, 25, 130, 172, 155, 98, 97, 145, 182, 83, 8, 102, 122, 162, 231, 303, 341, 356, 162, -119, -233, -155, 19, 37, -78, -119, -25, 118, 213, 221, 115, 112, -48, -147, -317, -513, -504, -487, -277, -212, -61, 39, 43]
113.40644D3L4k9K6J11r5j69j50Q5M6O2K7l7j5j22j5J53R8m6j52q7j5J11KP2l8l6J05J4L1J66R0
113.19947B70j85j44J73R9j75k01k1K9J18o0O0P0l4j03J04q4J47J84K6r4o6L8m9K7j11n7p5M3N4
113.00586a7j73j52J45J12P6p5KN5m0p2q6j10Q7J84J90n3TRJ36P5j50o4r5Q2L2qp6n1M8k1j4J4O1
112.78554bJ46m8mL8j6p4j52j38k5K83J56j45PO5r3P2K7j9r8J6o0J26L4m8j85m4M1J32j59r1J98
112.57857f0n6j2L0k41L5J57J80J7j33r5m4J51J56m6j04l7K6N9J29J2r1j25m0j66p7J15R8Oj11
112.38496b67j27K18J60K22m6k2j30j08Q2j26j69J51K19J30j23j82q6J43k2k08j79Q4J65O1n8J06
112.21137a12K11j8j41K70J39j56K5P5o7N0o2j40j44jJ38J6j14j97L6n4L2J03j05Q8M8K6RL6N8r4
112.01108d5l2m6j4M0n8P8j05k00J19O6k8Q8Q3J0j90L1R6J7Lj69J22J2j21j3J21K20l0k46p1K36
$$ y = [43, 77, 48, 74, 185, 90, -79, -229, -144, -98, -36, -9, -46, -61, -183, -198, -45, 53, 7, -145, -232, -247, -136, -134, -62, -100, -136, -31, -17, 14, 180, 270, 85, -59, 114, 213, 38, -163, -184, -155, -37, -97, -37, 33, -1, -104, 0, -84, 63, 247, 273, 179, 113, 151, 102, 129, 18, -39, -114, -71, -17, -190, -342, -197, -85, -9, -84, -82, -27, -67, -139, -225, -335, -248, -64, 126, 73, 20, 29, 165, 240, 90, 26, -69, 13, 45, 37, -39, -90, -42, -63, -77, -63, -2, 144, 96, 92, 130, 114, 40, -112, -250, -275, 8, 164, 19, 26, 91, -2, 70, 97, 78, -20, -4, -64, 62, 96, 48, -137, -181, -140, -8, -167, -258, -60, -116, -128, -98, -339, -304, -147, 33, 50, -83, -178, -222, -71, 85, 39, -65, -102, -76, -17, 112, 124, 33, -92, -132, -298, -375, -260, -162, -156, -267, -394, -176, -16, 206, 160, 138, 8, -100, -18, -144, -313, -162, 57, 187, 64, -118, -204, -61, -83, -291, -470, -386, -221, -160, -218, -112, 99, 81, -60, 210, 349, 193, 218, 293, 226, 276, 214, 74, -70, -71, 67, 83, -31, -228, -192, -246, -214, -111, -216, -128, -80, -54, -45, -9, 49, -45, -77, -123, -137, -97, -155, -77, -182, -382, -263, -197, -225, -137, -54, -44, -234, -203, -107, -90, -87, -256, -134, -122, -243, -256, -135, 85, 55, -191, -262, -26]
111.81079b6K93M7j37j30k2J3m8qk1p0L2r0J57J14Np9m1P8L9J31r3j52RJ65Ok20m9Nk05J31J03
111.60383f3J09J7o3j39J55K14lj2pq5j90k6J15j13j1P5l3r9j5m8j1N8J9M1L03J72j89j56j67j35
111.40354b87O8l5p9%j0R2j03L7J33Qp2J48O4p8L7Qp9j0k4K1rQ2J52M5m7R2l9k6j35J10o2l02r8
111.18322c98L16J62q2j8JqJ87j25j40K0j0M0kO4r0j6K04J64l4mN8Q3Q8j9j17k0n4j25j96j02L4
110.97625a39J07J96O1M5O5j5n0j39j98K2K8m3P0J02NMp9n3j05jP5R2j04l35qL05K29m4j88k4J10
110.76928iK62P1j78j51Q9pM0p6j29M6N5k18Q1K37R7Kj15j86J26L18o9l05j19J07J74Pj04M3M6n9
110.56899G6j3j53p7N7kj80J01L26L36r0k51p4n7j25n4q2P9J39rk40M5J8r7Q3Q6n4O8M8k6q9n9k
110.35535b72K89J67k48N6J57L4l5p1m6R9J00o7q3j1%k88Q6J33Qj59M6J06J00N5K3l9m9R6o8j02
$$ y = [-26, 267, 314, 177, 47, 25, 38, -10, -18, -39, -109, -77, -167, -10, 104, 109, 30, -11, 67, 106, 237, 144, -8, 1, 166, 172, -48, -97, -92, -297, -166, -63, 46, 63, 0, -139, 16, 230, 227, 215, 208, 123, -67, -93, 22, -91, -102, -27, -60, -159, -174, -222, -233, -175, -156, -115, 188, 360, 171, 15, -152, -287, -219, -254, -333, -333, -343, -251, -354, -317, -184, -176, -248, -100, -36, -114, -77, -69, -148, -158, -182, -161, -170, -88, 64, 109, 62, 154, 115, 89, -46, 64, 2, -300, -398, -82, 80, -2, -20, -19, -27, 160, 35, -105, -85, -95, -55, -57, 7, -83, -99, 105, 269, 235, 231, 289, 372, 460, 441, 324, 304, 250, 125, -71, -173, -139, -32, 164, 225, 270, 335, 320, 270, 131, -67, -45, -17, -60, 10, 112, 117, 121, 42, -11, -116, -117, -42, 50, -54, -389, -397, -92, 137, 93, -95, -119, -9, 253, 324, 146, -5, 84, 77, 117, 41, -88, -42, 13, -205, -124, 113, 210, 212, 97, -89, 37, 355, 286, -19, -138, -31, 143, 150, 46, 89, 135, 76, 63, -90, -167, -110, -112, -292, -191, 135, 471, 381, 130, 56, -1, -126, -180, -262, -183, -44, -53, -293, -248, -230, -327, -244, -158, -212, -144, -96, -122, -211, -270, -272, 17, 184, -64, -8, 149, 183, 148, 77, 31, 130, 230, 163, 80, 69, 69, -219, -133, 0, 8, -151, -105, 1, 101, 156, 179, 140, 91, 187, 119, 17]
110.15506A7q6J1j2O5o9j19JK9rp0k4J92J71Rj07J39J9M7N3j5o2J1K8j57R6j4Mk31n4N8jQ7P0R6q
109.92139A65l5o3P1j80L3K13P3p5l2J5jj12j13L1qlj55j41M4j6L1J43N8j19Q0Kj9J10J20N9L8m1
109.70775A73r7j72Oo7q5O0o4j2J74Pj26j0K75J85n2j85J20J03k5k00m0J4L5L6J32J6n0n3J5m8P5
109.50078A40L3j47q9L0J36K4k7n7mN8m4J1m4J52j20pJ10J08j6N0k18l7J54K0j61J1P1k5j61q5
109.30049a34J10R7L8KM2j40J00M2p8N8%L6L2lj67n7j17M9pk07j12J41J70J1J58J28j9R6J19k06
109.10020A82k11m4jP7m5k24n4J73K16J04q8j15j56N0J11O4o0qq1j32j2N3J5O7K44O8m9R3N8J6J5
108.89323C26k29k8n8k66r5J01L23M5o7L6j19Q8P7Q6o4LM1l1K0j11O7n5q3RL1N9Qn0j55j27K8J1O
108.67291a73N0npK1j36J3J66O6n1j51J4O7J7K7r7j33MJ75j4J9rj7LJ4J6J01K53J12j32k21n6r2n
$$ y = [17, -69, -58, -70, -5, -74, -193, -192, -163, -172, -242, -266, -74, 97, 106, -1, 138, 157, 204, 257, 242, 180, 191, 219, 62, 158, 144, 148, -83, -137, -79, -80, 7, 77, 173, 165, 130, 67, 138, -42, -9, 204, 277, 202, 170, 185, 184, 72, -41, -10, -18, -21, -176, -317, -273, -289, -258, -115, -57, -176, -96, -94, -113, -3, 117, 176, 214, 173, 76, -96, -90, -157, -242, -182, -246, -258, -84, -77, -203, -213, 62, 247, 195, 10, 130, 233, 208, 8, -32, -18, 17, 53, 185, 201, 151, 98, 113, 65, 140, 173, 26, -63, -33, 103, 127, 100, 43, 39, 97, 53, 64, 20, 172, 52, 45, 155, 263, 247, 297, 79, 42, 196, 216, 55, 66, 137, 112, -49, -134, -24, 73, 111, 113, 155, 15, 115, 157, 79, 137, 137, 173, 205, 202, 35, -22, -139, -90, -97, -304, -416, -275, -105, -94, 64, 192, 173, 269, 388, 182, -29, -73, -74, 3, -42, -266, -320, -147, 69, 173, 85, -30, -186, -136, -25, 39, -21, -29, -110, -242, -254, -201, -186, -119, 125, 193, 144, 237, 295, 311, 326, 97, 69, 11, -255, -350, -249, 74, 119, 52, 88, -31, 57, 134, 220, 156, 159, 200, 169, 189, 78, 145, 90, 7, 16, 47, 106, 114, 64, -91, -218, -190, -179, -173, -123, -128, -135, -114, -250, -237, -71, -5, -56, -207, -193, -126, -109, -82, -179, -312, -308, -133, -147, -128, -137, -154, -151, -137, -121, -20, 233, 345, 213, -8, -64, -156, -161]
108.45259a61J03O2K5L9K2k1l7j38r2N7J02r6j14K5J74N8q5N6K08Q4l5j14j10P8P1M2r8K6n3N1
108.25230A29J03q2p2j3Q5N9p8j41Q4P5K2J28m7r0k28j70N4Q2Ko7q1N1j6J17J03N9m3J3l8N6k6p7
108.03866d7j03Nk0J17nj33J89K21j78j15M6J77Q6j39m5MnJ33J62L5qm2j04j42j93m6J67L4qm4l8
107.83169c9L7lp7m5J42J21j27l5K20L8k45O0k14M2J3o5L5J13j0KJ33R7m4J0n5p6j2J8k8j2l0nR2
107.61138E1jTN9K4m9l5j8r4J2J6m2K2j3PJ05j9J51J9J7P1l9k04j14J22P4J00M8P7l06j18J7Q1
107.39773B0J32J15r8m3N5k9Pn2k27j57O8J77m9N4n5k50%J60J38P3kjJ35mp2m7o0j1J67K0K2m4
107.18409A42k14j17J50L3J9Q8j8k38j40K25L05N4n2o6pO6j47j06R6J26Ro1P4q9j12m7j0n2Ol2r2
106.97712b07n2o8R2N7j1j3rL0P9j24R3N6j6j49mK28N5k6TJ15l6k21q9k0J21J0j8J66j25r7J58k4
$$ y = [-161, -58, 4, 29, 68, 90, 69, 32, -106, -198, -141, -39, -135, -249, -224, -50, 8, -77, -21, 187, 271, 236, 122, 12, 90, 161, 203, 105, 131, 78, 129, 232, 150, 78, 65, 150, 209, 131, -10, 74, 149, 171, 299, 252, 162, -66, -236, -182, -100, -98, -165, -246, -195, -211, -94, 9, 68, 25, 38, 0, 56, 30, -47, -150, -145, -165, -48, -53, -186, 3, 224, 46, -69, -23, 154, 240, 101, 56, 60, 55, 188, 350, 385, 377, 335, 231, 89, -104, -150, 17, 51, 43, -1, -39, -2, -5, -82, -127, 15, 136, 9, -26, 194, 232, -13, 47, -167, -125, -112, -177, -142, -29, -39, -37, 96, 193, 149, 159, 104, 28, 16, 34, 6, -6, -36, -41, 51, 50, 49, 108, 132, 83, 48, 30, -64, -52, -36, -78, -56, -69, -62, 43, 24, 175, 194, 211, 282, 243, 39, -75, 47, 121, 221, 269, 346, 40, -78, -61, 20, 152, 267, 169, 126, 181, 152, 159, 107, -120, -277, -209, -32, -81, -27, -82, -332, -332, -172, -34, 39, 37, 36, 171, 167, 95, 48, -12, -23, 144, 164, 186, 142, -72, -189, -39, -6, 13, 101, 83, -155, -295, -70, 235, 289, 237, 171, 164, 230, 83, -23, 73, 199, 208, 147, 221, 132, 20, -27, -37, -89, -83, -115, -207, -259, -327, -235, -178, -189, -202, -211, -181, -102, -226, -133, -77, -93, -242, -246, -18, 37, 11, -15, 100, 64, -157, -246, -266, -145, -135, -153, 13, -112, -209, -51, -75]
106.76348g5j3J34j19q9q3j4p3J05J02K12Q0j42j41P4K34Q3j12m1n4rk89j05J45J43j0N0j76m0o5
106.56987b88j5J11N3k2r4k50J74J21j7k9J83J25p7N0rj33j42JO4p7r7J64J84k0JO6j36j52k05j7
106.36958d83L18K60J47j32j11Q3R7k6p4J8k6N9J0j12J56J78k7k00m9N4j67j51r0J20J30K2P2QP
106.17596I1j39r6j75r0M0J23J25J9p9L1m5L2J50L5k12q1q3nk3K21o3o7q8J55J06N7pl5r8N2p0r4
105.96232c13j24J4K13R8j11P0L2N5o4r4M9l3OJ2K6R2k7Nj60n3J00J31l1K0m9q1N1L6q3kL1J07M5
105.74200c2J29q9j46l2q9jN5J4L3J49J12o6j89J3J09Q0N1N6K5q0q1j80j31N0p8J4K52K4L8n7J60
105.53503A13J5n8%Q6j20J8L6j18k7P2n4oJ14R6j25q7N7j35q2Tl4j4J02J91J16N5j22r7J85J3m0
105.32807F8j9jj41j03O0m2j3P6J3o5K6J01J38Jq1J6o5j41RP9O8R5N6q0q3K2O2J66m4r2k0l5m6q
$$ y = [-75, -88, 46, -73, -162, -245, -259, -332, -227, -125, 87, 167, 25, -116, -42, 192, 275, 163, 122, 68, 59, -230, -335, -190, -47, -57, -7, -183, -223, -288, -303, -192, -139, -161, -255, -505, -331, -210, -227, -256, -73, 52, -25, 25, 16, -117, -259, -258, -194, -271, -368, -204, -20, -40, -39, 27, -109, -261, -466, -483, -165, 95, 242, 110, -1, 82, 179, 153, 79, 97, 71, 130, 140, 28, 184, 362, 335, 135, 86, 140, -27, -178, -268, -148, -18, 4, 76, 84, 91, -48, -144, -319, -409, -369, -246, -121, -102, -181, -150, -195, -163, -13, 22, -190, -271, -354, -359, -382, -161, -224, -291, -379, -224, -118, -61, -68, -103, -201, -149, -219, -313, -437, -423, -210, -112, -223, -153, -121, -66, -130, -224, -175, -208, -202, -190, -164, -72, -99, -94, -254, -307, -207, -76, -107, -87, -136, -217, -166, -130, -213, -215, -184, -77, -32, 97, 8, -138, -170, -259, -260, -205, -191, -158, -9, 103, 37, -152, -139, -30, 50, 101, 157, 182, 102, 21, -159, -290, -240, -318, -304, -52, -28, 10, -47, 113, 128, 70, 70, 156, 36, 54, 90, -28, -55, 17, -37, -43, 71, 167, 42, -45, 12, -123, -205, -287, -321, -335, -233, -42, 74, 129, 7, -90, 95, 108, 68, 49, 48, -93, -196, -136, -178, -191, -115, -102, -167, -141, -40, 98, 99, 18, 34, -31, -172, -163, -84, -16, 79, 135, 55, -28, -6, 56, 222, 178, 86, 66, 31, -15, -23]
105.10107b3R1n0j12K9k8J14O7J33j06j58N2r1NQ5j2j33J22K2l0J31J25j06j33Q2k2K3j2j26L4K7
104.90078@l9m4M4K13q9j19N0O0L3j02j87m0jM4J32J51Q6q8L8Q0%j32m5n4J8M4k4J05J23r6R4j07
104.68714A48r8j58j04K3PJ61nJ8m4n7MP0J41p6j63j05pN5J74J22l8j22m3o8O6Q9k1O1j43j7J33
104.48017CP1o2O9J24N3k9j4k05P3R4Jn8n9j45K08J09L6j96RJ23j58k01j0J47m7q9J42J14P4p6o3
104.27321C8P5J01N1n6o1Lm1j64N6R1O9J10k4j45j12j64n7Q4Kq4P8J08n3n2J57J27J25j84j61o1
104.07292a44p2N8o3J9J98k1P1J59J81o9j72pj1j41o8J4j08N9%QrQ4m7O2J89j5r8j76n5Q0J8j24
103.85927b00n9j74J3J92P6p0k9P5K6L0r5J09l7o7j14JK00k6j81o3j5J29K5J3J56O6j24k0lk8Q3
103.65231a11o2k14K9Lm5J07N9N8q8j81J44P9j00M8K67L16K6j79j94j32KJ95J03j54k49j70o4J71
$$ y = [-23, 68, 18, -94, -65, -93, 21, 88, 221, 115, -43, 9, -82, -77, 8, -4, -137, -15, 7, -23, 108, 233, 127, -6, 76, 54, 77, 65, -61, -27, 0, -39, -83, -39, 174, 85, -34, 16, 76, 109, 7, -180, -220, -221, -177, -45, 106, 192, 104, 142, 222, 222, 90, 45, -9, 9, 53, 29, 134, 257, 161, 255, 148, 50, -108, -212, -189, -182, -21, -26, -8, -52, -109, -105, -35, 106, 30, -133, -238, -245, -190, -16, 106, 68, -54, -97, -165, -99, -10, -31, 30, -113, -130, 3, 74, 12, 81, 205, 258, 229, 215, 10, 83, 177, 178, 120, 61, -84, 124, 233, 269, 73, 82, 205, 47, -154, -164, -17, -64, -153, -11, 103, 177, 101, 38, 113, 214, 265, 209, 148, 151, 110, -54, 2, 93, 162, 272, 248, 103, -9, -173, -230, -146, -144, -228, -150, -42, -95, -147, 10, 137, 262, 78, -83, -144, -216, -158, -221, -202, -4, -25, 46, 205, 386, 317, 145, 138, 127, -14, -82, -68, -176, -117, -117, -109, -118, -34, -81, -19, 170, 155, 57, -119, -174, -94, -76, -200, -259, -433, -420, -228, -152, -222, -251, -176, -150, -120, -215, -106, -143, -210, -324, -323, -123, -149, -330, -393, -408, -279, -254, -241, -85, -19, -143, -163, -166, -194, -111, -173, -387, -358, -355, -400, -293, -234, -176, -264, -445, -301, -222, -322, -274, -7, 309, 335, 156, -38, -170, -168, 27, 130, -24, -273, -443, -507, -336]
103.46537c36J18kJ39K3O5j22m7N1O7Q4j02r0R1K17j36k09j56n3K59J98q2k6P8k1k0J36R3j73j89
103.27176a45o8N6K26J93j32o2M0n2Q4l0j34J26J21l5j42k8j8k21l7J72N6L8Q2j5q9P3K7mj22N4
103.07147A4M2N0K03P5k47k01M8l0K4j4r0j07n9L0p2k5J49P5qP3J35kq0k7L7K47J68k59j64R5N
102.86450H5j46j09l6J55N5K8r9K5Q9K2j7L6L8l2m9k9N5n7k23R7P3PJ28M2p1r5r4l8O8Q7J06m0
102.65086F1j28r1N7Q3R7j40Q3j13l8r7j68Q6L9J34J22rJ83j6J40Qo9j06j54l7j11m3nK4q8J05J1
102.44389a80r7K5J1N9R2P8R3j7K0J19j2k12k2K7k4J81R9J04j45k44n6L5N1J5j43n3j15k9k3K6k5
102.23692c62l3M0K61N1P9P7j80j92J71K70J35n3j74j01K4L9j7j13M2q8l8J40K2l2J73j4L3K9m9
102.04331A40J82Oj18j25j03J1Ol9mO3J60L8j86p5O4mM1k7L5m7k43j76j01O0L6Q9J99J14o5JK46
$$ y = [-336, -218, -220, -81, -58, 7, -115, -162, -111, -44, 40, -62, -152, -61, 156, 20, -189, -345, -398, -139, 59, -23, -49, 29, 8, -12, 124, 217, 44, -145, -213, -157, 69, 262, 130, 68, 108, 56, 140, 110, -24, 102, 223, 188, 46, 18, 0, -221, -258, -86, -30, 8, 90, 75, -14, 59, 86, 82, -40, 14, 56, 106, 309, 384, 137, -64, -16, -46, -22, -36, -126, -233, -292, -262, -334, -359, -210, -135, -143, -70, 65, 63, -17, -44, -7, 240, 408, 149, -15, 80, 85, -61, -170, -206, -51, 4, 32, -67, -42, 47, 69, 52, 88, 126, 94, 45, 16, 71, 14, -209, -112, -39, -32, 96, 138, 67, -28, -122, -160, -92, -5, 101, 61, -67, -158, -101, -18, 79, -61, 22, -91, -129, -226, -394, -308, -269, -135, -13, -22, 161, 145, 285, 293, 224, 118, -36, -73, -184, -227, -232, -208, -296, -191, -180, -277, -252, -241, -182, -90, -12, 81, 64, 84, 203, 191, -21, -43, -16, -40, 141, 240, 344, 199, -45, -101, -66, -15, 0, -143, -196, -311, -340, -363, -337, -362, -395, -355, -94, -43, 36, 113, -67, -259, -88, 182, 317, 264, 90, -11, 13, 52, 35, -78, -36, -124, -162, -22, 0, -32, 141, 127, 160, 189, 140, 322, 328, 210, 85, -18, -7, -1, -40, -44, 19, 179, 217, 31, -44, 20, 16, 57, 30, 65, 18, -225, -401, -502, -442, -406, -317, -118, -4, -69, -68, 178]
101.83634A78J45j28k12J3k8p6m9p2N5Oj00j6M8J53J03j16J09N9l0j8q6M3l9RQ8J0q7l2J45rJ14
101.62938A80J53l3m03r8J75R1l0l8k2J32j33Mo8j92p2Q3N9J49J33k6L8R4l3j3j99j35q8J24J65
101.43576cJ60m0p3n7R6O2k14j11J15J71R8j13j75J33J36JO3j05j5j0o7J2Q0O6o2k40r7N6O6J88
101.23547A21m4j50j9J2N2J25k7J09k1%lp4r5N0j9n9O1N6Km3RJ90q5p3K2m7N7J37j31j42r7pP6P7
101.00848B0O4J02l3N6j78k6Oj7j03KJ37k1j51L0j06n2R7j26jJ28J52j4j02nJ57O3l0L2j8k20j04
100.80151b61K03J87J11j13j60J57K8p8K8P6j50j9m8Q6J10j5j1M7n5o5n5j64l7P9J77j02k24J44
100.61457a24K94M5j62k06p1p7p6MO7q5m7K02L4J0J89L06R0j01n5m1o7k8J02j9o0Oj6Q5k6J9N5r0
100.40093A57q7q3k4J07J02j04l0nm0O7J46r1j68KJ51O4o1m3j02j1J54J49J27L3j07L7l7k03m6m4
$$ y = [178, 323, 195, -17, -4, -32, -108, -157, -229, -174, -168, -268, -284, -236, -83, 20, -96, 13, 72, 42, 24, -62, -19, -58, -49, 39, 49, -38, -70, 75, 66, 180, 333, 300, -103, -201, -26, 65, 35, -3, -25, 107, -26, -22, -90, -282, -354, -271, -212, -63, 70, 44, 82, 176, 143, 130, -69, -204, -292, -168, -3, 157, 117, 44, -13, 83, 145, -69, -180, -65, 106, 204, 91, -84, 49, 185, 186, 249, 144, 129, 119, 52, 64, 144, 210, 148, -92, -189, -133, -67, 121, 77, -73, -92, -80, -28, 97, 70, 179, 158, 158, 155, 81, -14, 36, 17, -42, 19, 75, 77, 34, 43, 233, 148, 75, 97, 50, 107, 244, 113, -29, -126, -133, -57, 20, 84, 186, 153, 209, 31, 5, 11, -6, -109, -107, 30, 9, -142, -112, -218, -270, -173, -299, -300, -172, -20, -34, -136, -141, 16, 79, 49, 81, 63, -157, -261, -58, 129, 240, 127, -33, 124, 152, 74, 102, 178, 28, 9, -39, 47, 157, 142, 131, 178, 123, 58, 3, -161, -198, -119, 58, -44, -268, -124, 170, 215, 53, -153, -224, -301, -377, -373, -306, -391, -438, -236, -202, -192, -3, 303, 393, 292, 237, 196, 129, 101, 203, 184, 124, 130, 114, 199, 173, 192, 247, 157, 70, -13, -37, 70, 172, 68, 38, 33, -7, 60, 206, 115, -53, -51, 100, 164, 103, 60, -42, -53, 101, 250, 377, 410, 303, 340, 303, 100, 54, 10]
100.20064A0K0L9J6L4lj03K8rl1O9L2J2n2l0P1o0J57K7n7r8K1R4j55L2K2o7p6J40po1k14j95r0M9
99.97364d35LoL1J50K35P4l5j27o4j08PJ05n3Q2J75K1K47J32j39j86m2L4Tp3M6pk11J1J34N2j02
99.76668a5j57r1j28k04J4J38K9j15J3J78j50J8J58m2J01O1L8J22P7j38J8J40L5j18r1J04O2p1
99.57974a4J04J02k6J32L6j71p8n6n7K9J63J21q6n2p2m5q6J67K0k1J17q9j76q3J65J29p2J66R6
99.38613C63k71q5J73q0MRm8M1j26q4J25N7P3J8l3j4j51m8k0q3j5l2K06J40l7q1k6j20m2J44p8
99.17916a21K2J55l5J1r5MPm7n1J07J15K5K1%j26o0k7J0O%R0J56N3J7j01L2J8l9q7N1On4n2k7m8
98.94549f4J98J7j88J03mj6P8o4l1n2q6J88J22l0j97r1j27J03K1n9N6K8J41rj09k8J45Q2J67j11
98.74520A83J35q4j63J7J20O7o8j4L2j41k94j1J93Q3j9k6k3J40J16l9l1J40N0Q3l45k59J7J21
$$ y = [10, 30, 69, 85, 119, 116, 13, 41, 32, 1, 70, 102, 114, 62, 32, 103, 43, 200, 227, 170, 72, 93, 187, 32, 64, 86, 19, -57, 83, 76, 15, -199, -394, -484, -435, -432, -438, -407, -257, -22, 52, 17, -110, -174, -282, -275, -170, -223, -141, 34, 55, 302, 434, 295, 109, 67, 101, 135, 62, 108, 101, -110, -99, 35, 87, -15, -172, -263, -391, -595, -581, -443, -414, -529, -516, -338, -488, -470, -312, -354, -253, -192, -154, -32, 45, -93, -75, 65, 100, -18, -109, -5, 57, -14, 90, 192, 166, 298, 334, 163, 85, 29, -28, 1, 164, 285, 199, 147, 75, 30, -56, 111, 131, 110, 227, 138, -38, -121, 44, 173, 101, 267, 363, 92, 7, 180, 100, 104, 113, 65, 106, -20, -104, 21, 78, 151, 169, 136, 122, -29, -77, -97, -180, -195, -227, -21, 119, 82, 1, -25, -145, -187, -43, -121, -99, 56, 21, 32, -63, -59, -52, -99, -150, -43, 72, 97, 118, 118, -8, -68, -95, -85, -79, -79, 11, 167, 220, 237, 136, 168, 186, 147, 60, 111, 117, 63, 11, -16, -64, 134, 151, -37, 66, 62, 46, 124, 60, 29, -23, -109, 79, 201, 171, -26, -117, -244, -141, -120, -179, -123, -95, 46, 37, -72, -100, 45, 127, 294, 183, 318, 234, 71, 88, 208, 275, 207, 193, 225, 84, -210, -221, -28, 55, 36, 10, -13, 127, 243, 204, 173, 313, 363, 446, 101, -158, -141, -20]
98.55826b0j46o5n2J48L18P3p7q5J4N1k3j16R6J68O0m77m05O8Q1P4K43J30M2l9j03o1j27J02M8
98.36465h0q6J09P9j79k7J49J2PR3K0j24l8P4K6j18j34j02Q6o8Q9J05k2M0Q9l3j15n0n5m2K21
98.16436g4J16L9R8Lj99r6jj35j6J44J26P7k4j39p5j66r2Q2K35P4O6lp8n1Q4M6o1q8J49km1m4O3
97.94404A7Q8o7r6j10J21l2N0M9o2j24o8Mj52J58J67M5o4K02J0j23j6j02j59L6J09J01m5r1O9
97.75042h5K88J48j84Jl4j10j0J39m9k2K6M6m2pJ23l8j59j02k37k9o6j6j8J50k8M8R7MN1q6J5K8
97.53678a58J25m1n9P6Q2q4k15JR7J14N9Q0P6L6qJ19qj26K3p6j45qJ32lJ09L2j30j83M2J63Nj06
97.32314B1p1Po2o5j32k81L61PJ12Jr4j5J25K01j6j23j72j63p5R4n7R6K47L1o1NJ03m0j96j43
97.12285c55J24NP5j13nJ18k8j7J43J6k4L7n5j3P9J60M7n4j86m5O7j14j85J50K7q7j18N0K19K24
$$ y = [-20, -166, -231, -283, -135, 183, 256, 179, 94, 108, 159, 136, 20, 116, 284, 344, -133, -538, -470, -389, -315, -72, 58, 100, 61, -42, -103, -230, -128, -80, -166, -57, 22, -157, -184, -35, -23, -16, 77, 97, -27, -65, 9, 35, -83, -217, -319, -233, -301, -212, -107, -129, -89, 0, -33, -148, -198, -253, -295, -74, 42, 81, 179, 182, -17, -113, -114, -249, -265, -121, 5, 82, 58, -81, -156, -322, -414, -332, -97, -23, 43, 40, -38, -89, -5, 41, -20, -108, 41, 39, -2, -46, 17, 105, 38, -58, -168, -47, -79, -29, 20, -42, -166, -234, -230, -382, -224, -57, -12, -76, 126, 136, 13, -3, -105, -264, -228, -119, -18, -63, -154, -85, 203, 351, 167, 168, 134, 24, 14, 153, 104, 82, 108, 154, 112, 105, 228, 190, 31, -71, -308, -337, -403, -419, -437, -287, -315, -267, -170, -166, -115, -201, -186, -158, -33, -74, -133, -57, 25, -59, -274, -273, -176, -62, -3, 77, 153, 189, 181, 300, 292, 166, 189, 113, -32, -40, 92, 89, 198, 230, 100, -83, -41, 122, 127, 21, -50, -43, -105, -170, -302, -583, -222, -215, -103, -102, -196, -211, -86, 115, 99, -24, -196, -359, -434, -340, -397, -301, -54, -23, -84, -79, 24, -16, -212, -355, -231, -226, -151, -264, -269, -151, -179, -196, -53, -37, -61, -24, -79, -92, -13, 147, 194, 140, -46, -91, -24, -138, -323, -173, -146, -233, -351, -301, -82, 142]
96.92256A42l5R9J30K6o1k00n6j05r5O5K6O9J04j9lo1M9J4Jj89K1K5o8l0P9J38N9j90m5r0N7q6k
96.70224b31K34J18l8q7KP8k03k56j2J5J18K2k6k8M3L3J21J82j74r5J06J24o0j37J9J32J35m2
96.51530I3j88r1J03O2R2J17r6k9P7m9K5ko9j71L3m3j23K58M7k7j02n9R8o8j40k5LJ8N8Q0P5j77
96.30166b20K5R3P8R0n5p4p1l5j01KK13J80k5oR5r0Lm8j82kM0Pn8j12J11M5J10P2J1Q0j86o1k1
96.08134i2o5K8J20K17R6j74j67j52mK6k7k9j32L3K47J29Q2R1j60k05PK5K07q8m5J3o1o6J43K42
95.88105B39R1j41j53j59K4Mj73J6Q7L0j28n2K45R1K0K33j56l06l6R2J06k6N2O9O3q8j09M2J43
95.68743A20J05M1j06j50j75K5K23Q0j20p9J7n5m2J8M8Q4K7Q2J5p6J7O2j5n7j57j19M7J45j33l3
95.48714a61P6k2p9J15J31Q0j50k05J30K2Jk6Km6j04j02K19J74n8k8J3J6L6r8q7J18n2k22L2J63
$$ y = [142, 107, 206, 336, 362, 301, 101, 45, -60, -155, -90, -64, 5, 109, 90, 87, 26, 75, 89, 90, -99, -78, -53, -121, -151, -72, 66, 125, -65, -110, -200, -143, -229, -231, 3, 121, 83, -4, -2, 76, -127, -383, -395, -380, -262, -240, -266, -294, -251, -218, -97, 85, -89, -184, -78, 46, -14, -151, -132, 0, 135, 93, -95, -186, -83, -21, 71, 188, 92, 63, 140, 91, 116, 114, 45, -126, -93, -136, -259, -1, 46, 19, -83, -142, -44, -112, -252, -277, -274, -256, -198, -118, -43, -220, -195, -102, -24, 66, 11, -63, -134, -169, -270, -268, -55, 125, 100, 94, 189, 99, 102, 54, -128, -130, -90, -83, -141, -253, -142, -97, 13, 85, 96, 176, -10, -71, -92, -157, -129, -9, 208, 304, 130, -37, -189, -193, -167, -194, -223, -355, -322, -75, 54, 136, 227, 67, -138, -131, -106, 101, 13, -32, -19, -80, -146, -3, 239, 330, 189, 36, -123, -99, -95, -268, -252, -165, -135, -263, -315, -70, 21, 41, 274, 118, -188, -224, -132, -26, -52, 0, 69, 132, 44, -65, -23, 120, 225, 266, 160, 10, -165, -140, 83, 163, 43, -36, -19, -74, -116, -98, -50, 34, 61, 143, 158, 82, 99, 161, 146, 89, -68, -187, -140, 5, -128, -161, -85, -107, -186, -71, 60, 140, -10, -215, -85, -63, -62, -88, -86, -132, -236, -338, -119, 55, -3, -31, -18, -2, 34, -64, -151, -33, -85, -307, -275, -112]
95.28685a12J31q3J3O3o7Q3j9j34J9P0Q0k3p1j5l8j84O5K12J9J05L3k26k36oR4J74J36J11r6o5
95.08656C3n7N4K0J51j4r7O1o7m2M2PJ05J49o8j36k04j68k37j2J08J78J72J26M3J15r3q2j02k0
94.89295c5J27O0j14rK3M4N1J96k22l25j59J28J44P1P7k7j2r3J9J36J66K7Jn2k01k36RJ42o0P4
94.69266e0J34j28j27l4M0N9N5LL2r6ml8J60m9P8k4rp4j34pJ67J13k9J2l4n6j32l9K13o9q6J1
94.47902a42j08r1l6Q5J11lO4j2J8K9N9j13J52K1K5L9j0q0K6M7O9J13N0j39M4K7j26k65j64J00
94.27873b10m5q9J15K29J15q3J42m5j88J9J09r7J6L4Q4J51r2j85N5J1j29J9JN0O2K8n0j11j62l3
94.07844b79R7N5J4o8n7l0N2J57L0J7l6j24J40J56M6l8p0j40K4K6l8k16R2L25J69J6j76j46J73
93.88482A71m1ln2j7m5J49ok35j15N9%m6K7J7J95K06q4o3q9n0j04j74l0K15J55Q0o1r4r0k5J8O6
$$ y = [-112, 19, -64, -51, 12, -55, 28, 9, -125, -106, -36, 44, 21, -50, -65, -103, -287, -222, -10, 9, 114, 147, -79, -315, -321, -227, -53, 83, 194, 98, 33, -24, 30, 50, 201, 187, 90, 151, 84, 42, 84, 91, 196, 345, 277, 141, -63, -231, -468, -480, -372, -194, -22, 104, 147, 262, 169, 87, -15, -35, 92, 152, 38, 29, 52, 96, 147, 343, 121, -204, -363, -235, -91, -20, 57, 30, 18, -75, -56, 80, 246, 273, 274, 222, 21, -215, -206, -64, -124, -50, 84, -44, -171, -205, -165, -106, -51, -48, -16, -112, -116, -154, 6, -43, 35, 11, 2, -72, -206, -213, -46, 67, 38, 50, 16, -40, -172, -211, 2, -67, -153, -142, -250, -341, -377, -292, -181, -184, -120, -132, -114, -85, -26, -139, 13, 34, 59, 98, 88, 8, 34, 81, 150, 263, 313, 174, 218, 245, 119, -146, -310, -210, -255, -344, -229, 0, 115, 32, 174, 129, -59, -40, 69, -28, -12, 22, 106, 257, 165, -20, 35, 46, -83, -64, -63, -13, 49, 77, 27, -84, -246, -279, -182, -127, -113, -181, -238, -268, -216, -59, -29, -12, -48, -172, -32, 124, 170, 132, 62, -78, -54, -28, -66, -282, -190, 135, 304, 320, 144, -2, 171, 130, 127, 75, 58, 13, 162, 156, -79, -194, -135, -135, -181, -154, -137, 58, 264, 180, 117, 28, -22, -126, -300, -330, -115, 40, 120, 59, -35, -125, -150, -132, -66]
93.67118f6J3Km3J3J16m2j16l4mq3oO7J14n7K1K5k6M9J60M8k6Qj35l1l2j21k18o6p3j20J58J35
93.45754c70J26J16k2k6m8O0RqJ39J50J2k5j40j29k00q8j4P6qM7L7j70k4M9J00Nj02Q1P3k4k0
93.25057c38J03J64K7p4P4n0r8K7M3J28L1pn6j25P4R4l8q7q1j3L7k7j0R0k4K4J0q5J81K6N7P8p
93.03025A48j20p7K49K7j06K48ko9j61k91j40K11M0K4O5k4L5j27N4J41L1l1j56j23J7Q8l2j1L7
92.83664e5k4l9J17J69K60K9j70k00p9Q6Q5K2ro1M5l1N0m7M2n5j7L1O9k1J02R2j23pj5j05k00
92.62967e9j57lJ04J15L7n1O6K9N6Q3M5j34j01NP8J38M1j99%l0m9OM5K0o3o4r7R4J5K9j5N0r4P4
92.40268A4j00j87J6J00RPM9J05p6r2O3J16N7j53k24j8J7L2M0J14R8J57m8j30n4r1P7o6J0J09
92.20239d9J44J2j11l7j34r2J73J66r5j07l8P9N2k15k3J46J41R7j15p8po5JJ29J28N3k02j06Q5o
$$ y = [-66, -53, -51, -94, -81, 35, -7, -123, -157, -161, -244, -250, -183, -69, -126, -105, -80, -106, -57, 103, 151, 125, 133, -2, -33, -65, -186, -404, -470, -543, -663, -505, -370, -244, -128, -150, -176, -224, -164, -155, -163, -24, 126, 138, 113, -27, -156, -356, -444, -458, -382, -390, -343, -306, -476, -500, -451, -351, -346, -448, -367, -294, -318, -338, -235, -71, -44, -118, -44, -94, -192, -165, -122, 6, 37, 30, -26, -151, -77, 17, -21, -108, -189, -202, -165, -192, -202, -112, -136, -112, -102, -187, -6, 20, 77, 155, 148, 28, -49, 200, 227, 121, 369, 367, 298, 137, -154, -294, -83, -43, -19, 46, 22, 57, -70, -16, 125, 156, 125, -31, -154, -137, -49, -81, -92, -55, -79, -118, -1, 168, 428, 457, 287, 87, 8, 94, 179, 201, 192, 131, 176, 145, 195, 148, 190, 135, 118, 149, 218, 197, 299, 391, 268, 261, 246, 141, -59, -216, -219, -115, 0, 37, -14, 52, 81, 137, 220, 265, 131, 30, 35, 113, 251, 292, 93, 93, 63, 14, 20, 65, 85, 22, -42, -139, -45, -30, -1, -16, 34, -60, 14, -86, -273, -257, -157, -148, -141, -92, 13, -63, -155, -92, 24, 81, -72, -296, -314, -297, -265, -225, -111, -13, 144, 96, -34, -88, -179, -102, -168, -158, -49, 95, 107, -4, -41, -175, -267, -94, 72, -23, -130, -168, -89, -37, -252, -275, -129, 12, 109, -6, -84, -91, -156, -155, -26, 102, 155, -47, -153, -68, -74]
92.00210g4J12n9o4Q1q3JR1R0kR0N7j54mO8Q4o5K4q3N5R4oj54m8P3p1o6J41N8j68j30n6o0j38N7
91.77510c09R1N0J6k7J0M6K8K5k6J2n5J42Q2m2N7K36nj91o1j9L1j67l3mPj31J13P7l9O5J56Jk11
91.55478g5P0k5P9K5nP7qr8j65O2J43o7J30Q7k00K6l2n6o0Q3L4k4L7K2N2M0m4rl6q4j35l0J6r9
91.32779b69j07K27J30q9q2R2LJ59L5j21p3l6p5M4K50Q4j03q4J8m5l9N0M8j5n7J09J06j18r1M0
91.12750iJ33K9M9l0o0j17Q1l2n1J8nM9l2mo8j6J33J6N8R7j62p7p1j41M6J02J05n8M1M6j7k6k43
90.90718b16j04L1J2J3L8K94N0o6N3j09K5N3J28Rn8k05o7k3J09P0j3o2l1J5r3P9l3j82J58J91l
90.70021F3r5j97J50J37m8k52o7J33O3J30J22O7n1o5P9o5N0K2j60j25j09mJ96O5j2m6n6N9J60N5
90.49992A99qj20m9j71r8J12J67o9j65K0J99M0J6q2j71j4L7o1R3q1p0J86M3n7K2Q3J11ok4m0O6
$$ y = [-74, 38, -21, -85, -4, -87, -86, 5, 95, 93, 183, 240, 86, 82, 150, 234, 169, 193, 110, 165, 259, 253, 99, 51, 124, 53, -13, 128, 186, 18, -112, -168, -228, -366, -309, -218, -168, -152, -179, -169, -123, -95, -70, -96, -84, -139, 3, 85, 43, 100, 336, 331, 140, 79, 60, 91, -76, -109, -113, -106, -237, -124, -47, -86, -21, 135, 136, -75, -5, -30, 49, 74, 69, 146, 138, 40, -125, -63, 80, 13, 143, 230, 30, 56, 24, -32, -92, -9, 25, 1, 38, 60, 112, 152, 108, 99, 63, -21, -156, -186, -170, -269, -376, -149, -19, -108, -190, -98, -95, 64, 99, -22, -95, -131, -206, -162, 88, 172, 69, -15, 3, -42, -81, -31, 17, 2, -55, 54, 160, 42, -49, -9, 124, 153, 202, 172, 112, -5, 76, 44, -7, 11, 6, 55, 23, 19, -49, -65, 68, 84, 142, 239, 77, 0, -71, -212, -166, -64, 41, -17, 24, 70, 53, 27, -216, -320, -289, -277, -264, -226, 68, 118, 52, 105, -4, 21, 74, 202, 211, 153, -52, -119, -142, -33, 37, 24, -38, -69, -54, -147, -68, -101, -283, -125, 66, 63, -32, -229, -79, 58, 10, -242, -309, -176, -113, 17, 139, 206, 155, 90, 169, 104, 154, 176, 16, -109, -218, -222, -26, 39, 27, -19, -75, -16, 144, 199, 191, 71, 22, -149, -247, -135, 32, -37, -202, -182, 17, 57, 73, -9, -180, -194, -157, -218, -125, -206, -276, -90, -47, -104, -82, 1, 112, 106, 82, 42, 108]
90.29295A08J72Np1J0k3r7j25m3%q1j28K40M6m7J12l3o2M9L3j16l1m0q5n2R1J66P8j5o7m2M4J50
90.07931A46m3jQ2qj51j46N7J32K02q6j87m1j10m4L2J95J0q4J12O7q4L5R8q2j54J37qj19l2J31
89.87902E6O9j04r9rj75J4K38J8r4K53J21p0j79k60r6J28J74j05n5n7Q8J96N2l7k7J0N3L2j7j34
89.67873a6k0p0M4O2P7k31j16J21P2O1k5j4P7k6L2J29l3j61l4q4o4R5oo3k4N7L1K42P2j58j33m
89.46509a10P5K06P3j08k61J98N2N9p4j01Q1R5o2o4J31p9j92k1J03Q7j35K8rj08O0M1J35J13r1
89.27147A22k0j03p6J1O6o9K0p0OJ54L2L5j17m3k69j74J03K60J58o0L4J38J24j82k30N1K04n6
89.08454D9k67K1J39l9j8j0K60J45q5Jo4R8P0q8q9%P1J32j64p0Q4Rk6r3r6L2p5L8N3q1k6J32j89
88.86422a46N9J24j21j6Q2n8N2K21N1p6k74J8J30J12jj19r7j3L9p2P8M6n4R5J54J46M0j46j64r8
$$ y = [108, 280, 285, 214, 224, 201, 104, -21, -64, -64, -145, -273, -33, 13, -34, 78, 45, -17, 32, 65, -51, -82, -122, -207, -259, -168, -2, 76, 61, -6, -48, -4, 146, 103, 102, 184, 176, 25, -121, -64, 68, 270, 184, -3, -44, -154, -198, -166, 29, 39, -45, 67, 134, 50, 85, 183, 101, -53, 84, 76, -43, -75, 56, 125, 21, -78, -87, -262, -248, -10, 8, -86, 167, 288, 218, 39, -221, -317, -189, -15, -120, -175, -232, -144, 52, 104, 67, 40, 50, 103, 135, 118, -16, -36, -106, -62, 0, 77, -154, -270, -149, -77, -16, -41, -55, 22, -4, 28, 157, 124, -37, -71, -155, -219, -124, -130, -193, -217, -160, -129, 113, 185, 27, -106, -110, -35, 171, 244, 136, -125, 73, 125, 184, 110, 9, 90, 185, 123, 59, 190, 111, -81, -102, 1, 88, -47, -19, -28, -136, -76, -35, 100, 213, 122, 102, -1, -77, -66, 0, -69, -49, -119, -113, 41, 73, 108, -9, -52, -321, -495, -392, -132, 26, -34, 0, 138, 262, 80, -150, -99, 105, 49, -218, -197, -58, -97, -115, -125, 135, 280, 195, 196, 132, 230, 300, 212, 123, 123, 194, 326, 162, 92, 176, 185, 159, 66, -30, 2, -73, -35, 18, -63, -89, 43, -146, -87, 37, -84, -100, -18, -76, -24, 197, 248, 172, -102, -84, 46, 158, 157, 38, -59, -72, -33, -105, -27, 19, -35, 60, 214, 360, 400, 254, 90, -8]
88.66393hO8J8mm7q9M9R7n9p6R1j46k4K31R4m0j58j19Q5N8m2j57n0J50J43rj15J5K26p4j36l1
88.45696e9J54L2j87j04L6K72K3l2O8p7j26Q5o8k35j16J17J19J06O2Kj29J50o2j06m1j6N1Q8J20
88.26335A27N6o8MJ2r0J12J25pmp5j81r5P8n2l7J77l3j95j41qK11M0M7O4PL6oj62j9R1n7m0j36
88.04303b19n2J86O2m2l2M2j56J65M5O5M7Q3o8j62LOQ0JJ41Tn7m3l8r3j38K7J42P1l4j63o7j1K6
87.82271d2J8J19J49L2M7j3q3N0o1j79j75r0L4J71P7N8j5p4k04o4m9l5Q6Q1qrk8p4Q6M0j3p2N4
87.60239a86R3k26l2J32N7K3J30K57mo8j09j66j73j47J82J05R0K11mm3j0Pl1j11m4J79P6r9L2N9
87.40210A80o8k53k8M9l2l0K7p3N8J77K4m4N7R1k8K0J03NKn0o8m0j03r9r2l7j62j01J65P5N0PP4
87.18178a44K23J32q5k79o1n3J4J89J68L2j3k10j23J58K69j6j90p2J6P9k1K9R0j2j00M9p4n2J03
$$ y = [-8, 60, 78, 74, 27, -62, -13, 84, 25, -51, 40, -106, -130, 101, 195, 155, -3, -122, -37, 21, -21, -178, -228, -78, 65, 56, -59, -44, 182, 108, -28, -59, 95, 127, -60, -164, -128, 144, 167, 135, 203, 126, 0, 85, 17, -218, -334, -217, -98, 8, 70, 72, -57, 93, 31, -75, -116, -132, -81, 7, 127, 183, 115, 119, 131, 41, 153, 278, 271, 267, 192, 11, -84, -6, -58, -95, 82, 49, -146, -287, -295, -84, -44, 3, 67, 74, 110, 104, -58, -77, 14, -43, -83, -219, -271, -85, -23, -65, -97, -55, -211, -46, -1, 64, 111, 194, 126, -36, -33, -27, 53, 54, 195, 336, 279, 236, 198, 105, -33, -6, 136, 207, 173, 10, -57, -68, -42, -24, 95, 244, 276, 323, 310, 227, 277, 216, 37, -138, -228, -194, -23, 54, 112, 97, 23, -181, -245, -294, -329, -243, -162, -170, -179, -207, -281, -195, -155, -168, -240, -186, -93, -319, -351, -219, -162, -139, -9, 248, 244, 176, 67, -99, -272, -419, -237, -132, -42, 169, 165, 122, 112, 119, 88, -23, -67, 112, 188, 89, 121, 180, 112, -141, -169, -120, -152, -182, -155, -228, -170, 7, 31, -13, 44, 135, 107, 127, 230, 235, 237, 187, 119, 79, -24, -123, -215, -252, -414, -515, -350, -275, -225, -218, -144, 79, 211, 126, -153, -214, -267, -253, -64, 104, 136, 123, -87, -210, -52, 217, 201, 11, -61, -45, 34, 13, 42, 132, 120, 20, 69, -5, -57, 46]
86.98817D6J1Q2k7j14r3j3R8N4J25J42J9j86J22o8k04N7J52O8n9n0M6k5j6p6N4r4q2j72J24R0l0
86.78120a9j33j42R2J23O1l9kJ47J29K3j8o5j63j04n7p5k0J56J19J37j72Q2Q7p9o9q6j3m0j7M8
86.58091a09N0k5q7kNL7ok2L9L4L1J8k44o6K39J03J56J45jl6l23k05k03J48L19M1j84qj17Q6J91
86.37394Dj28o4j57k8K3J00J18J80L3j56q9p2oo2p9L4J47J06j19p7r2K15P4l6J01M6j5L9K8K4
86.17365I2k12j83Q2K08J1ol3q9L4k2J27J7j83K9L5j26j53N6O5N4P6n1k3J1p0k3J61j2Q3l5p5p1
85.96001b26m9R6J99l5Q7P8j10M6R6j27r4j92pJ39J62q8Q8j49r9J13K74J83q8j29rj00j47p0Q1
85.76640g7Q2J8J3j85N5n8jK00L1J2o2J24J5N4j39r8P4o6k5J31J2m8j8nn4J17O0k1n1j07K6q6
85.55275g7J03J0j95q7J14n1J37O0Q4N2O6M8k77m5O5M7j85j44K61J46p1j29k66K05K93N7k53p9
$$ y = [46, 57, 139, 112, -2, -95, -108, -10, 44, 169, 311, 330, 144, 266, 198, -6, 51, 203, 271, 212, 162, 208, 183, 167, 91, 145, 51, -31, -203, -79, 11, -19, -152, -294, -202, -79, -18, -57, -59, 88, 217, 240, 222, 157, -6, -110, -167, -242, -262, -106, 13, 150, -22, 60, 147, 68, -1, -87, -100, -140, -157, -109, -59, -84, -171, -173, -168, -131, -137, -159, -120, -86, -55, -37, -281, -347, -108, -5, 151, 296, 295, 259, -64, -269, -472, -324, -5, 36, -148, -156, -273, -187, 4, -124, -188, -345, -373, -350, -250, -132, 48, 81, -75, -164, -236, -242, -304, -383, -349, -202, -96, -215, -292, -384, -169, -95, -131, -30, 16, 1, 40, 68, 92, -120, -303, -221, -13, -2, -8, -41, -130, -96, -118, 9, 26, -157, -128, -93, -219, -372, -316, -251, -197, -121, -172, -195, -184, -254, -277, -116, -128, -45, -80, -155, -226, -275, -179, 20, -15, 72, 150, 40, 86, 182, 55, -39, -231, -238, -99, 63, -25, 63, -86, -185, -72, 202, 385, 297, 168, 159, 59, -88, -158, -77, 5, 23, 36, -149, -94, -152, -153, 47, 78, 90, 28, 152, 167, 221, 82, -16, 58, -8, -33, 98, 110, 62, 44, 39, -15, 102, 162, 141, 90, -17, 9, -77, 26, 36, -159, -246, -132, -183, -46, 14, 98, 150, 216, 264, -13, -58, 7, 54, -131, -275, -14, 132, 61, -68, -334, -129, 164, 221, -32, -111]
85.36582a11N3L3J96n0p1K09Q3k13p8M8k03l0J68L6j43j07K4J00p6j3O0J07J28J31k00r2j29m1
85.17888a81P6Q4J58J05j40j12J11Q2o6j30r7P2o4l0R2K23J6K8K6j44K6j6k22n9M4K13r5m9j9k7
84.97859i5jR6JJ37q9j36j7J4k5J04M4m9j07k0J41J11m3j17J5Q1P2P4k32j01l1N9J33P0N8j2j64
84.77162b9j50N5P9p0j15j64k8K49K98m0N0QPj57p8j7R8j0j2m4rL7J22J24o3N8o3q5k76M7L7O9m
84.55130g6j23J1R9mL2O3k05k02oJ41M8L4J91J62pnq5o1j12J3n1j60j53k1J03K04J2N6P2O1p4
84.34434d3j92R2P5l5l4K2P2m7J05M7k4l2Tj1J4o1J44k6j15j24k9J48J47Oj06J80N5m4n9jl1J0
84.13069G1q9l21K2J41J60J41j32r2j2N1J23P3k8k47K2J2n3Tj0m2OQ2K53M1l3m0j86j00J36rO8
83.92373d5R1P3j18j2Q7j3m7pR9J15K5L4n8p6l6o0p7q8K20J35j84r3m7J13Oj0J5R1p4j50j01r
$$ y = [-111, -58, -25, 171, 121, 50, 259, 342, 129, 51, 99, -104, -134, 34, 70, -73, -180, -156, -56, -132, -145, -85, 22, 150, 281, 81, -11, -140, -181, -105, -21, 137, 242, 102, -10, 101, 183, 117, -13, -110, -38, -102, -132, -40, 183, 199, 227, 253, 109, 135, 119, -103, -162, -118, 95, 0, -49, -68, -95, -96, 0, 1, 138, 49, -87, -104, -90, -115, -11, 33, -16, -123, -143, -2, 109, 66, -51, -36, 45, 117, 191, -41, -142, -173, -114, 19, 89, 147, 135, -29, -179, -124, -45, -115, -230, -394, -422, -173, 125, 85, 135, 143, 150, -7, -85, -102, -4, -14, -26, -70, -79, -42, 80, 204, 141, 199, 136, 51, -225, -178, -141, -72, -76, -199, -188, -89, -93, -61, 2, -203, -405, -411, -270, -222, -188, 3, 165, 158, 153, 68, 7, -105, -92, -143, -303, -456, -477, -374, -170, -158, -102, -30, 31, -43, -235, -143, -68, -103, -137, -115, -43, -90, 15, 62, 38, 6, -26, -37, -23, -84, 60, 34, -81, -205, -234, -86, 61, 67, -39, 141, 196, 152, 93, 92, 61, 71, -18, -339, -317, -176, -16, 125, -7, -99, -111, -60, 63, 136, 108, -139, -117, -105, -158, -211, -221, -263, -257, -175, 78, 119, 86, 46, -140, -240, -104, -113, -45, 46, 119, 1, -11, 76, 63, 16, 9, 108, 223, 248, 282, 224, 148, 112, 52, -25, -113, 107, 242, 58, -35, -82, 31, 37, 27, 42, 133, 59, -91, -192, -201]
83.71008b01K44l0j00m3J91jR2P3j27j02QO4J82j28l0K1j13p0N2Mk42n0J50N8J22O3j13O1R6j43
83.50979a2r8QN6j04L0K93N7k10n5Q8R8L4j55j76j53R8j32J10K17Q8j64j80J21O3j11n9P1J67P5
83.31618F5p2p1k13j19j8M6K1R7M8J18k36n1J46P2J82J22k18k56L9N3J80K69J12j09q0Q1n5kj31
83.12257B0N9P3m8j2O2j5k18l5O5Nk7J20Q0R5R3J0m0j71j44J82p4l0K0J32p5k4p0j31j78M7K22
82.91560gN4O2L2j6P2N8k14q6J32k0n1K03R1j86j23J4R5j49j41R3j06J49J72Pj65j11k6o8J21
82.72199a14J22j4J37J02M5%lj39j31k16L9Tn2J53J92j27o7K0j06o0j04J66J32nl6O7O1P4k7r5
82.52170E3N4o8l6j57K2L6M0K4J13J54k6k62K1M5m2K6j70j05J06P6O%J61Q4J5N1j1K1R8P3j91
82.31473B11k34n3P2M4k06p5P5J01J19L6N9j21P1L3k27k11k18J3J26m9O7J81J35mm3K04J44L4n6
$$ y = [-201, 43, 13, -87, -130, 61, 60, 152, 225, 98, -4, 4, 68, 250, 122, 92, 113, 0, -70, -18, -14, -256, -306, -156, -98, 24, 87, -26, 35, 131, -12, -110, -102, -46, -150, -120, 173, 230, 20, -35, 53, 151, 185, 30, -146, -299, -201, -333, -223, -6, 82, -82, -262, -141, -78, -189, -248, -177, -10, 65, -7, -78, -291, -410, -428, -382, -361, -264, -216, -98, -334, -385, -239, -167, 15, 137, -81, -337, -298, -245, -65, 204, 316, 207, 127, 208, 153, 151, 20, 79, 152, 104, 92, 154, 139, -79, -114, -49, -44, -71, 49, 129, 224, 317, 327, 287, 116, -28, 154, 80, 50, 70, 202, 127, 103, 33, -98, -276, -229, -7, 47, 109, 141, 125, 197, 255, 41, -45, 87, 67, 16, 219, 310, 124, 1, 15, 110, -39, -180, -87, -193, -44, 128, 135, -30, -141, -167, -235, -114, 8, -6, 131, 233, 278, 278, 275, 136, 5, -211, -172, -133, -185, -32, 160, 33, -34, -14, -120, -180, -284, -118, 14, 9, -27, 40, 101, 175, 148, 53, 107, 39, 3, -154, -132, -96, -56, -32, 81, 235, 209, -53, -32, 13, -29, -3, -173, -278, -172, -96, -90, -90, 71, 155, 170, 221, 210, 231, 329, 402, 211, -23, -76, -4, 40, -166, -241, -166, -65, 54, 90, 149, 28, 99, 132, -95, -306, -524, -511, -385, -434, -367, -186, -51, -55, -98, 106, 250, 284, 228]
82.12112B28k19P8J24j06J8J9L0o1K5j2MJ19no1J8P0o5k23j12l3j1l8m3J26J10L8p0q6M3Q3k8J6
81.90747b4J09r3q8n6j43j9l3J17N0l4p7J58K00J70Q2o3j62M0M9j55n0j22L0j9L1P3J13p8l9R8
81.70718F5j8k1K1j62J0J13J41Q9j2j10k44j19J90K69J08kNj66m1M8n8J0N5P0q0j31J33k4n4p7k
81.50022Fn2q2l5j04N1J34M6j9k46LMl7j3K30P7K5qJ68J20k0K2J50j66j82j36J29J38r3m1N1o5N
81.28657F0j22j93LN0P2M4j4l3K52R8j77m1M1o7j15Q4J58k3P1O2o8m8l7k01n0L7j8Q6Q0P3J28J4
81.07293B06j95l0J28L1o0j14n0P6p8qJ14L9L6j03ko0n0N1J19M9j16m9R1O2p8l2J45l2k23o5K3
80.86596a75J8N1P8J72L8k2q9TM8m8l5m0TK9M9k23j54K5J00J20o2k8J0l1j8l5J54J48k4j01l2
80.65900b06J17O2m8j63M2O1Rq9k8K05l9N7J71J38J1q3r3j08n8P7j21J09N8j5j2J27Qn7k02j16
$$ y = [228, 9, 87, 211, 105, 123, 142, 172, 111, 136, 124, 128, 247, 242, 181, 199, 269, 204, -19, -131, -164, -175, -213, -256, -130, -20, 18, -52, -138, -95, -12, -40, -24, 85, -8, -96, -152, -295, -314, -347, -230, -180, -214, -291, -133, 67, 237, 319, 256, 94, 134, 183, 28, -22, -144, -114, -133, -102, -29, 84, 6, -33, 65, 47, 26, 47, -115, -105, 8, 149, 238, 226, 116, -128, -247, -57, 212, 320, 318, 323, 157, 116, 164, 106, 116, 171, 241, 161, 30, 163, 139, 85, 8, 6, -46, -128, -163, -267, -216, -82, -36, -55, -301, -298, -294, -331, -344, -114, -37, -12, -20, 148, 268, 248, 270, 420, 254, 72, -64, 65, 203, 110, 69, 120, 55, 60, -62, -255, -252, -202, -130, -86, -100, -133, 119, 217, 40, -1, 40, -27, -142, -58, 100, 77, 148, 210, 142, 94, 57, -144, -194, -157, -175, -89, -9, 64, 192, 206, 11, -19, 109, 140, 80, -34, -84, -8, -86, -94, 20, 59, 95, -8, -10, -70, -120, -69, 50, 99, -17, -66, 25, 87, 9, -23, 122, 90, -133, -198, -175, -157, -106, -28, 144, 182, 160, 71, -18, 30, -18, -53, -93, -133, -104, -55, -278, -432, -407, -307, -187, -249, -277, -267, -298, -316, -351, -197, -49, -73, -174, -206, -89, -27, -75, -238, -196, -135, -126, -215, -243, -38, -77, -20, 151, 289, 300, 217, 124, 16, -42, 35, -86, 23, 81, 66, 54, 181, 189, 132, -70, -186]
80.45871a86K8mL7Q1o1J7O1J42k8j97J5J2j06J66J13m0q4n6M8nlj2M9j13j05J3L4r8M0o5J28J58
80.24506b1N5J17J68p9m1p9o6j33m8J3K11n0m3qP2J73j43j54p5M3k8J25J9n0J84K5p1J2j27n9q8
80.03810a46Q7P7J30J98r8j77o6k8Q1o0j65p3j26j13p5Q9K79J41r8j30m1M8Q8P1K2q6J9k5j29n
79.83781c11o4J75J20J03K18P9j01m5q6j10j80j0k1N6q1o5J13K00l2m3m5L6Lj2Kp1rJ42J64M1J4
79.63084A80j76j37k0J07P3J02R7j6Np7J3j52q2J41R8J26KL2j14l3P7O8r7M9J6j37j56j67J5K1
79.43055a42J5j1kp4o3j4R5J58J29j6j31j59Q6J86J14j56J0j8j75J20J80R6rj16j38q5m4qj8N9
79.23026a31R2j01o8R9kj54p7j7R6K3Q8J10NJ36p4r6P7J36j66l0j4oO8O6NM9j1k0r7j29n1JJ24
79.00994f9k5J4j56j26P5K27J61j01k7o5l0K31P9q6m8j78l3J13o5O0J74r8M8Q7Ok9l0k25k6K0
$$ y = [-186, -158, -162, -125, -44, -105, -88, -27, 115, 87, -110, -95, -83, -189, -23, 90, 50, -34, -90, -42, -47, -50, -62, -13, -126, -231, -218, -184, -282, -242, -307, -179, -21, 34, 151, 319, 240, 199, 120, 54, -79, -127, -114, 97, 47, 4, -4, 68, 241, 98, -56, -131, -88, -116, 9, 28, -22, 162, 187, 116, 128, 1, -58, -146, -59, 18, 148, 346, 248, 71, 5, -23, 58, -2, -167, -240, -366, -479, -554, -465, -186, -45, -143, -273, -314, -266, -178, -107, -85, -171, -152, -177, -306, -311, -375, -200, -80, 23, 241, 320, 219, 174, 88, -22, -202, -212, -233, -177, -258, -323, -210, -10, -42, -85, -130, -94, -91, -103, -101, -172, -181, -39, 125, 166, 180, 4, -133, -153, -46, 27, 129, 226, 210, 215, 138, 151, -1, -83, 58, 156, 282, 284, 316, 202, 169, 246, 314, 217, 266, 282, 145, -11, -178, -163, -142, -127, -138, -140, -214, -277, -291, -196, -38, 91, 75, -56, -215, -129, 57, 171, 15, 25, 7, -168, -48, 132, 228, 219, 103, -35, -120, -164, -172, -190, -131, -39, -140, -208, -109, -111, -265, -342, -359, -263, -240, -152, -42, -37, 99, 25, -71, 6, 142, -24, -54, -68, -74, -6, 60, 65, 114, 103, 83, -14, -143, -194, -193, -69, -94, -80, -236, -362, -287, -60, 101, 0, -27, -92, -122, 109, 188, 102, 54, -124, -157, -44, -109, -49, 125, 27, 75, 162, 168, 139, 109, -116, -142, -122]
78.80965a22J99K11j04k8k3Rk10o6M0p3q2J12K5o0P3j6n0J7NJ6M5R4N2kj3r7Mr2K0J5j9NJ20oN5
78.57598E4J7j46p5J70j42n1J78n7M1K3j00J2J30J40J37j45j50O8k5m0q1k53r2oQ7K02R5m8j7R0
78.37569A6M5p8R4jj82j95n1Q1l3M8R6O2j08M8N2O2J58m2j86q2J1Tj64j02J25O7P1R9M3JR1k07
78.16205a50l33K9K30m6o4J12J31Q5J19K2Nk03j26P3K2j6J16J01j36r0p0j42J65K62j33k78j13
77.98179d28j6P5J97J08j25k13j01J75NJ92K6L4J0O6qk20m6K43R5O2J79Jk67r5P8l0k9P1O1N4
77.78150A54j07j09l0kN2R7o4j77P3N5j53J19J27n7k82K3J07qp8N0m2r5l6J34K24L5k09o7J63L
77.58121a00j80j78J01TJ77M8o4j09p0r1R0oq7j38j15k28l75o30j029j515k235k217k77J970
77.42097g157K632J720Q86N78M50J80J23n3m9P9J17P4N2K8J01J73j3n8J13J66j05k59m7l0J61Q8
$$ y = [-122, 77, 288, 184, 156, 133, 142, -68, -134, -94, -167, -249, -137, -112, -172, -99, -115, -165, -148, -143, -127, -82, 12, 64, 62, 49, -48, -44, -136, -116, -101, -120, -115, 5, -1, 54, 71, -75, -150, 20, -122, -173, 5, -52, -11, 12, -88, -76, 54, 194, 331, 186, 36, 104, 79, 39, -42, -295, -387, -393, -306, -104, -9, -57, -74, 16, 61, -17, 77, 76, -106, -301, -352, -271, -304, -256, -160, -98, -206, -158, -106, -44, 114, 72, -114, -196, -185, -174, -338, -440, -315, -248, -177, -78, -35, -34, 57, -150, -483, -454, -224, -270, -334, -222, -91, -6, 113, 135, 140, -63, -189, -116, -94, -110, 6, 107, -29, -119, -189, -331, -166, 96, -37, -315, -428, -444, -369, -172, -64, -189, -402, -503, -328, -323, -131, -105, -71, -61, 5, -3, -223, -269, -26, 69, 131, 310, 311, 44, -51, 27, -3, -32, 39, 100, 154, 47, -62, -92, -94, -42, 55, -9, -186, -113, -58, -211, -92, 35, -22, -304, -281, -174, -182, -260, -210, -252, -347, -383, -249, -25, 10, -199, -266, -103, -100, -280, -458, -357, -256, -79, -31, -95, -204, -274, -365, -275, -281, -368, -506, -621, -849, -1224, -1854, -2883, -4398, -6633, -8850, -9127, -7157, -4525, -2805, -1919, -1341, -891, -711, -588, -641, -690, -611, -494, -420, -368, -340, -239, -66, -79, -137, -24, 142, 37, -222, -269, -299, -138, -50]
77.24739e0j50k30j6J24J53N6j14n6M6O8J18J7j7l6nk8o6P3r0j9J16j7N2j0j66j58k28Qo5j89
77.04710h79l80p46j138j937k606j871P04K527K209J295P45O06N46K42Q7k0O6K34O8M6j70pj70
76.89354e49k4J94L34K84R6k65k52MJ91K8k2L2J26j23j16j11m3j09k31N2Q4K01J22o6P9K27J37
76.71328B80o3k2o1m1Q6m6j32k21k04j65q3m9j26l22n58n39j211k110k687j196J576K603J870
76.55973c421J205P10M01J73J91J82R8R0O5J21k5r4Q3M1j50L2J90P2J51k7n7M8q0j24j22o0J46
76.37946a61L3l2L8J0L1P4P1k9q1q3J28J42j43j96J33L5j80J02R3l0Q6PP9J00m2r1j4J07k8RJ55
76.17250C23K29j4k77r7J80l4j64jk7j25q0m5j46N5J2J08J30j3J6K4M7o9j12j1l1K4P6p3lm2jR6
75.95886d5K8J35L8j7m0j6J74O4j53r3m5O9o5j25k3j18L9K51M8j96J2J19P2Q9N0k17j23Jj28j44
$$ y = [-50, -200, -430, -446, -322, -169, -113, -227, -283, -237, -169, -51, -34, -51, -87, -92, -120, -186, -113, -203, -222, -106, -123, -71, -81, -247, -405, -633, -625, -690, -879, -1259, -2005, -3143, -5080, -7686, -9557, -8853, -6326, -4117, -2822, -2077, -1471, -925, -683, -596, -616, -550, -316, -248, -202, -372, -379, -549, -573, -379, -45, 239, 335, 70, -182, -178, 13, 41, 19, 51, 177, 54, -62, -173, -216, -325, -556, -504, -420, -219, -97, -163, -84, 143, 280, 217, 195, 134, 93, 179, 133, 1, -220, -424, -589, -672, -721, -847, -1169, -1727, -2266, -3477, -5587, -8274, -9470, -7894, -5291, -3421, -2216, -1506, -1105, -932, -741, -559, -461, -371, -306, -185, -210, -304, -221, -180, -330, -298, -108, -36, 115, 88, 31, 79, -1, -125, -247, -307, -161, -128, -160, -122, -112, -81, -7, 64, 35, -46, -129, -1, 141, -2, -198, -65, -30, -210, -108, -15, -45, 41, 48, 127, 227, 185, 94, 80, 187, 159, 168, 323, 552, 538, 261, 164, 344, 310, 146, 145, 118, -7, -87, -132, -278, -223, -211, -103, 27, 14, 30, 54, 101, 32, -80, -91, -122, -98, -22, -95, -98, -140, -141, -45, -17, 118, 156, 139, 99, 83, 257, 321, 168, 75, 30, 99, 34, -91, -114, -232, -193, 58, 106, -90, -78, 41, 113, 202, 252, 35, -88, -87, -215, -359]
75.75857c59JJ32Q5mN2l0L1p3K2K32J8k9l4%p1j51O9k21j09P4J76O3J76M4n3j9j35o4K01lL0L5
75.54492H6J6q0q1m9R1Kj39L4M7l6M1j39r9m4L4J16qJ13J30l7Km3j7j09J36K10o0m2j26l1pM1N
75.32460d3J4j53K7J21q8M9N1j26j16J39rJ10n4j07Qr1K20q0k04n8J00K32L31j0j42j30L0J18L6
75.13099A75kM3j77j80p2p9j73Q4J82J59R4Tj13p1Q2Q5o4j44q7l3N3J59J37m8k0m3o1l0M4J21
74.93070A15K27j9nj09o1j51k0j31KK70J06j33j32o8J29j20N4Q4m9J16n7q0O1Mm0p0lJ0l6Rl1Q7
74.71706d1KK7J43N2rr1j08r3J14k3qn4J54R0j18k16q9NK9O9J70Q7nO7O6j1j09l9M8j33TL5rJ63
74.49006C2P7M6J7j5j21j6L1J4j7k0p3j28k2l0N8P2J49j18k44k32J04K89J36K6R5q4K5j43l5J2
74.28977a15O2%j6k6l0Q7L7p8q6m7J18K44n2R3m5j31j6P0l5r1O3pk42j04J05J3R9j1opJ21l6R3
$$ y = [-359, -358, -226, -141, -145, -93, -123, -92, -165, -143, 89, 107, 78, 44, 44, -27, -178, -109, -330, -439, -365, -189, -126, 50, 94, 41, 22, -113, -177, 24, 21, 51, 86, 102, 22, -59, -108, -17, -15, -154, -120, -73, -109, -68, -207, -306, -350, -316, -200, -208, -95, 35, -2, 0, -43, -60, -169, -33, 177, 117, 75, -51, -82, -89, -48, -43, -29, -182, -155, -34, -122, -73, -22, -148, -264, -125, -134, -24, -78, -185, -177, -268, -48, -128, -332, -390, -290, -58, 273, 263, 121, -9, 21, 139, 175, 173, 216, 39, -141, -213, -292, -465, -381, -199, -40, 54, 148, 35, -36, 46, 131, 67, -77, -164, -197, -144, 15, 152, 104, 84, 41, -20, -50, -6, 115, 342, 323, 318, 209, 148, -3, -23, -154, -152, 118, 224, 91, -41, -109, 20, -100, -46, 38, -11, 105, 48, -32, 29, 33, -7, -77, -80, -70, -106, -97, -128, -41, -39, -12, 131, 183, 174, 83, -25, -118, -4, -27, -35, -89, 65, 155, 37, -179, -268, -263, -234, -165, 5, 92, 87, 154, 220, 209, 100, 61, 109, -24, -157, -122, -131, 32, 109, 155, 172, 157, 36, 20, 51, 65, 48, 28, -45, -173, -195, -225, -167, -95, 54, -64, -308, -540, -436, -147, -11, 15, 110, 26, 51, -92, -127, -115, -53, -53, -69, -95, -125, -38, -1, -79, -165, -212, -94, 150, 98, 191, 146, 15, -1, 69, 34, -57, 6, -1, -243, -347, -242, -229, -130, -141, -147, -154, -33, -69, 24]
74.06945B4R4o3n1j1j54j38J98J20J8o9L2o5M2qOQ9J3n6j54n7L5l3N8j1L5K12k7J30N7j01o3O2
73.85581A64n1Jj09J9r1p1Q7Q8lJ28lm3j80p1J4k7Q1J20%q9j02j2j47P3K1N3m9L6J29l7j10q8
73.64217b69J59j2J06J87j23j52j78J05J38J0p8rP5J58m4k7j81j25Q0j4N6M9l1J55P0Q1k3N4Q5
73.44855C02j51n7J1r6M1o8KQJ15j12k7N4m7J5O2O0J29J4j88j98m7R9k6l7J48J1k21j80J16J20
73.24826a48Q4O1O2K9o1J56j0n9q3N4qo1N0L5R3N7k03j53J04Q5m0J18J0n7k0m7j37k05Q5O5R4
73.04130e0K08J47O1j09j60m7O3j25j43K1J91Q5m1N8Pk7ok27k08o9K4J00M6J40Q9o2o0J2Q5j60
72.84101a57N4Q4m1lj01J1J30j16n6pj21N4M0O4N4j56j21o7J61K48K0l4q5j03J0L6j8m0J89J91
72.64072A20n2q1N9k9P1j25J5M0j02k2M2J17l2k2J02m9o4k0n2J51N5m7J61R1k02j61k25k02Q2
$$ y = [24, 118, 55, 4, -7, -161, -299, -101, 19, 37, -32, 0, -65, -23, -31, -25, 64, 77, 21, -133, -190, -155, -188, -130, -141, -106, 106, 79, 209, 266, 165, 102, 164, 113, 114, 5, 24, -67, -138, -51, 37, 34, 162, 159, 116, -64, -135, -121, -148, -67, 53, 53, -36, -138, -150, -297, -224, -203, -150, -199, -163, -34, -71, -181, -269, -110, -122, -16, 171, 48, -104, -282, -177, -39, -29, -107, -116, -41, 117, 73, 46, -135, -260, -180, -194, -138, -89, -120, 35, 105, 186, 163, 217, 302, 151, 94, 105, 9, 50, -18, -16, -8, 107, -5, -32, 22, -25, -10, 52, 112, 241, 255, 67, -131, -178, -79, -105, -142, 6, 17, -204, -384, -268, -148, -64, -3, 59, 88, 27, 183, 173, 114, 31, 85, 77, 16, 66, 101, 194, 251, 48, -105, -1, 84, 44, 162, 172, 115, 95, 48, -89, -294, -209, -144, -50, 158, 305, 366, 257, 97, 50, 113, -12, -155, -134, 57, 142, 101, 159, 166, 139, 133, -94, -302, -371, -347, -247, -201, -61, 28, -34, -94, -82, 3, -157, -103, -19, -60, -63, -164, -153, -23, -139, -195, -202, -323, -269, -229, -165, -111, -267, -388, -455, -294, -46, -26, -60, -145, -248, -238, -202, -220, -260, -71, 120, 68, -13, 46, 17, 88, -37, -22, 18, -84, -106, -64, 53, 21, -1, 101, 52, -12, -32, -84, 67, 122, 75, 236, 327, 125, -36, -261, -463, -381]
72.44710c81J09kpJ07P1Q2J65J14L5j88j38l2m9L6P0J30Q6J32r2j11J94N2j76k69k6RJ06K3o5l0
72.24681d5M9j03R3R8o3j07k01j10O7J39J0J69K46o1r4J4r7j6n0m2r0R5O1m4J04po4j18j65pJ26T
72.03317h7R2o3l6Nj47q0K43J04j20qk4J19Kn3j04J34O3m1k6K29Oj69j9O6jpP3q1p9r7j14k4p3
71.81285c17J36J64l4N3k7j12j41n0N9Q4J58J48O6J24k11l59m4J74M9Pl7L4R0J25J32j85k44j9
71.62591a77J41J17j18j60j1K71J16o2j55p0O1M6l8J43J36j11n9q5p2l5o2J35K35Q0q2J26K5L6k
71.43230C69P5N6n1j38o0o2L1J04l1j39m4NP1L5r9o5j5n3n6J34M1o1l5j52j08J57K5j63L1O6R6Q
71.21866b8K8m5o2j34o5j0J09N3M1O8M1J34p2j37j3j72J4J12o4j85l5o4J30K73J62L9l7N4J25j8
71.01836B42j64L4j39n8J27K02pNj82J08J13Lr3j20K7O0J07k31k51j07JQ0J55j32M3J47O6k48
$$ y = [-381, -272, -274, -281, -174, -103, -21, 144, 258, 293, 105, -33, -65, -114, -78, -8, 122, 208, 340, 248, 137, 331, 383, 207, -62, -88, -79, 27, 50, -15, -45, 4, -99, -6, 92, 29, -78, -279, -389, -322, -183, -173, -4, 242, 181, 87, 101, 4, -12, -62, -104, -194, -99, -38, -82, 22, 15, -49, -167, -332, -339, -213, -87, 5, -58, -94, -89, -236, -316, -73, 31, -89, -97, -121, -2, 0, -53, -157, -23, 40, -1, -27, 202, 208, 39, 20, 86, 85, 78, 151, 70, -9, -106, -220, -244, -317, -181, -17, -51, 2, -25, -137, -278, -328, -269, -185, -27, 121, 187, 311, 100, -259, -303, -129, -80, -73, -110, -76, 14, 139, 271, 86, -158, -177, -36, 81, -37, -197, -208, 63, 179, 117, -38, -108, -47, -1, -39, 104, 240, 129, 70, -15, -87, -122, -184, -49, 186, 266, 184, 310, 335, 371, 369, 444, 500, 449, 311, 251, 189, 220, 324, 293, 154, 110, 115, 186, 221, 122, 57, 42, -11, -67, 67, 108, 47, 12, -140, -248, -91, -66, -229, -198, -132, -36, -28, 0, -45, -107, -241, -306, -316, -207, -154, -113, -45, -4, 130, 58, -79, -92, -264, -250, -138, -202, -387, -422, -486, -356, -83, 79, 118, 81, 135, 260, 242, 78, 112, -27, -85, 42, 244, 237, 242, 60, 168, 281, 284, 191, 71, 98, 158, 265, 34, -217, -324, -323, -243, -88, -220, -177, -30, 36, -212]
70.83143b12j69J80Jj4N5P4q9q8QlL2J2J87P5o8L0J41j70m5Q5N9P5M8OL1k41j04K49N1j67J03L6
70.61778A68j95MO7r8KK9J84j16j77M9j7j4K07J22J35j22k09k15q8R3K34lk16j73O7k1J09K04J6
70.42417B6j50J06o5J1m0LK8O7j2K4o8n6n5q4m6J10m6J18J01L2J19J43j41q8q7j93l8J18J00n4
70.22388a17R3J40L6N3l6j56j03p0m1j03n5J00J65M5RJ51J40R8j85j99n1Q5J8J1Qn9pl5m1j8PO5
70.01024e2K10J6P0Lr8j83n1M4o8M0Q0q9m7j56j23R4O5R2Q3M5j5R0j2r9P7P8j35j90J3J12J52n6
69.79659a0K2N6R8k5j17j16Nj05n1L0N8J33J73J02j28j11l2P9o4j3J94Q3p1p8j78n6K8k2jP9j47
69.58963a85rM5K63J59n8j47k5j0o4N5n2Rkl3M0J15mn7J03P7j68j3J69J26J01m6q4j54r5m9jm3
69.37599c7q2j30OJ12m9M6J27j28%R7L2r8P1J06J52O1N2j53k15j01l8q9NJ41j9J98M5j13p7R4k1
$$ y = [-212, -381, -201, -200, -214, -159, -85, -174, -262, -254, -257, -225, -213, -26, 49, -19, 11, 152, -18, -63, 22, 81, 156, 204, 210, 241, 0, -104, 145, 196, 29, 132, 168, -27, -23, 44, -54, -52, -23, 161, 45, -132, -83, -100, -114, 93, 215, 350, 228, 19, -196, -284, -191, 43, 40, -176, -349, -282, -303, -194, 10, 26, -124, -18, -83, -72, -112, -109, -81, -14, -26, -2, -70, -126, -181, -265, -311, -201, -247, -129, -28, 4, 123, 266, 125, 37, -50, -243, -281, -163, -63, -117, -24, 116, 152, 205, 169, 13, -90, -160, -201, -304, -359, -259, -94, -49, -40, 111, 251, 349, 164, -35, -86, -1, 17, 28, 36, -23, -30, -65, -106, -124, -117, -52, 158, 174, 244, 247, 149, -34, -85, -41, -109, -69, 11, -78, -125, -281, -404, -310, -245, -153, -70, -25, -40, 50, 38, -61, 16, 94, -41, -231, -218, -106, 46, -10, 12, 68, 166, 141, 24, -92, -87, -192, -243, -213, -155, -22, 151, 253, 125, 14, -18, 61, -3, -16, 178, 261, 190, 112, -66, -122, -94, -116, -117, -38, -185, -194, -149, 114, 273, 215, 68, 43, 33, -31, 24, -28, -19, -21, -54, -14, 101, 97, 40, 143, 220, 52, 39, 208, 334, 435, 389, 305, 151, 56, 7, 6, -37, -119, -249, -243, -131, -180, -134, -7, -135, -135, -38, -6, -104, -33, 73, 225, 286, 338, 185, -30, -131, -169, -258, -253, -112, -131, 67, 112, -1, -78, 16, -5]
69.16902ep2j11%J10KK6R7Q5q3r6O2mPJ36K07r2j65k6J25J55Nn8j52K6j06l28j77R4L65K07p0
68.96205A64j97p0J85J22l6j80nj09q4L8J88lK6J38j38k63n4RK2J93l8j4J10P5J2q7N1j04M4J5
68.76176A0P4L1Q2p7M4q7Tj4P4J05L0p9q9K4j02ML6J30J0j33j23rN5m0TJ89m0o5kJ75N0k7k54m5
68.53477a90QL4O0J15mk3K3J4l1K3k01J0J22n6r1K7J26J95m8j68L7J24O7Q5j71j68M0k26j37M9
68.33448c55J22l2Q0J10q7j3J59Q8J39q2r5l9j1O6k3j43n4J14J59P8l9K1N5j83j79J00J82q3j81
68.14086a26j17q8oJ20K29j2M1J15N5j19q7n4l0l2j1N6j98j92qP2J22P7j3L6R3n7j16n8j5o8J44
67.93390b47N0o2J18L76k3mJ92J5j04j87o1J39lj25l3m3R7j43j24P2kJ90Q3j41n5j44r0q3m8N4
67.73361c36R6Q4J12J13P0k09p0l4J1J05p7N4j97q4K57J05J5J8l2jJ03J55J62p5n6o4j84m9MlL3
$$ y = [-5, -77, -188, -188, -78, -76, -50, 47, 132, 49, -47, 15, 11, 18, 154, 361, 269, 104, 78, 203, 358, 363, 305, 153, 179, 73, -255, -432, -338, 27, 234, 164, -33, -103, 82, 204, 168, -12, -17, -126, -210, -172, 16, 13, 39, 177, 39, -224, -278, -269, -247, -54, -92, -106, 4, 79, 91, 4, 55, -49, -5, 10, 84, 115, 197, 120, 164, 77, -10, -24, 50, 155, 185, 106, 17, 41, -61, -57, -21, 109, 119, -14, -137, -146, -91, -131, -171, 18, -22, -87, -89, 86, 136, 109, -145, -190, -182, -148, -88, 27, 23, 0, 23, 37, 6, 29, -172, -162, -40, -96, -187, -160, -34, 161, 113, -55, -18, 106, 173, 258, 87, -81, -41, -267, -404, -355, -233, -265, -185, -75, -162, -175, -16, 72, 211, 129, 34, -5, -16, 50, 27, -116, -170, -56, 103, 181, 142, 163, 218, 35, -144, -44, 138, 55, -126, -243, -331, -337, -217, 12, 0, 41, 156, 211, 92, 5, -49, -79, -111, -122, -66, -264, -456, -464, -392, -270, -193, -206, -170, -77, -134, -250, -308, -323, -391, -247, -197, -259, -141, 235, 212, 208, 400, 415, 311, 124, 63, 202, 199, 74, 41, -2, 95, -48, -172, -100, -102, 88, 171, 30, -25, -169, -259, -342, -390, -336, -240, -156, -44, 69, 139, -70, -140, -174, -163, -58, -135, -81, -278, -362, -105, 0, 15, 33, 1, 0, 103, 258, 420, 345, 289, 225, 41, -8, -4, -7, 26]
67.52664B6L4m5J6j23j12j45M5Q5k2P6J63J12o4q9L1K2m9p1kJ11m6j54L4Q4k1k25j08J61J47L7
67.32635i2k3QR0r0l5R5R6J2lqJ59J05k37k11J2P6Rk15lQ9J74oP2q4N8n3J8J46j10j2J19K5J03
67.10603B84j6j22N8Lj02o6p2p8K2M2J58j87r2N6oK3PJ17l6j09L6O3m6k3m7o9kN5N4K06J04K5q6
66.88571A54Mk4j14j64NJ86J25O9M2k36j48K5J80n8j54K6J53L7j01j00k3J27J21j01P1J23j60l4
66.69877C1M8m3R7kL2k8J4M3j76p7j6l6K9Q9L0k4lK93R4k29j57k6Rj61q3M1J10J01L9r7o0qL7
66.47845h9J32J4Oo3J84j55j39q0m8O3J6Q0o1p1O6Q7L0L7j1j5n0j69J1J01J26J01P4j19mk5L7o6
66.26481@p6m5P1K20l1j92j8L27oj5q4q8j55K3P1O2j72j12o6k2Q2J42J04J07L5j92j19J22K07o5
66.06452A15j24r9J57J51j9j46q8l8J16M4k0k07j8K76J21j84j65J52R1j06q5p9j44L9J37O9ol0
$$ y = [26, 60, 15, 31, -92, -204, -349, -304, -219, -241, -165, -2, 110, 46, -43, -12, 10, -39, -110, -112, -1, -47, -201, -167, -83, -104, -329, -437, -276, -129, -92, -115, -107, -17, -107, -142, -47, 49, 61, 58, 50, 209, 314, 77, -134, -122, -46, -37, -252, -255, -166, 8, 2, 74, -10, 48, -5, 13, 159, 49, 37, 156, 181, 284, 268, 146, 204, 207, 105, 39, -33, -111, -89, -47, 111, -76, -168, -112, -118, -95, -88, 29, -7, -116, -80, -17, -63, -86, -133, -202, -204, -149, -95, 111, 215, 240, 154, 158, 134, 20, -144, -139, 47, 172, 241, 283, 47, -101, -76, 104, 46, -108, -82, 71, 108, 7, -93, -116, 11, 132, 31, 102, 225, 65, 31, 79, 36, 133, 131, 163, 135, 149, 192, 16, -61, -77, -113, -84, 5, 35, 11, 8, 301, 395, 166, 9, -17, -8, -169, -252, -211, -101, 0, 39, -58, -118, -126, -89, 43, 57, 63, 0, 184, 29, -110, -190, -238, -175, -159, -79, -140, -211, -145, -58, -28, 9, -2, -17, -67, -236, -225, -124, 2, 103, 177, 58, 54, 29, 66, 0, -76, -121, -50, 170, 139, -53, -71, 256, 250, 235, 151, 63, -92, -69, 2, 64, -108, -220, -286, -308, -226, -84, 20, 127, 162, -30, -149, -27, 180, 115, -9, -108, 49, 200, 181, 35, -53, -91, 25, 69, 49, -158, -176, 100, 221, 37, -128, 24, 115, 9, -76, -155, -299, -260, -123, -54, -60, -90]
65.87758i0q8P3j96k9j12J00J38R3J16lm9J1j2Tj04q7O6o6n8l0K81L79o3j34j54p9q0M1jr5j05
65.67062c49K26J40l1k23R6Q0l9o3J47N5j17jN2l8n1M0L5J34R2j09j86j17J03R0R5n2n7L9p8Q1m
65.46365a0n2N3N6J5L0j1M6M8q0kP4r9L5r7l9J62J75j59k24k1K62J46j4j09jj29k74RQ3L38j5
65.25668A96j58j36J65O6k8o1q8j75j49k1J89m3J28Q5p0K1l1j2M3Q2j16nL3j7qR1Q7R9M7M4O5l9
65.04304B84n8l7P3JM6oj81Kk25k09L9J07O2P4O4p8j91l6J33J14j04j48l3k7k4K07J77Q0L5j07
64.84275C4j24n8J0k9j11M2L2J28%M3K6K8J80j8j78j72rj20J0K41k5j05J27O0J9L5r0p3k9o4K46
64.63579E6J89r2k51j58K68L6O6J04nk4M0Q9K3j22r7j22j29j3MJ9j7J07R4j4N1m6K8m8J0j8K5
64.42882E3j92j32K28Oo8K2K0J66m1J0Rj3N9k0n2r4q0m5r3j1M2J14o4p8L13L9l48j16K6O1L0J73
$$ y = [-90, -178, -105, -301, -330, -442, -342, -204, -111, 5, 2, -47, -36, -48, -60, -164, -251, -185, -251, -309, -339, -58, 321, 258, 124, -30, -109, -189, -148, -149, -244, -349, -123, 17, -14, -237, -141, -61, -100, -163, -16, 39, -78, -79, -27, -65, -116, -76, -41, 93, 185, 76, -110, -227, -124, -34, 61, 9, -48, -9, -87, -6, -10, -62, -9, 47, 62, 92, 81, 127, 175, 95, 93, 167, 68, 103, 6, -33, 129, 304, 145, -79, -100, 162, 308, 294, 185, 184, 55, -219, -210, -127, 211, 196, 38, -98, 67, 133, 105, 44, -44, -219, -368, -389, -200, -243, -115, -30, -100, -79, -110, -122, -79, 3, -113, -118, -85, -102, -110, -19, 68, 167, 214, 258, 323, 284, 226, 189, 262, 263, 309, 303, 122, 124, -101, -310, -271, -164, -102, -28, 36, -42, -233, -269, -136, -22, -126, -274, -307, -334, -358, -151, 26, 106, 141, 34, -90, -148, -138, -167, -278, -236, -204, -76, -76, -33, -7, 21, 201, 183, 5, -167, -176, -296, -286, -45, -70, -175, -48, 12, 31, 66, -24, -97, -126, -190, 56, 245, 153, -98, -256, 12, 48, 114, 218, 213, 189, 229, 318, 341, 219, 122, 0, -129, -142, -138, -119, -136, -29, 65, 51, 102, 56, 84, 36, 46, 28, 53, -139, -271, -43, -37, -105, -83, -63, 103, 62, 72, 81, 68, 127, 107, 55, -39, -119, -164, -257, -268, -226, -112, -176, -254, 59, 98, -250, -366, -340, -279, -249, -76]
64.21518g6R5k1k93j98J2R8K19K56l0TJ38q1j33j35m2R9O4j00R9j8RO4J34Q6r4N2J5M9J7j77o0
64.00821A8J4N7K5J3j1n2k53j22j6J35L6J90J20j16M8k7j06L7J0q2r3L2l6r2M3J58p8O3q0j61
63.80792c26J20K4j33%J7J27Q6l2J07L3k1n6L3k5j13lJ3j2PR4Q1k3n9l3p8n5k0J38K55%j63JJ97
63.58760A81P7j07k08P4j53O2J5j26L0K83J08k84k7l4m2J42J26j0oj34j37QO7O3R1m8j59O5N5
63.39399b8j34l4Mk0P0j01m4J67K04O2j46j96j62NJ16O9k3n9J22j06l0R1J39N6O8j70j1O1p5j18
63.19370b23Q2J41k0j46oN2l0j01Q5J3J44J32q7Q4J4j46j44k4Q5M0J60O3oj83k6j6r7q3m5J12N0
62.98673a26k32K9J51J86K5N6j51n3j67N2j6m9J51J6P5J18o4N3j01O4Q5j30p1J70J6j03j28J7k3
62.79312a50j9m0j5O0N9o4j22j9N7k0j14j05J67j72l38j29k09n08j020j432k649m624o142n808
$$ y = [-76, 19, -2, -295, -493, -481, -383, -164, 92, 62, 32, 170, 89, -44, -179, -221, -122, -58, -158, -59, -77, -68, -4, 130, 216, 122, 174, 189, 238, 255, 78, 18, 32, 89, 114, 127, 116, 64, -189, -311, -327, -192, -156, 34, 154, 38, 86, 59, -47, -10, 0, -82, -175, -143, -179, -271, -228, -70, -148, -85, -165, -326, -206, -182, -315, -315, -298, -171, -85, -117, -10, 23, 2, -54, -21, -46, -159, -162, -149, -161, -154, -60, 21, -2, -61, -94, -172, -227, -247, -109, 146, 146, -17, -16, 181, 258, 151, -57, 17, -136, -74, -59, -185, -155, 128, 236, -48, -75, -109, -151, -9, 117, 107, 101, -33, -170, -162, -95, -32, 59, 11, -148, -83, -28, -162, -196, -192, -212, -142, -243, -287, -120, 84, 146, 0, -196, -358, -353, -237, -168, -191, -250, -128, -234, -264, -173, -34, 22, 90, -80, -91, -30, -105, -223, -141, 0, -20, -166, -172, -120, -150, -251, -166, -153, -9, 123, 36, 120, 134, -12, -156, -180, -95, -55, 105, 168, 162, -21, -47, -63, -160, -243, -288, -176, -126, -358, -329, -178, 8, 33, 89, -62, -115, -282, -230, -246, -295, -144, -128, -53, 65, 1, 54, -47, 17, 102, -28, -99, 71, 87, -16, -144, -127, -150, -169, -209, -224, -164, -105, -169, -291, -310, -253, -273, -387, -492, -325, -497, -835, -964, -1173, -1681, -2701, -4133, -6782, -11406, -17548, -23356]
62.63288b3356J372P967N955L410J889R07L66L34L26L80Q4J29j58p8K11r5j64o0P0J14K59L06
62.48600A68j55j62r9Q4K02M0j52k64Q3J96QN4o4k03j18o8R1J00J51R4R7nl8k2p2K7o9p3%N7M5
62.27904f7P3J07L2o3O0k01r3j2J31Q0L1M5j37j20K8K7L5j00q6jJ48K40J02j35j28J50p5r4N2
62.08542B9K26p2r8m7K6J24O8j89N5J46R5j92o7J34N1j59k7l2q4M3Qj26J20o5j02Lj45rJ44M7
61.88513i5J36J44n7r9R4PL0M7j59k38n0K74R3M1rk13pN2R7J31j46k11m2J07K0K5N0o4K2K0J00
61.67817A00m9k38m2K16N0L6K1P8J3j10p8j35q5J45P3r9p7N5P4J29p5J53p6k68k6J59K65pj74k
61.47788B6K4M4qj82k5q5K3L0J53M4L3J25R6l2j20o3j26k3N8j19J9q2k3R6m5K7JJ24J93Q7j42j7
61.26423A11R8J7n5K7J58o2j14k08j91o9J57Q4r3k5K0q4J5jnn5P7R0j7j15j69J41K35J4M0Rj3K0
$$ y = [-23356, -21984, -14017, -8062, -4652, -2763, -1856, -1490, -1156, -830, -450, -366, -237, -395, -473, -262, -357, -521, -581, -511, -397, -138, 168, 13, -149, -248, -164, 38, 78, -74, -338, -255, -59, -51, 3, -61, -264, -382, -450, -359, -259, -108, -14, 83, 78, 40, 18, -54, -27, -96, -169, -169, -112, -67, 6, 113, 145, 82, 142, -59, -152, -164, -33, 47, 78, 123, -14, -134, -106, -79, -44, -144, -230, -231, -83, 157, 259, 124, -4, 146, 71, -23, 29, 255, 183, 85, 38, 64, 188, 256, 67, 122, 268, 363, 171, 104, 238, 289, 130, 103, 71, -13, 30, 38, -88, 32, -33, -135, -132, -277, -286, -142, -95, 41, 185, 128, 29, 123, 130, 160, 207, 48, -190, -240, 34, 127, 168, 159, -54, -61, -9, 88, 219, 73, -138, -180, -73, -53, -28, 22, -42, -20, 0, 100, 51, -187, -229, -13, 37, 73, 94, 172, 185, 75, -3, -138, -223, -78, -5, -104, -181, -126, -52, 77, 2, 155, 79, -189, -215, -56, 209, 202, 28, 26, 50, 94, 86, -96, -121, -206, -183, -153, 0, 44, 77, 202, 298, 266, 146, 83, -43, -66, -8, -127, -108, -190, -213, -117, -162, -135, -134, -10, 183, 270, 128, 111, 209, 226, 171, 198, 356, 294, 180, -28, -219, -288, -131, -47, -140, -165, -145, -229, -214, -215, -220, -275, -198, -108, -125, -240, -409, -268, -33, -19, 21, 30, 17, 37]
61.05059C7M2n9m0K0r0Jm5k13J3J41P5M7R7K5p6l7n6k4nm4o5j87mR3J04Q9m6k3p0J12J01L8R6l4
60.82360A3j05J53NQ4J94p8m1l5m0o9o6N7P8j90l8O5k5K8K10q1l7n8Q7Qk6j49j81k57o2J61K31
60.61663a64J13j5j6TP3J66Jj15m7K1j46o8j2mO1Q7m6M6J8j91J33O2lL4p8j4J78K8n2o0N6N9kj6
60.38963G1J0Kj60j10j3P3LJ18N8j21L5J71J12p1o4P6j43j51j58m4jJ55K5J41J94L6q3j51k5j39
60.18934a54r3K7LrJ86nJ7O7k5M6J19L6k2l7J4j08l0M1J34L0j95jj4K8r1J26Q7l2O9m5k0j00k05
59.96902a56J50o7r4K18J14P3kj58k58j9L6J94J53M6qq3n1j58j24qJ18K88j04j31p6p9L9J05j6
59.77541e8J9k3L2o9r8J51P2kJ0J28l8l6O4J5n1n5q7J09J13j84M9o9l3L8J03J07Q0j54j07K1l6
59.56844A1j17j70P2J91k7L3q0P9M8j14o3L8m8J41k4j00R3K5K99K8j38p5j00k1k5k1l4j36l5M
$$ y = [37, 79, 20, -20, 0, -90, -89, -134, -347, -334, -193, -118, -71, 26, 51, -25, -62, -118, -142, -147, -191, -256, -443, -447, -354, -250, -161, -207, -230, -300, -188, -87, -49, 47, 13, -92, 61, 66, 150, 344, 266, 225, 190, 150, 81, 15, 72, 150, -40, -78, -13, -38, -10, 200, 119, 82, 24, 111, 119, 93, -56, -237, -494, -556, -395, -164, -51, -66, -82, -98, -25, 141, 142, 27, -20, 1, -145, -213, -225, -229, -168, -81, -127, -81, -63, -254, -121, -59, -62, -28, -106, -120, 58, 86, 34, -26, 30, 89, 87, 71, 81, 83, -77, -187, -200, -127, -124, -6, 52, -69, -34, 137, 249, 178, 114, 190, 47, -104, -262, -306, -307, -152, -127, 14, 208, 244, 161, 10, -15, -154, -247, -220, -217, -226, -40, -45, -28, 39, 14, 60, 179, 215, 193, 156, 170, 62, 32, 73, 207, 237, 42, 41, 27, 55, -36, 90, 177, 145, 214, 169, 149, 49, -156, -6, -73, -167, 51, 165, 238, 236, 78, -180, -199, -163, 31, 184, 230, 222, 139, 88, -70, -194, -202, -84, 204, 100, -31, -107, -186, -147, -42, -58, -39, -62, -30, -99, -197, -46, 26, 24, 34, 162, 124, 88, 152, 167, 116, 61, -26, 83, 196, 12, 61, -8, -41, -3, 100, 207, 287, 133, 26, 47, 11, -106, -276, -204, -13, -40, -7, -87, -8, 40, -74, -137, -99, -147, -6, -30, -130, -37, -12, 287, 315, 177, 102, 2, -19, -44, -65, -99, -235, -270, -266]
59.36815b66J48K37L4r1j20P6LnJ48Q6j39j52o8o4%O3mJ0J09Q5j16M9J02J7Q9k58j40J20K0m4O3
59.16119hP8p7o4O4R9m1n5j5K0j51k14J66J60k1K8r1p4P5L7m8J10J07j57M1J79k0k20j40K60K22
58.96090B50O6j14j39l0K41o4k65jJ26J17Mn7l2l0J21Q0o2J8M2o9Mk27m0L2j8M4p6k18m1K53J86
58.75393A01J3J79l2k9O5R6j75m1r9j34j04m2j3j63k5n0J39J75K9J54O9p0j55j21K1l3K53Q1q3
58.56032Fk2k0P4R8p0q1P4qk42l8J37J34p2O9M4J42Q4o7j02p1j85o6J80Nr8J44O0l7p2J6j68J1
58.34667a41k7K1J82j48k27r6j3K24J02j28j85J2Q9N0Q4j0J59K02j13k0K2k6L8k4mj24m2O4k6
58.15306a05j95O5K8O1L1l4o6j5M8J66o0L8J68j91k8M4O2q7j7j75j64M1J36n7j02N3K29N8M3j07
57.95277a32pL3M4m1jJ62P8j21k17m4N7o3R5J55Tl7J3K4j32J39j44k15O3J45J19O5J28j1o3j03
$$ y = [-266, -118, 119, 153, 62, -58, 18, 21, 16, 164, 250, 111, -41, -109, -173, -173, -110, -114, -104, 5, 90, -26, 23, 125, 142, 231, -27, -167, -47, -27, -71, -8, 70, -7, -71, -7, 92, 51, -4, -19, 1, -150, -364, -198, -38, -59, -31, -122, -196, -121, -84, -132, -22, 85, -72, -31, 148, 128, -92, -232, 28, 250, 316, 202, 63, 33, 274, 210, -55, -56, 70, 187, 191, 134, 102, 72, 193, 273, 211, 229, 271, 202, 206, -21, -61, -29, -47, -3, -79, -297, -338, -85, 101, 114, 293, 261, 232, 297, 393, 218, 177, 78, -56, -160, -202, -215, -378, -403, -453, -314, -139, -110, 44, 113, 43, -112, -233, -212, -245, 8, 89, 6, -16, -36, 38, 136, 66, -15, 59, 51, -191, -229, -92, 42, -30, 39, 83, 225, 309, 242, 140, 69, -116, -182, -2, 3, -95, 49, 109, 72, 0, 16, -152, -141, -168, -147, 35, -113, -340, -436, -449, -225, -123, -251, -436, -424, -335, -285, -201, -211, -52, 150, 37, 17, 39, 13, 51, 27, 23, -101, -143, -79, -105, -300, -235, -207, -146, -115, -149, -215, -230, -182, -16, -76, -38, 130, -61, -89, -45, 17, -70, -87, -262, -426, -385, -249, -306, -408, -355, -126, -68, -25, -132, -139, -106, -62, -103, -104, 58, 136, 15, -202, -246, -189, -252, -157, -2, 153, 116, 129, 153, 21, 160, 16, -199, -136, 9, 128, 193, 321, 310, 247, 144]
57.75248A44k22k2M5J61o1r4M1O9q0j49J61L7r6M5mj3K9MTn9m0K2j4J12j46l0J07r5j50j18P9
57.54551c33K84k0K3M1L9J3r3j55RJ12Q8j73r7J09P3j9J0K5l1K4J5j32k4qJ10J16j50L7l3p0jL7
57.33187a74N8q9j23N8J74P8RJ31K8o8P8rp3o6j5r8M0J33p8j68P7O5K2J14o7J46o0k09K9r9j53
57.12490c09J61mr0J13R2jJ49m4r5nJ3j2q5j27q7J40NK2J01n6j5pr9P4lJ47j3m3P8o6o0L3Jj04
56.89791a96K1R4oP8Ln0m6j29qJ22N6r5R8J88L6k00j35O8k1j95N5M9P8o3J9j07rJ51R8M6q9M5k6
56.67759g0k03p7K53K38o5j10n7j04r0J11J47O0j67p0K31K44QK1r4k11k03O2L5q0L8n8k0K5j14
56.48398c20o1O2M0R7N9j4l7J8j0K3J43O7n6o6j21m0%l4O5J19M7n7Kk41p9n7J54J70O9J16m2j72
56.27033a56RO4Q3j14j48L3P9j00l9J01J88O3j34K9J81m9j30r7N6K10rj66p5Q5K7n2o5P2L2R3
$$ y = [144, -78, -100, -55, 106, 45, -49, -8, 61, -19, -168, -7, 30, -66, -21, -25, -38, -9, -5, -1, -60, -100, -78, -92, 20, -126, -156, -49, -144, -294, -412, -333, -49, -69, -46, -5, 34, 47, -46, -201, -192, -80, 8, -165, -262, -153, -80, -99, -89, -64, -95, -71, -56, -188, -212, -220, -110, 6, -144, -107, -140, -210, -211, -174, -116, -205, -328, -270, -96, -18, -9, 122, 150, 82, 160, 151, 78, 12, -3, -101, -61, 72, -6, -174, -97, -32, -10, 104, 37, 183, 123, -86, -57, -156, -309, -148, -152, -242, -129, -37, -38, 111, 67, -28, -33, -20, -32, -117, -244, -331, -191, -186, -164, -63, -119, -134, -141, -240, -166, -169, -22, -35, -78, 0, -66, -126, -93, -92, -196, -175, -81, -87, -9, -6, -56, -102, -231, -239, -117, -61, -156, -58, 130, 166, -34, -169, -101, -122, -317, -262, -213, -135, -198, -179, -286, -295, -144, -46, 0, -89, -44, -70, -273, -350, -97, 141, 76, -34, -91, -195, -285, -174, -27, 33, -134, -204, 27, 271, 279, 300, 206, -5, -208, -146, -111, -191, -153, -211, -231, -206, -320, -381, -319, -279, -182, -123, -137, -174, -156, -166, -143, 0, 67, 11, -55, -176, -216, -216, -250, -185, -66, -19, -76, -74, -315, -394, -451, -297, -127, -58, 58, 16, -156, -147, -83, 0, -114, -262, -229, -150, -250, -289, -188, 0, 63, -71, -42, 139, 90, -40, -137, -81, 129, 120, -46, -121, -36, -9, -61, -126, -54, -22, 71]
56.07004G1J34O2q4k3j48k07J50J82K8j14p3j33K1lJkJ8J7K23J34J2r2K5M0n6j03n8K6J07q0q8
55.86308a3j47q0J08J29P2M0j08r6j4p8L9o1j0j37k4J72K11R4j07m6K3j94r6Q0OQ2N2J43M3j8q3
55.65611a8o2q5p0L5P8k9j47r0J44Q4r0o3J27J49J08R0j3l02k77r6N1K30J25J40J53J45J72n2k58
55.46250A79k47J5KO7K09M7j73L2P4O9J32j05m3Lr4j47n4Jp0p7J1N0K7j6l0o1P9J88L6j33O3J71
55.24885B05k06o8l2r5Q7J09Q8J22K49o7j59j65j62m4J04n3n1K3m5q3k3j4O8P1O4Lmj17j4J74J01
55.04189F6o0j93L2j9J13K17r7j71oJ09Lo2M7k4n1K0R0k9M4j45J22P1j90M3r3nPm2j72R7J96Rj00
54.82157a73J28O1m8j8l7kK7q5l2j37R9K00j2j5n8j30%O4L7N7K3j02J05J91M8p8mjo3j0p1OJ22L5
54.59457A27J10j57o1j3j42r9K48K58q7j40j59k9M6O4q7R1P0n4pNq1p7N4M7o7k44M6R5j6n4O8K12
$$ y = [71, 205, 267, 183, 160, 12, -195, -45, 137, 165, 51, -22, -155, -134, -137, -136, -138, -120, -103, 120, 254, 266, 174, 199, 239, 183, 80, 22, 48, 155, 75, -13, -160, -240, -132, -3, 69, 109, 1, -95, -109, -187, -148, -209, -219, -356, -380, -208, 3, 97, -10, -56, -33, -227, -323, -243, -237, -155, -103, 40, 83, 65, -18, -80, -165, -235, -200, -122, -151, -298, -388, -244, -160, -250, -313, -186, -37, 71, 161, 148, -154, -431, -527, -476, -246, -121, 19, 172, 317, 489, 437, 179, -68, -53, -51, 16, 225, 272, 99, 131, 205, 274, 406, 301, 258, 261, 167, 20, -34, -33, -103, -180, -169, -119, -92, -108, -138, -199, -120, 68, 104, -29, 34, 205, -1, -69, -101, -196, -109, 0, 88, 210, 459, 392, 233, 68, -94, -138, -34, -87, -138, -115, -160, -243, -266, -280, -212, -141, -77, -74, -78, -195, -209, -35, 66, 6, -187, -155, -174, -61, 156, 59, -112, -118, -9, -6, -68, -21, -45, -96, -76, 14, -15, 29, -116, 6, 77, -113, -70, -163, -168, -161, -203, -375, -278, -82, -73, -173, -45, 16, -32, -50, -87, -89, -62, -147, -179, -316, -217, -17, -29, -44, -102, -232, -232, -168, -131, -74, -51, -153, -48, 143, 191, 113, 109, 108, 45, 35, -36, -30, 92, 127, 237, 80, 19, 6, -136, -235, 13, 271, 184, 44, -115, -144, -98, -34, -121, -30, 40, -14, -21, -16, -97, -174, -120, -73, -140, -384, -338, -243, -259, -313, -245, -33]
54.38093c3J50R8j9PL5j18J1j68j05m8J4M8J11J98l2Mk7j09Ko1lP7N7O3j84j8P1L1J3J80jLj04O1
54.15393B04j14o5J32k02j06J29J39J7J5j61j25J8L0q7P0j06p3J27J17N2oM1p7PJ6Rq6L4J4km5q1
53.94029a65j0J03O7j21j4J41Oj2L2m2j77j7O3J59Q3P5m7m4Q7Mj25o5Lj96j48J65K00K91P2p6r3
53.73332A99J02n1k05j45J52J69l9pQ2o0j94Nm5Q6J28L4M5q4o0m6P6P1Lj26j08j06N1M2j06n7N1
53.52636a43q8r4l1Q7K0J20P7J05j06jm6p1K0P5l3n4L7J99q9j65o9J30Nj06J60O9p2o7l8KrQ1J38
53.30604D3k7j1J02k8r6L3l2k05K5J10J04m2K56N0j06j68LJ26r0O4j42j86L0K17J87Lj45l31k25
53.11243d81l4L5K37O8J5rJ77J18l9j12lk3N2J76K6m0r3L1O3m6L5LP4J29k0j91j02j47rj46K5L3
52.89878a98L5P9j5q5J97N6r5j55%J1k1J51J91j4n7q3k1l0m7r1p8j5J32O3J25%l0rj30j04O9O5N3
$$ y = [-33, 117, 215, 196, 203, 238, 120, 131, -37, -142, -190, -176, -128, -17, 181, 149, 153, 126, 17, 19, -42, -45, 32, 89, 152, -32, -50, 21, 52, 65, 245, 244, 247, 143, 204, 90, 25, 157, -45, -151, -22, 117, 134, 149, -12, -137, -119, -89, -176, -106, -212, -285, -158, -41, 11, 5, 46, -31, -24, -8, 1, -85, -51, -37, -39, -84, -165, -175, -72, -5, -126, -140, 1, 7, -5, 27, -15, -192, -209, -146, 13, 96, 171, 124, 80, 167, 171, 46, -19, -16, -212, -360, -195, 5, 296, 368, 292, 199, 301, 250, 45, -100, 52, 221, 182, 175, 257, 197, 3, 8, -37, 49, 177, 211, 256, 172, 112, 66, 142, 213, 216, 90, -18, -124, -73, -31, -137, -194, -143, -231, -325, -356, -269, -249, -129, -52, 53, -53, -54, -100, -171, -151, -76, -109, -163, -126, 73, -16, -181, -250, -120, -115, -221, -61, 8, -64, -131, -169, -167, -176, -95, 43, 16, 5, 107, 79, -17, 16, -16, -221, -196, -86, 18, -24, 232, 282, 176, 8, 11, 137, 47, 111, -31, -217, -187, 30, 217, 220, 75, -256, -481, -515, -480, -243, -175, -160, -169, 8, 126, 87, -25, -28, -51, 1, 177, 203, 163, 70, 101, 164, 118, 153, 156, 230, 359, 339, 148, 46, -101, -110, -256, -231, -198, -163, -84, -99, -184, 13, 69, -26, -181, -181, -170, -191, -40, 151, 137, 80, -3, -24, -54, -101, -192, -270, -285, -153, -90, 35, 35, 5, -4, -134, -238, -169, -104, -51]
52.67846e1m7L8QJ58J6j34j12o3N7Q7J03k6j08n2J70K3q3p0n9J4Mr0K3k9P0Q6K6j38m4P2Q2j4l6
52.45814a19K8J13M1N0l5k9j7R8R3jk42q2j10p1J71J54o5j2l6p0j6k8p9K44M3j54k69J33J25M6N
52.25118i1j58L6j63o9P5qmL40N3j41q3qJ08P9Q1j19N7rJ32J01O2n6j67k33k48j34M5K54Q9J06
52.05089g3J50J52Q5k30TK28K29P0n8qj38l13O4L4j84q6N9N8J42jp6j34J89L4o4J11J28J07j00l6
51.85060A09j14j88l8J58k4J24lP5j4j56p1m3Q2TJ2j12m7Pl5N7k4o7j19J97J63M2K8P3N6j37j38
51.64363f5p6l9r6J44J63K5m0j10n6N4k9L6K44J63L5j07j2J39M0j49j88r4Kj00L5J05k0o4J19J46
51.44334B05J0n8j42j32Q5K4Q4J05M6j26j23j72J35K21M5o3P4Mj55j71K7K03M6r0qL9p0j67R0l1
51.24305f5j93P5J09J00n5p7pK5PJ01K9k1Lk8k4L1j18j59n6r5o9J10J02J50J41j61j60Mj6j52K19
$$ y = [-51, -98, -60, -52, 106, 122, -12, -124, -187, -130, -43, 60, 34, -74, -126, 44, 67, -16, -86, -145, -131, -127, -217, -194, -223, -153, -67, -41, -179, -223, -151, -69, -83, -119, -91, 22, 63, 113, 78, 49, 32, 130, 223, 222, -20, -102, -212, -283, -112, 42, -23, -35, -71, -141, -157, -185, -264, -20, 23, -131, -400, -267, -142, -96, -91, -249, -213, -376, -445, -370, -378, -382, -42, 11, -130, -213, -221, -113, -34, 47, -72, -15, -24, 108, 209, 271, 215, 48, -185, -433, -567, -522, -268, -179, -73, 77, 229, 314, 84, -146, 82, 311, 381, 323, 315, 177, -136, -72, -38, -222, -308, -249, -191, -49, -50, -126, -260, -71, -37, -101, 10, 138, 245, 145, 109, -5, -193, -231, -73, -97, 27, 24, 99, 85, -71, -142, -185, -103, -21, -9, -121, -168, -161, -196, -139, -163, -230, -349, -152, 11, 53, 81, 154, 210, 73, -65, -141, -180, -276, -132, 31, 56, 16, -94, -150, -96, -125, -89, 155, 318, 353, 246, 234, 373, 413, 264, 76, -18, -16, -116, -81, 24, 4, -60, 59, 205, 215, 157, 15, -117, -32, -8, 76, 181, 227, 101, -22, -194, -59, 162, 207, 144, 218, 222, 67, -104, -77, 126, 172, 82, 74, 113, 43, -124, -34, -65, -258, -183, -74, 26, -29, -106, -113, -88, -81, 20, 49, 28, 31, 3, -21, 10, -108, -267, -323, -418, -487, -377, -275, -125, 16, -145, -305, -301, -317, -469, -250]
51.03608b50J96J29n4j36m1R6J50kj5j2J27j7O8m0P0L9o2j10ll2q6rJ52J19M7r5j26J0%j9o7n4
50.82244b7j30l2J00R5ok4j25n0M2J44J22K8K1j15p0R9J74K9q4k66j39n3k0o6O6J34P4O9PJ17J60
50.61547B74J02j31j66m8j26O8L4k4j12rK6K2k05j24K21L14K55pj96k13j99P7K02PK15J08n3K5M2
50.42186C79j03l33k8o3P7K35m8J5P6J5P3J79j57j70j1l2k4R9N2l0MJ6qj55L3j67j42Q1j35Q9J43
50.21489d0O4J35o9L5l2J3J9o6K8J01L7P5r2p1m3k1m1l1o3j82j06P6J73p3R6J20m7K8j11QJ30J9
50.00125F9N7J9qJ48q7O2Q7K7Op3j01R%j26r3l0Nl3O2L3J44R6o7j25k45n4J48J03J46m5j12qk1
49.78093gJ66P7j56r3K8MO3r1O7L8J43J22j31m0O8j2l3k4j02j86q4J13J52j88N7J08Q9l6J38j55
49.58064I5j13J46K12l6j93j03J48R5p1m4j06J5P0j72Mk9kO7k0lJ27MK8n4q5n7n8J4pN6P0L2K10
$$ y = [-250, -54, 75, 21, -115, -156, -60, 90, 88, 73, 61, 188, 171, 239, 199, 269, 308, 246, 136, 133, 101, 15, 6, 158, 277, 324, 229, 103, 113, 113, 94, 27, -27, -157, -189, -89, 6, 0, -24, -149, -199, -157, -13, 109, 137, 158, 43, -27, 72, 246, 275, 191, -75, -214, -267, -287, -353, -287, -153, -79, -10, -3, 114, 274, 376, 245, 79, 31, -95, -27, 7, -17, -129, -138, -112, -90, -295, -419, -198, 116, 371, 364, 168, -45, -244, -167, 35, 42, 257, 365, 312, 337, 379, 276, -57, -85, -148, -71, 164, 116, 131, 207, 222, 295, 474, 317, 147, 136, 104, 80, 179, 231, 201, 205, 221, 213, 58, 91, -76, -218, -137, -272, -183, -40, 24, 159, 90, 125, 93, 106, 125, 59, 87, 188, 225, 300, 208, 137, 94, 73, 32, 1, -62, -244, -350, -274, -101, -174, -78, 42, -5, 23, -88, -80, 50, 69, 126, 145, 137, 285, 198, 260, 347, 374, 380, 307, 206, 215, 215, 89, -4, -34, -29, -62, 0, 33, 177, 273, 206, 81, -164, -218, -70, 33, 179, 134, 22, 14, -7, 159, 236, 80, -13, 15, 19, 82, -9, 58, 96, 239, 361, 230, 190, 258, 246, 213, 189, 87, -99, -183, -70, 82, -106, -49, 59, 148, 112, 250, 95, -18, 128, 340, 304, 111, 8, 156, 251, 180, 136, 30, 45, 115, -57, -53, -82, -84, -17, -37, -40, 87, 91, 119, 65, -20, -77, -135, -121, -128, -72, -2, 30, 240]
49.36032B40R3j35j21jk7q8r7N3Q7N7O0K2LJ9j23j54MQ4J5j6M0J79K49m3q6j06jl4k12p1K8K6K1
49.14000c5m6k51q5Q1J66OQ3K0MJ0p4o7L5J3J02p7k42K86J64j55r6O8M6j14K0n0O1O0K7k3m8OJ33
48.91969B8rq9J12M8l23l0K74N7M2k0n5qJ77J1K57l9k42k98n4J48j38j25J78O1O4J64J37k05j34
48.72607a1N8K07j28j33r0j64J6P1K8o8M0k5LM4n5j1l4K09J52l5K3P0n1l5J15j39j27M4O9P0J2j2
48.51243A13j76k1L5J36l0oQ1m9j11o6j03o5j28J43P3l1J25q4O0K8O9o2r6J81N4o7p4k9j17j0J52
48.30546g5o7k8P0j79J01J14K20J84m8j10j35J23R2J01j52k22j44k9O8O3J92Lj39j70q4qL9l4J27
48.11185a27J7j11M5J11j26n7r4m%J54lj52P0Q3q8j7N1k2K7J09N6l0n2J88j18l4K07o1O1L0N2k4
47.89821A41j12R7l8j40n9N8J28j4k18p9J10Kj26J3N6Q1mO5O9k5j8J62q6J7R0R2j35j57J1k2M3p6
$$ y = [240, 333, 198, 77, 76, 49, -39, -136, -83, 4, 61, 121, 143, 146, 165, 42, -112, -108, -24, -9, -25, 15, 194, 443, 400, 314, 208, 207, 173, -39, -110, -82, -56, -35, -81, -332, -417, -336, -170, -164, -81, -61, -57, -47, -121, -188, -153, -140, -38, -115, -357, -71, 93, -62, -158, -90, -44, -158, -138, -188, -127, -67, -40, -63, -111, -105, 28, 19, -70, 42, 90, -233, -263, 11, 68, 110, 90, 35, 27, 204, 215, 472, 433, 191, -107, -161, -13, -151, -276, -98, -37, 27, 191, 328, 123, -11, 47, 254, 126, -7, -97, -261, -245, -174, -146, -214, -174, -199, -196, -152, -207, -218, -252, -43, 109, 74, 97, 167, 116, 81, 196, 57, -70, -26, 43, 113, 125, 113, -63, -84, -49, 87, 57, 51, 132, 83, -28, -94, -197, -262, -390, -247, -174, -205, -80, -164, -104, -76, -7, -69, -165, 16, 70, 3, -71, -100, -217, -227, -75, -142, -170, -100, -279, -178, -64, 156, 340, 292, 182, 47, 170, 262, 363, 211, -11, -155, -184, -116, -53, 139, 142, 3, -167, -251, -259, -220, -254, -127, -110, -221, -176, -65, -191, -248, -342, -346, -346, -192, -195, -347, -277, -194, -282, -299, -248, -270, -243, -134, -78, -108, -160, 28, -90, -124, 83, 22, 83, 113, 165, 141, 29, 126, 88, -52, -111, -53, 75, 61, -157, -236, -126, -124, -250, -237, -181, -100, -104, -39, 30, 5, -13, 149, 63, 80, 170, 262, 127, -30, -19, -41, 2, -74]
47.68456g4jM8J55J64M9j33Qo3j33j28J25j02k99J40J94j0l6j46j9J11k9k0r8k1J38J79O2k25j4
47.49095a78n9P4j26q1K29K51m5k0k2n2L7K1M2j74j53O7K15K1R1p2q9O0k9P2P3j10p3j7R2K9L09
47.28398C83j14j72j8O9L8j45j52o1o8L3l7J23Pl5j73M3J80j03j60J30K2N2J09P5k9j0R7j04j33
47.09037a53O1j14K8K24Q5M3r3k88q7k8j64Q4L42J20m7J4m6J54j07o5n0L0Kk52M5J34P7p9M8J16J
46.88340C5j0p0P0N1N5Nk2Q6O8j40j75Q3N9M6n8l8n3o8J18O9q8m7j40q3J49J58q3k3K0J40Pj6Q8
46.66308A93n8l19R1P8J6K17J09j15j39r1J23l9mj3m2o3J09lk6O4nL1q1J08m6k08r7P0J48P6R6
46.45612A80j23o1qq5l7p8J27o8j76J59L5rm3K06J07PJ18Q7Q5J56n1j27o3n4j84l6k9R7K7j25j01
46.24915f7P3L0k2L8P8r2j22n9J1j1k02K2K84k7K7J35J1M3m8l7K1j11R2O2n8n1O2J8J45K4k05p9
$$ y = [-74, -75, -27, 128, 292, 341, 208, 216, 153, 20, -108, 17, -85, -384, -244, -50, -60, -96, -242, -261, -150, -179, -199, -297, -318, -180, -1, 61, -164, -178, -237, -163, -289, -370, -141, 110, 65, 45, 23, -29, 8, 29, 71, -103, -256, -189, 26, 47, 138, 66, -23, 37, 8, 80, 153, 43, -30, -47, 45, 74, 383, 269, 97, 79, 148, 186, 41, -111, -172, -240, -207, -244, -121, -114, -149, -322, -279, -99, -202, -362, -232, -210, -158, -49, 26, -3, -13, 84, -20, -153, -92, -206, -178, 46, 131, 174, 81, -207, -294, -322, -486, -402, -60, 60, 13, 27, -19, 135, 28, -37, -87, -57, -55, -307, -262, -128, -51, -130, -82, 34, 35, 25, -45, 25, 76, 131, 136, 114, 200, 268, 128, -47, 36, 95, 141, 83, 45, -8, -76, 42, 111, 23, -24, -164, -247, -98, 60, -23, -46, -26, 114, 121, 105, 193, 135, -184, -93, -15, 1, 218, 327, 212, 73, -18, 105, 66, 62, 49, 7, -56, 53, 50, 24, 88, 83, 114, 33, 141, 95, -113, -210, -140, 8, 84, 180, 57, -4, -12, -97, -134, -212, -85, -153, -329, -170, -135, -144, -187, 19, 126, 133, 251, 338, 423, 579, 528, 401, 338, 284, 100, 64, 35, 132, 159, 34, -67, 6, 36, 14, 52, 130, 38, -84, -143, -132, -143, -345, -323, -39, -66, -39, 96, 107, 150, 102, 65, 86, -25, 67, 129, 71, 20, 82, 100, 245, 269, 64, -15]
46.03551a5l8R9O9j74p0N1L7O9j9n4l6J62P1J24o3j82M1k2K6P4Q1J13j21qp8j61j0mN3l0L0k9q6
45.81519a00L8J19O2J24J54q0j89k38J0L3o4LK12n9j1K27J63k9k74j08R9J17j8j0p2MJ43j25r4
45.62157C7j38J33J22r6n3j00R8J1k6l4j14M3Q4m7p3n2P3P5K4O8j5o0j27O8l5mK5j1J37l4j01j5
45.40793a37o5kN4J86o2q2M9Q6j7r3m3q1j24J99J12l0k09j40J97J66K9m9j16M4k7m4j9o0m8o7M2
45.20096c51N2N7Q3J8p3k1pK4P4Q8j09P6P1mk5J23Nj56k35J00L1ON9p9R3N6k3o2M3j08O4R0O4J84
44.97397B08r0j55O8J70n8J20Q1r0m0mM6j42O3n1r9r8R6M7q6l2n8L9j3J4N9P3J92K6j10k02j37O5
44.76033i8L1J26O4k3L8J00j04k4O8K06k5j59K1l8k2j04m6N7J60K07L6o7J49j22j05M9j51j60Kk
44.56004F4j14J13m7J2p5l8J8j09To0Q8Q1P2J61J08N5p2j85k42j20J8K48J60J23M6R9j9qn9qj93
$$ y = [-15, -53, 46, 115, -59, -129, -78, -41, 28, 9, -45, -81, 81, 152, 276, 213, 31, 72, 50, 76, 150, 231, 344, 223, 215, 137, -24, -34, -38, 15, -15, 15, -14, -100, -62, 57, 119, 243, 397, 317, 128, -110, -100, -67, -131, -128, 84, 25, 14, 241, 404, 375, 101, -7, 92, 209, 191, 181, 109, 113, 256, 131, 37, -101, 32, 154, 58, 5, -95, 3, 14, -12, -46, -160, -117, -33, -80, -153, -205, -132, -57, -33, 35, 20, -40, -167, -99, -134, -138, -113, -124, 13, -21, -122, -137, -202, -204, -150, 36, -26, -108, -59, 27, 10, -83, -126, -207, -331, -132, -20, -50, -259, -399, -202, -36, -7, -56, -172, -128, -155, -199, -218, -278, -326, -393, -351, -299, -242, -159, -141, -214, -235, -242, -218, -144, -56, -165, -89, -18, -22, -47, 76, 81, -75, -310, -210, -179, -173, -114, -193, -100, -44, -67, -129, -86, -194, -130, -40, 24, 208, 118, -37, 31, 201, 143, 263, 344, 254, 214, 210, 256, 114, 177, 126, 27, -71, 25, 72, -14, -46, -104, -65, -78, -64, -5, 68, 260, 286, 176, -26, -163, -98, -67, 59, 123, 100, 138, 238, 134, 110, 178, 384, 359, 200, 221, 183, 161, 57, 11, 68, 228, 435, 471, 404, 553, 431, 326, 375, 224, 64, 66, 64, -50, 63, 16, 28, -47, -85, -67, -176, -285, -345, -257, -176, -104, 57, 165, 220, 148, -37, -279, -399, -381, -133, 27, 150, 196, 295, 276, 268, 209, 201, 8]
44.35307Hk09NK41j98j63J15Tk5N7J18N2o3np5jO1K08k2J8o2p3j0N5j26m6P4J5O9kj48J3p9M2J07
44.12607F6K15l2o7l4OM2r4j13p8J9K17r3M9K11R3m8j28l6j74j62L9R5J56N5l1o6JK08p3j17j66
43.91911d0k14J37M2J39Q2J44J14M8l5j34k8R8k6j02j67k64MN6J40J11p3o2N6J91q2J07K04q8j60
43.72549A98j53n4n3kL8l0n5j38Q2J46m5J37J41r0l9M3P6P5nr5k4q2n1J23L0l2j2l5kPLj82k61q3
43.49850d24K3J9J90R7n6J7J91J22p6j89n4l3o9R9K02J3j9p7j04L5J55M0j08j41L3M0o7J62P3l1
43.29821F3o2Q9q0K3L3J14Pq5K9N3p7M3m0j65L7l8k0N3R1m2k04P2L8K7Mr3J04Pj08l4J2K1M5J9P2
43.06454HJ09P3kn0j63r0o7J76K21l0N1q8l46Q3J01j03N0M1J70Q1j3J13k5j19J69oO0J79k84m73
42.86425a74j1J59l9j39N7j4N3P9K9j63j4j58l6O6K29N7L4j91MN4P3P5l0J15m5l52l4K43L5j59
$$ y = [8, -201, -196, 45, -153, -316, -201, -86, -111, -54, 64, 116, 53, 48, -27, -28, 33, 241, 219, 237, 175, 102, 92, 147, 21, -25, 49, 64, 133, 131, -17, -4, -83, -41, 66, 281, 249, 182, 148, 154, 196, 102, -11, -89, -70, 147, 54, 103, 314, 407, 359, 231, 195, 21, -141, -102, -7, 149, 204, 173, 107, 108, 316, 243, 126, -40, -254, -117, -75, 64, 146, 290, 404, 452, 417, 283, 255, 353, 327, 225, 58, -206, -202, -146, -6, 105, 32, -30, 26, 217, 135, 242, 446, 358, 198, 45, -9, -62, -64, -26, -56, -111, -249, -167, -21, -66, 71, 212, 122, 83, 126, 202, 277, 272, 177, 153, 71, 20, 143, 173, 141, 129, 94, 92, 99, 102, -80, -341, -424, -401, -382, -192, -95, -151, -134, 57, 179, 103, -86, -140, -173, -242, -143, 59, 72, 53, -24, -128, -93, 62, 102, -6, -147, -114, -74, -141, 21, 94, 63, 1, 90, 10, 33, 66, 180, 187, 102, 131, 184, 107, 150, 110, -55, -18, -56, -76, -23, 68, 26, -178, -106, -68, -41, -37, -130, -26, -19, -127, -161, -149, -128, -83, -64, 8, 117, 190, 188, 138, -25, -115, -182, -6, 215, 185, 236, 148, -198, -115, -14, -117, -67, -26, 144, 225, 212, 325, 300, 181, 350, 344, 404, 583, 299, -174, -185, -26, -65, -204, -147, -161, -108, -29, 0, -163, -177, -335, -371, -305, -76, -19, 15, -176, -172, -118, -45, 30, 0, 115, 70, -282, -316, -73, -38, -197]
42.66396a97J11J67M1M7J44J4O7Qr1j38j07r2r3J31M8J02O3j16l0j1q0j22J35J02j65K0KJ31l2l8
42.46367B1M0O3K8n1k7J5j5j08l0n0Q7R8n7o8j44J22K78J18k09n6j64j5K07Q2j09j36j14N8J33
42.27005cj00j87J28J3p6k12j13J18J78K75K09l2q3K5Q7mo3J05J08M9q3l18j22J02J66K5j07Nl0
42.07644F0L2r1l8P0J08P0j30k78j7K9N5n3n4N9J0J77M8M1l9j33R8L5j12J16K7j14m9N8p7M7k0
41.86947f5J44J73M5j09R6J41j97j92q0K2Tq4O4J98j10k5l3L2j18J28K1j06mJ67J60o5k58m4nrj7
41.66251a08Q7l4j6J40p9m9k0q2q0k2K16J75m5j69l5R1m2j43L0K36p0L7n0k36JJ04K03J1j16j34
41.46222a99P5J20K83J54j06K3J27j66k14j60Jl6P9r1oj08M5M8p0J27N7P4QP0K84j8j51j24K7m9
41.26192A04k2J31l1j19K4M6j05j20J09P5j57J33K42p6j30k5J54L8k66k04N2O7NJ42K20M4k2L9k7
$$ y = [-197, -86, 81, 122, 169, 313, 327, 394, 402, 311, 173, 66, -26, -119, 12, 60, 162, 225, 109, 79, 68, -12, -134, 1, 103, -62, -42, -40, 91, 59, 21, 61, 124, 152, 101, 74, 89, 74, -34, -64, -114, -27, 71, 14, -54, -198, -76, 202, 320, 111, 55, -109, -124, 83, 165, 56, -80, -194, -136, -3, -103, -290, -162, -149, -225, -437, -550, -432, -254, 21, 230, 198, 115, 140, 227, 223, 160, 265, 373, 422, 339, 21, -101, 1, 167, 192, 85, 90, 60, 92, 1, -37, 33, 141, 211, 81, -197, -214, -185, -130, -183, -237, -178, -168, 9, 57, 98, 59, -74, 24, 59, -53, 63, 90, -24, -73, -15, -92, -45, -65, 79, 252, 297, 188, 284, 425, 228, 36, -44, -22, 0, -84, -20, 178, 68, 43, 10, 42, -76, 52, 73, -33, -37, 130, 290, 225, -33, -77, -82, -91, -108, -21, -55, -71, 69, -10, -59, -79, -161, -241, -263, -47, 128, 83, -86, -121, -30, -72, -215, -185, 51, -19, 18, -32, -268, -267, -163, 40, 51, -65, -199, -124, -4, 279, 433, 327, 350, 477, 311, 97, -63, -62, -98, -19, -110, -116, -224, -179, -131, -201, -74, -17, 57, 65, 135, 419, 401, 250, 126, 153, 104, 82, 213, 182, 63, 87, 133, 28, -92, 17, 92, -65, 68, 310, 234, 104, 79, 233, 271, 5, -199, -147, -80, -75, 67, 287, 331, 309, 348, 321]
41.06831C21j33j2L4k41k13L6J31j39m0J02m7qQ9J25J56m7o1J4j04P0K38m5l7To5j18LpJ07j17
40.86802d5k57p3m3J65K68L7j21Q7L34r6j77j03K4J10j14q8J59J9j09L9J03k13k03J06J26J23m8L
40.68108A3P2j16j05J24J83L6r2j88J24K61j1j63j28l7R5L8p8r9l8p8j9K42J89q0j69n7j15N8K19
40.48747H1n0j79J15J24K1R5L6n2L7ln6j52r5q3Q4K56O0j36j30j6o8Q5L5K1J14m6j4J5j35M7k8R1
40.27383G4M9j42o1NPj5j3J06Mj03K3J46JRk46m2J33P7m8j54r4p7K4P2j9N7J94K8L1m6K8K13k2l7
40.04683A62q3K1l4Oj4o4J14M6K9j05j62n7m6O0n2J12oJ0K30R7o5l1q8p7q7o0R8N4k15mJ71K11
39.83319A71j17Jj19j2l8j84N1q8r5J95O6K11M1j77n9l6O8K21N5J73k80N0J46j74%j4L9j05r5J65
39.63290F0P7J82j21n2NO0j49j06L1R1j09k03Q1k1L3R3N1N8k8j64n5K3P3L3N4J8L2J51k0K4Or4
$$ y = [321, 188, 176, 210, -31, -244, -208, -77, -216, -256, -154, -201, -209, -120, 5, 161, 114, 53, 67, -37, 33, 271, 226, 189, 152, 87, -31, -28, -35, 72, -45, -302, -375, -418, -253, 15, 52, -69, 18, 352, 256, 79, -24, 0, 110, -4, -92, 67, 86, -23, 16, 119, -94, -297, -191, -65, 58, 10, 13, 85, -31, -136, -12, 171, 207, 115, -73, 51, 312, 301, 138, 10, -27, 68, 106, 28, -71, -109, -187, -206, 36, 225, 145, -24, -81, -196, -138, 81, 31, -148, -33, 91, 112, 207, 243, 191, 228, 225, 169, 17, -78, -161, -77, 179, 239, 103, -27, -43, -111, -26, 9, 30, 144, 98, 84, 99, -36, 11, -17, 74, 123, -19, -80, -75, -68, -83, -96, 10, 14, -89, -66, 80, 81, 90, -156, -198, -65, 12, -36, -190, -284, -361, -337, -265, -284, -227, -33, -5, 26, -20, 8, 221, 199, 162, 79, 100, 66, 72, 58, -6, 108, 154, 183, 78, -84, -141, -187, -127, -179, -67, -73, -63, 167, 264, 199, 168, 80, 3, -84, -144, -46, 8, -207, -211, -40, 171, 54, 55, -64, -76, -114, -298, -247, -335, -430, -235, -169, 42, 83, -94, -153, -189, -121, 100, 155, 328, 48, 98, 244, 70, 70, 56, 95, -10, -105, 60, 137, 319, 198, 146, 151, 211, 62, -44, -13, 78, -31, -234, -153, -174, -141, -48, 3, 61, 33, -131, -186, -163, -90, -57, -3, 15, 47, 198, 178, 202, 208, 114]
39.41926A14k82j13R5J86J1J4P3K6j7n2l1o4r1j7L2m3J82J90q7j21r1m0J27j36j34mJ26K20nj66
39.21897i8m0J1r9j17J25J5J62Tj10n4J7J84R4N1j26j8r7O1J40j40j23M4J4rR6K47Jj41r5oq1o
39.00532F4j44QJ82O2j99Ll6R7R0M3j34j25K0j36o5n0O5Q0R9J14K1R4K3j06N0Q3m9k14k6K37J37
38.79836B88j47j71J29J99j75q1M8J60m9J2r3j68n6J62J50j18j3l5k4O2j6j10J12o7q2m4n0K10
38.61142C3J26r1k12J8K7r3%J61Q0j14j07j69P0J91N6R7L8Nk2N4k01o1M8P5N1q2L3L2j0R6J46K3
38.39778B98j8j7n3k04K1P7j6p1J4K3n4O1j02j19oJ07K90P0j19o3J3j8K8J15j02j14n0q1J5k01
38.19749b76j17jJ22R2rO3K1J6J04k7%l6j09l5J30Q6n4N7l3r2n1J13jj48j23M5J43J49J9J0N3r5
37.98384A6j51k8J08Q7k7k02J1K45Q0m7j05JJ13l0o9q4l1p4J2K03m5k7J00m0J28J11K4j05j84j83
$$ y = [114, -168, -281, -186, 0, 11, 25, 98, 124, 107, 55, 24, -40, -131, -148, -116, -159, 23, 213, 126, 5, -86, -126, 1, -135, -269, -273, -147, 73, 68, -98, -138, -127, -226, -343, -218, -203, -41, 121, 11, -43, -26, 158, 252, 303, 177, 159, 62, 123, 263, 123, 0, 44, 58, 49, 145, 392, 393, 252, 157, 151, 70, 64, -80, -72, 110, 172, -27, -24, -60, 37, 127, 170, 36, -89, -69, -205, -270, -320, -255, -175, -76, 38, 59, 153, 176, 70, 120, 203, 154, -60, -86, 151, 288, 141, -30, 99, 298, 123, 42, 90, 250, 201, 213, 120, -48, -104, 58, 208, 90, 77, 42, 18, 80, 64, -46, 66, -1, -83, -127, -177, 33, 159, 68, -144, -126, -99, -192, -192, -31, 49, -65, -172, -341, -271, -80, -24, 73, 111, 116, 94, 148, -53, -114, -66, 9, 60, -22, 11, 43, 33, 129, 275, 298, 280, 263, 210, 6, 27, 104, 88, 17, 31, 54, 0, 61, -41, -160, -166, -59, 231, 301, 182, 119, 132, 114, 142, 257, 155, 41, -9, -90, -75, -276, -393, -394, -272, -180, -189, -126, -105, -89, 15, -12, -12, -48, -157, -192, -62, 24, -30, 27, -6, -98, -149, -36, -37, -185, -308, -263, -120, 29, 48, 58, 111, 16, -135, -163, -55, 32, 5, -197, -186, 59, 139, 92, -13, -12, 101, 71, 2, -82, -113, -187, -175, 28, -17, -44, 56, 16, 144, 255, 279, 174, -10, -193]
37.78355a93J38J61J1L7Rm5p9j62j89p8K04J49r2q2J03K2l1O5rK9M6n6J17P9j3j24oJ6j24QLj06
37.56991a92Q2J17rN7J27q2M1j22k59M6N0L1J28K4j95o6K6J8P9R0P4M2M6N4J48q7k05k37n8L6L5
37.36294a61k5J29K03o6j38r9O1J25j42k0o5j3m9KR5Q5j93K9N0j28J36J57j90P7M1n3J55J96l7n1
37.16265A11j29L5R6nk5j71KQ6Q5j0j11n0J39J45l6m9n2rN0J44P3j24n5j2L8o9n6L4P7rl0J17m1
36.94233A89L5J99J11k95n2j3j25J32L7j54J2j06K8r3oJ90O3k3k18j02p2j75J9K23J7J00k8N6R0
36.74872C9J6Q6P4n6r3j59r4J19L5Q1N2m0n6o1Q7J14M6o7j88J17J43j40o7Q6k6j40P5m2o6P1j04
36.54175a58M2j46J41J48j69j19l7J44K7j26O3J27J61N6N2k3j14k12j41J9J36N2L9l5l7Q0O4p1p8
36.34814a15N5J15l2j56J4j9j5n2oN6P2Q3Q1J3j91m1O2N9l8j9n9R0J7j5QK01j07j38K9K5J78J46
$$ y = [-193, -55, 106, 117, 154, 163, 118, 39, -123, -312, -390, -186, -37, -129, -211, -108, -86, -117, -52, -61, -32, 14, -42, 75, 154, 141, 17, 11, 27, -97, -89, -86, -192, -110, 7, -2, 55, 182, 100, 141, 19, -240, -194, -144, -113, 15, 39, -156, -222, -196, -178, -99, -9, 65, 107, 153, 207, 355, 268, 63, -174, -232, -196, -161, -186, -57, 146, 80, -58, -157, -96, 29, -113, -133, -198, -211, -260, -258, -163, -78, -271, -242, -192, -320, -184, -27, -217, -140, -99, -152, 3, 199, 162, 111, -18, 17, 113, 108, 83, -88, -86, 0, 85, 75, -36, -86, 53, 198, 162, 113, 61, 52, 102, 246, 319, 195, 140, 128, 166, 97, 41, 75, 152, 143, 113, 230, 189, 224, 423, 534, 239, 187, 174, 49, 181, 218, 64, 76, -30, -2, -95, -101, 89, 152, 129, -89, -191, -263, -438, -419, -196, -179, -79, -107, -51, 39, 55, 141, 215, 159, 66, -93, -187, -68, -33, 48, 100, 60, 4, -57, 30, 144, 190, 123, -65, 52, 195, 55, -12, 74, 48, -92, -17, -59, -125, -54, -158, -116, -262, -121, 27, -142, -261, -298, -154, -127, -253, -190, -63, 98, 154, 206, 183, 69, -143, -284, -265, -129, -77, -38, -73, -110, -30, 34, -37, -115, -60, 55, 23, -133, -119, -138, -153, -205, -211, -155, -83, 0, 81, 94, -97, -138, -76, -17, -55, -74, -133, -43, -26, -41, -33, 168, 61, -77, -48, -23, 155, 301]
36.13450C01j74l57o3J53Q9k5p7o8J73O9nj40j55q9rK54J22J31j45P1N3j18N2J36j5k63j02l6k9
35.94088b66m7m5J45J08r4K1K25j23P2p9P1L0n2o2J98K8l1O9r2O0j90k4P8n7p9k0l1r7N2L8j23m
35.72724c21J36J93R5r7nK8P6O4qP7k1l6L0J1o1j75r7k5Q9J26Q6k37j29R0J18J29J13j8j92j30L7
35.52027e4r6jQ6N6K5J4M8n5Km5rnk11K9K13j29m6k6J89J03j39r2n6K74k7J33p6j43L1q2j53R5
35.30663a47J77R9j61p4j13J41K7L4L1p1l5p2L6N6N2j08n4qR0n3O7J90qkJ12j2o5P7j89j26Q1K27
35.09299A99P6K2j29mL5j9J8j02j27J74P6k47j9K25O9n5pp9m0j62q9J66j3O6k4o8j23m9J8P6j39
34.88602b75j8P3O5N6m9J65J75j17n1r0M3O0K0j3j9o7j43j02P6O9J58R7j6j02m7mJ55K01p6o3n3
34.67906A08Q8O4k02j71j39p6J30J75j04K3J87J13j34kn6L6J69J06q9j88j33o0N8R5J6MR3Kj41q2
$$ y = [301, 127, -230, -293, -140, -51, -76, -153, -221, -48, 21, 16, -124, -279, -368, -377, -123, -1, 130, -15, 56, 109, -9, 43, 179, 164, -99, -201, -237, -266, -313, -358, -213, -105, -199, -178, 47, -76, -4, -83, -12, 18, -34, -96, 102, 130, 99, 168, 76, 136, -54, -78, 0, -57, -136, -156, -187, -284, -232, -194, -317, -321, -185, 8, 103, 6, 1, 29, 105, 169, 161, 238, 217, 181, 211, 222, 161, -14, -111, -136, -47, 79, 165, -72, -201, -111, 7, 136, 249, 231, 39, -91, -54, -150, -151, -65, -9, 16, 30, 78, 23, 25, -20, -29, -34, -245, -216, -3, -132, -178, -204, -15, 88, -51, -143, -199, 75, 48, 181, 105, -38, -7, -89, -242, -147, 30, 129, -32, -106, -219, -78, -51, -17, 14, -57, -92, -164, -128, -72, -20, -128, -182, -190, -100, -153, -86, 104, 96, 94, 206, 194, 129, 206, 17, -109, -28, 199, 275, 297, 168, 164, 199, 180, 198, 96, -31, 143, 219, -28, -47, 178, 247, 192, 185, 106, 66, -96, -185, -19, -32, 34, 10, -58, -181, -230, -212, -136, -275, -293, -220, -155, -99, -148, 17, 192, 75, 24, -66, -23, 37, 57, 44, 25, -42, -185, -287, -211, -142, 16, 113, 97, -5, -52, -56, 99, 300, 224, 161, 108, 196, 260, 58, -113, -252, -328, -198, -23, -127, -104, 83, 196, 62, 60, 4, 40, 209, 315, 226, 38, -95, -155, -97, -2, 14, 18, 111, 113, -28, -110]
34.47877a10K12k1P6o5k36p9J90l1l5J46J64Q0j16j94o6j43o8mJ73J21oJ01o7j14j06p4K30K47N6
34.28515B61j8k26k17l6N0j6R5J21Q3J5O1r5o6N5o4j45p1J03L2m8m3j28l4J69J64Q9K43L7j26q2T
34.07818H1m2L0q5j2k7j2j9L9q6j16K96J32j91j19l4k4J97N2p6P2K5R9R5j46j27q7j76j43j51P
33.87789e48K29J21P0O1n2n3Q2R7K4m1o9j17k02j4L39K56j34k58j91K5p3J18J71J65j4j62k7p2R7
33.68428a72J09J37P5J9M4l5j21j13o2P1K04P9k16j14l8j35R2K57j0N4j03j20Q0J83Qj25O4P0j71
33.49067A1k21J25M7j03Q0R9j50r6K7J40J5j59K5R3J66NL0J54K0j80n6M4j27K5J2J67K1r7m4j4p8
33.28370a9j14j3N4N9Q5j67p6J79OR1J7q4j39J1j6J71j12n6J42J2P4j7P9L2J34p7j33J3J27K1j33
33.07673A51p4m1K2L8j45kQ4J54j42j82Q5j2j1J05J16j9jl3N9J49Q3r6L6p0j0o8R8j32k02J15O3
$$ y = [-110, 102, 81, 157, 92, -144, -223, -33, -64, -99, 47, 211, 291, 175, -19, -85, -228, -296, -300, -127, -6, -12, 89, 22, -92, -198, -272, -42, 205, 261, 243, 17, -200, -236, -186, -202, -107, 14, 97, 112, 173, 78, 12, 67, 3, -142, -213, -110, -78, -126, -169, -297, -331, -162, 2, 91, 334, 371, 245, 163, 81, 39, 69, -16, -28, -55, -67, -86, -47, -133, -249, 47, 179, -12, -131, -165, -189, 8, 60, -16, 56, 81, 180, 275, 129, 2, -85, -261, -404, -555, -548, -319, -198, -128, -67, -119, -172, -90, 7, 31, -10, -79, -196, -398, -412, -73, 183, 49, -209, -400, -375, -448, -330, -159, 6, -8, -170, -197, -269, -172, -63, 74, 149, 168, 212, 177, 56, -57, -119, -48, 156, 235, 19, -95, -133, -268, -176, 81, 71, 125, 22, -98, -18, 165, 173, 48, 112, 182, 11, -210, -85, -38, -141, -61, 38, -112, -208, -181, -41, -26, -185, -160, -67, 99, 104, 134, 288, 308, 128, 72, 116, -11, 14, 26, 193, 214, 117, 73, 59, -19, -133, -146, -92, -33, 52, -115, -191, -12, -6, 85, 102, 18, -121, -110, -126, 45, -67, -123, 19, 31, 105, 88, 167, 199, 333, 256, 123, 136, 263, 284, 151, 77, 36, 58, 96, -49, -51, 33, 187, 45, -137, -52, -64, -75, 30, 146, 127, 126, 93, 152, 301, 384, 288, 324, 254, 244, 176, 274, 142, -60, 55, 118]
32.86977A18k5j07m4l3r0K8J45nj80q9K92K27j9l8m4R2j2j14r7N8M8l9R4J38m2p9M0RJ4mj24J30T
32.64945C78p6l9L7j45j96m6k3O5L5lJ9L7N0Mj19k02q1M2K00J4q4J23Or9j9M1J00lO3j02n6NJ05
32.42913C1J90J15k1R2k2j00j62q8P0l1k29J0K21n8j47k58J74Tj8q7kN1J40J9O3n3o6J45J02j11
32.22884A44j05M5j21N9N8J88r9j55m4k5L9K02Q6r3j64j22J36J27J6J29P1j80k05K4j1q9O1J82K2
32.03523A76j11m3k1m0J87J03N0j65j80k09J3J31J15q0P5K2ok7N7P4q0J53J17q2p7j40j65j25M8
31.84161b30J79J74pj33m0q2o4J88J35P6J03k2q0k9j0k5j67m6Jj00J5m1K16Q0j88l2j57q6K20J20
31.64132c2j1N0J9J01R6o4j77M2J39j79K1J03j06TJ40L7J30l6j85j28k9L2Lm1J60J55J18o4k49r0
31.44103a51K37R9n8q6L7j50m9J31j8q8k0J65K10j66j77n3m4J36Jo0O8n0O4N6L6J70N8j74m7rJ8
$$ y = [118, 93, -14, -58, -91, -181, -153, -8, -13, -193, -282, 10, 237, 218, 180, 136, 228, 216, 102, 5, 63, 111, 72, 166, 304, 262, 183, 223, 232, 246, 242, 118, 248, 378, 302, 263, 300, 155, -41, -87, -110, -45, -10, -13, 6, 43, 93, 97, -22, -224, -305, -263, -63, -49, -133, -10, -4, -103, -122, -81, 19, 16, 79, -23, -79, -74, 31, 221, 336, 315, 407, 385, 285, 123, 35, 105, 74, -155, -145, 76, 18, -129, -387, -213, -39, -57, -144, -146, -95, 45, 64, 127, 74, 8, 153, 255, 144, 39, 84, -37, 22, 80, 268, 169, 14, -30, -55, -16, 186, 272, 179, 15, -107, 29, 156, 172, 301, 372, 192, -13, 11, 0, -89, -28, 154, 176, 65, 22, 1, -39, 148, 251, 301, 136, -44, -253, -240, -109, 6, -74, 1, 23, 17, -10, 47, 121, 41, 194, 311, 229, 152, 12, -153, -278, -230, -51, 123, 116, -17, -57, -139, -203, -15, 120, 196, 299, 277, 197, 168, 158, 133, -34, -80, -79, -179, -164, -205, 11, 91, -97, -129, -286, -372, -152, -32, -43, 7, 26, 127, 223, 159, -18, 24, 163, -16, 5, 108, 2, -104, 36, 73, 203, 167, -18, -146, -175, -143, -140, -181, -21, 134, 252, 188, -61, -151, 86, 185, 127, 41, 78, -72, -121, 10, -8, -96, -116, 49, 259, 93, -84, -137, -181, -45, -44, -104, -36, -86, -22, 34, 70, 240, 298, 124, 77, 68, 86]
31.23406H6o3L7%k2M7n3r7Q5K0j02J56J44k7q7J3m1j0O8J3o0j20l0L7L0n3j17OL5k4J04J56J55
31.02042B86j46r7j53j11J9M3l8K5L3J33J58p7j12J4Q2P0p4J15M2j48L8l1k39r1p0J43J5K8Q6p0
30.82013a27n3J87l6k73k7j4J95J35l7J59j9P0L9j55k36O2j0nj1M0J12M0m2q2N0Q1K4L0l01j04
30.61984c08J83J46J68P2j59k2J64P4l0j98j02kJ12o1r3J44Qj26j31O9J02q4k17O4J88o7j52J01
30.43290a57J29O4o5nJ48P5j59J16O4j90n7J24j04n5J8j55p2J66J56R5k03j01o7K43J91k11p6pj3
30.23929a08j07Q1lO9L6P8J36R7qP4j79j08L8Kn3k6j84N6N7J15nk26k06rJ70K7O1N5J97J66N0j93
30.02565A50mj64k5M3j06J77K0r6j2PJ49J24p6k89o1j06n5P1QRL2j76j16J08J23K04j2J8J85l7M2
29.81868A35pm4n7j58N9J1R9n0j16P0K6m3j94o7j9Q5j8J26N6L9J0n2N6K6pr9RK20l6j69J10m4j47
$$ y = [86, 23, 60, 60, 38, 85, 32, -65, 20, 40, -62, 94, 238, 211, 124, 137, 96, 86, 154, 167, 107, -13, -43, -6, 24, -29, -146, -140, -105, -129, -25, 131, 286, 140, 43, -110, -221, -202, -159, -197, -172, -139, -6, 152, 75, -37, -23, 59, 129, 55, 170, 212, 64, 102, 71, -168, -259, -329, -186, -171, -143, -57, -127, -180, 7, -29, -302, -329, -343, -148, -13, -50, 109, 90, 160, 199, 44, -192, -130, -140, -145, -156, -116, -4, 36, -6, -88, -38, 43, 67, 97, -204, -308, -125, 21, 189, 261, 102, 80, 244, 318, 288, 90, -12, -14, 98, 37, -56, 88, 96, -30, -161, -92, 10, -74, -291, -227, -39, -106, -258, -157, -28, 36, -29, -34, 114, 189, 30, 146, 210, 20, -37, 87, -17, -72, -54, -209, -281, -115, 41, 136, -67, -168, -235, 8, 199, -12, -88, -95, -108, -215, -134, -137, -68, -32, 46, 182, 279, 271, 345, 166, 58, 96, 98, 45, 19, -165, -109, -52, 63, 58, -168, -374, -383, -213, -186, -125, -70, 127, 293, 343, 150, 146, -18, -43, 0, -106, 71, 91, -5, -17, -10, 139, 263, 187, -102, -163, -269, -324, -253, -245, -236, -204, -380, -496, -388, -265, -61, -73, -55, 130, 93, 135, 128, 84, 27, -131, -72, -61, 38, -12, -128, -58, -32, -75, -269, -336, -355, -270, -288, -162, -106, -67, -57, -109, -53, -27, -34, -133, -124, 96, 60, -109, 1, -43, -190]
29.59836a90j99K9K22n9j5J77k8k06P0J86k6k18o7l4J3L0PJ72J2j83o6J39K45J2j89q4PQ1J62L28
29.39807C28P3j0k15l1J66j39k74k8P4M7J15p2j43J35J01j24m7j0j94l1J25rq7J6J75K04m3j67r5
29.20446a60L5J08R9K7j68O2m9q1m4J2j1L3L4m4j3J5l6N6P3J16L9N8j0m4m8J57k4j09k6R2L2L7
28.99082B18k08J06J27Kq3J4M5J5j15l8J18O5J7J38j10j95J01M5k3l7n8J5j9o4J86P0k86m4n4O8
28.79052A6P2L4j9L3o5j11r4rn5qj4LR0K3o1J52J15Q4m8P4j31k86l3J9P9M5TM1o3l7P0rq9J00N0
28.55685A3l5K2O6R5j80j11q8n7J11P3m2j50j34j22q5n7R2J62K08O2P1J37M8Q7l3j08l3k6K4M3Q2
28.34989A35MK6%Tj1N4Jj23M1PO9J12Q9K8L0p4j59k21j44j1J27P8J8N5k5n0RJ61P9k43r6m5pJ08
28.12289B2J65j97r8J9J51P1N5J84o1j14j44j62p1J4M3K4K9J5k5Q6J00l7q8j34k21L16J87nO7J01
$$ y = [-190, -389, -360, -138, -197, -212, -35, -63, -269, -199, -13, -39, -257, -324, -358, -345, -315, -308, -136, -124, -307, -373, -234, 11, 23, -166, -250, -243, -162, 0, 328, 401, 391, 176, 145, 311, 172, -102, -130, -56, -9, 106, 34, -109, 26, 127, 3, -44, -54, -248, -279, -154, -163, -250, -234, -59, 145, 102, -65, -160, -125, -17, 82, 109, -59, 3, -46, -127, -171, -159, -170, -137, -103, -147, -160, -145, -181, -125, -52, 64, 103, 161, 151, 107, 59, 216, 192, 83, 57, 149, 181, 218, 10, 116, 243, 245, 162, 176, 221, 236, 121, 83, 201, 266, 283, 421, 311, 116, 217, 262, 239, 202, 144, 159, 140, 76, 262, 332, 46, 2, -52, 16, 88, 122, 103, 136, 71, -40, -134, -143, -198, -206, -220, -217, -127, -104, -165, -13, 102, 186, 138, 212, 81, -205, -238, -219, -140, -95, -50, -9, -72, -109, -39, -48, -137, -37, 13, -22, 0, 66, 161, -19, -130, -218, -275, -164, -91, -133, -283, -417, -539, -624, -681, -589, -427, -219, -157, -86, 51, 99, 186, 153, 45, 12, -14, 10, 53, 135, 139, 165, 165, 165, 154, 208, 209, 86, 127, 134, 203, 315, 404, 432, 462, 388, 229, 8, -136, -147, -20, 58, 76, 131, 106, 56, 65, 226, 305, 62, -34, -79, -86, 22, 187, -10, -108, -89, 62, 133, 188, 372, 311, 197, 53, -109, -180, -166, -123, -99, -70, -55, -80, 6, 106, 69, -19, -153, -374, -58, 129, 124, 191, 292]
27.92260B92j17j39j12k8Q6J3k1J0p7q7J2K1J4P1Q7J20ro9K2o2m1L2J83K5j19n2o3k3qN8Ln4q8K3
27.69561i7R8O2j04o3J81N1nM6K6J07L0Q6q3j66j8k38k05l4R8K17K19N1M4m9j28j93k8j32K27J13
27.49532A13Q3K8k3L8j03j11K8p1N6j26P3J92m8p5k14J24L0o4j83oK47L46N7%O6k66j87q6O4J9Q6
27.28835H7N5j0j27j08j13J14J20M9j00J59l5L6PNj5OM4r1qL8R7r6J9Q1K9P8O0j10j50o1J89RQ3
27.06803C41j91k64R1R3N0R1q6q7n3L4nJ4j65M1K04K56k5j36n6j15q3j12j34o6J30K15k6o7j1q0
26.86774b02K2K8J01k4l7K69o7l54k49Q5K23q4k7M5n6p4N3K63J08nK49n8o1R5n2k16q0kQ3J77J1
26.66077A64p3j18p8R1N2K86J55k45j83o8j53l4l7oL7J45L3j50K40j02TQ4n1M7J9ToK10o5Oj9j86
26.44713h8n0K00J30k60q7p9Ok5r8Q6K05J30Q2k4j09o2j05R7M3L1r8L4o8p4j82o2K02J14K6J12m1
$$ y = [292, 175, 36, -76, -104, -18, -5, -26, -16, -93, -180, -168, -147, -133, -62, 25, 145, 136, 67, 89, 27, -14, 18, 201, 226, 107, 55, -8, -31, -39, 19, 22, -32, -120, -97, 1, 63, -41, -104, 77, 128, 123, 169, 195, 302, 332, 418, 335, 169, 151, -87, -292, -326, -228, -11, 208, 259, 303, 254, 126, -67, -95, -227, 0, 113, 196, 224, 201, 239, 136, 25, 53, -18, 38, -88, -15, 177, 129, 54, -160, -36, -6, -70, -253, -259, -12, 334, 391, 391, 457, 191, 4, -82, -18, 1, 87, 142, 132, 5, -103, -216, -102, 18, 67, -33, 126, 91, 127, 134, 139, 124, 130, 174, 83, 75, 113, 210, 114, 133, 214, 243, 321, 381, 271, 121, 60, 249, 258, 341, 150, -114, -23, 70, 120, 211, 125, 38, -15, 19, 14, 28, -137, -96, 108, 364, 339, 203, 147, 32, -51, -163, -297, -363, -233, -18, -44, -111, -122, -202, -180, -152, -51, -75, -112, 157, 90, -264, -513, -428, -205, -289, -316, -271, -327, -401, -348, -85, 23, 18, 267, 209, 148, 243, 191, -25, -105, -107, -24, 153, 164, 91, -27, -105, -14, 38, 324, 479, 234, 51, -17, -170, -204, -241, -247, -210, -65, -32, -182, 58, -44, -146, -62, -113, -66, -47, -28, -34, 176, 111, 117, 98, -88, -138, 62, 192, -68, -155, -234, -228, -253, -351, -265, -60, 70, 152, 128, 19, -43, -148, -51, -8, 23, -75, -41, -109, -183, -365, -427, -225, -111, -85, 27, -14]
26.24016a4j86J46J85O5j29lR3j82l1J12m4L5M5J8O3j81M5J04O9qO6K6O8k0j41k96j27KN3K63R6
26.03320A92j9lJ02Q7j59j83j56J3M7N8Q6J83pNj45j9k3J27TK4j41K8l3J5qj2J79j59j74K6pq2
25.81955c1j29N7N4O7J3R0ORK1J7Q3o5p1n1pn3M4j21K6J26L6r4j31N8j41M9J34M9L2n%Jj32j5j70
25.58588b44l6Q6P5m0K2l7nr7O4O5L0J11J37k7k9K54k2l77l8kj06l28L5J86J83j6q1L9J51J27K52
25.37892C32r1j91L0j97j14N3J11R6l2o1j8K9R7PK5l1j14p1k03l2K12J17J24m7L1J38q7m8J34j22
25.17863G7k75R0R2j51m8K4o3O7P3P5J07j0r0j8O8j47j25J02K47p2r6p1L8N0%R6J25qo9j23j12q6
24.96498b33j71n9O0Q3R5N6J75J49k5m6O9k33j48K2J91M9mj7r7o3J06L2K9J69Mj31j10JJ89J20J5
24.75802B77j82l5PJ08j12p4l5j54N7J95kPTl8l9J3K2P3P2j4K9j33K8J94N7r7k18j59Q5K32l4j71
$$ y = [-14, -200, -54, 131, 196, 67, 64, 157, -25, -56, 56, 12, 47, 92, 110, 173, -8, 37, 141, 210, 202, 268, 294, 362, 342, 201, -95, -222, -220, -167, 96, 192, 173, 170, 272, 359, 200, 17, -139, -126, -79, -21, 65, 248, 241, 246, 101, 82, 59, 186, 313, 337, 196, 224, 191, 206, 198, 186, 365, 206, 32, 58, 51, -31, -160, -103, -49, 18, 31, 121, 127, 136, 157, 174, 257, 192, 121, 70, 63, 10, 54, -67, -41, 85, 121, 27, -104, -46, -187, -138, -4, 45, 77, 72, 72, 73, -59, -74, -244, -280, -194, -119, -159, -137, -174, -179, -276, -212, -147, -117, -6, 131, 104, 75, 329, 307, -70, -108, -110, -216, -544, -509, -323, -140, -156, -237, -198, -47, 80, 332, 241, 50, 80, -117, -231, -178, -67, 29, -3, -64, -82, -53, 44, 51, 76, 45, -69, -140, -343, -375, -163, -46, 78, 31, 62, 200, 113, 65, 199, 77, -198, -108, -16, -167, -215, -191, -254, -187, -114, -39, 68, 58, -32, -50, 18, -129, -254, -152, 95, 23, -73, -144, -106, -56, -56, 40, 165, 157, 88, -35, -147, -233, -404, -463, -403, -320, -225, -169, 6, 155, 130, 84, 153, -80, -228, -206, -15, 34, 30, 13, -84, -147, -41, -9, 20, 189, 193, 62, -48, -47, 142, 262, 277, 95, 60, 67, 175, 63, -11, -46, -200, -143, 52, 50, 57, 64, 26, -13, 0, 22, 95, 167, 153, 182, 49, 77, 271, 328, 231, 13, -146, -61, 171, 137, -34]
24.54437c4j34n8L1j9M6P2Q9n0k19j43R3N8K05J23m3k5J14J1k30r8ON5L7QL0l1n1J8Q0J44K2L4o9
24.32405G2j80j43q4J62N3l2R2Q4K1oL4qM6K36j5N6l9j82j88j70l5M2N3L1mj42l8kP0J01N0J3n3
24.10374a05j6m1J52Q3q5M7jq4q5jK9K5K64K00j98j69j56r7j05K20J84Nj09LJ09O7r5R3J9j25o
23.89677B2J84J60j46k39j9J25J40m6l8K0j14j42n5J7R0J18O5j07k7M6K1o3j70p8j3O8O9j5n0l9
23.69648b16O8Q7k6J06J89nq6l8J06r8o5rNQ5p8q1Q0O9K26J17k29q1J1M9j46k46r4J0O4J56o8k7
23.48284a65L9J9R3O4j9j88J9J39J89Q2j38k39N2L7j28Qo8JJ39Tj58J25K4J47M4j50j82l2J78J22
23.28255A93j75j19J11R3R2L6p1k47q8N1K5Mj67j74N0j3Q6J15R1N8K7k6j2N9p2N1M3Q7j07m7J47
23.07558A01N9n8R6J27o3j74l2l7L1l0k1j26L1P5j25k2R8P1j86k6J67J13j13j96Pj6j21q8R9N8n7
$$ y = [-34, -168, -226, -195, -214, -168, -96, -7, -57, -276, -419, -326, -268, -63, 60, 17, -8, 106, 117, -113, -211, -205, -150, -113, -105, -75, -106, -157, -139, -59, 85, 107, 141, 72, -108, -251, -335, -173, -120, -152, -60, 24, 45, 39, 73, 65, 111, 347, 332, 388, 349, 167, -21, -191, -226, -184, -131, -100, -104, -246, -284, -286, -216, -115, -65, -52, -105, -121, -162, -10, 73, -12, 35, 34, -50, -135, -136, -107, -82, 182, 382, 184, 15, -141, -238, -343, -123, 61, 66, -43, -40, 69, 136, 41, 134, 153, 28, 22, 206, 366, 220, -19, -38, 87, 227, 181, 143, 163, 49, -93, -148, -131, -41, 77, 142, 35, 8, 54, 75, 12, -158, -236, -249, -181, -112, -127, -177, -216, -148, -61, -87, 19, 208, 203, 117, 79, 185, 87, 22, 13, 18, 103, 25, -56, 24, 93, 319, 436, 207, 126, 137, 186, 40, -206, -300, -290, -226, -70, -138, -165, -126, -107, -14, 50, 31, -157, -138, 1, 190, 272, 134, -105, -53, -16, -144, -136, -204, -203, -64, 75, -83, 42, 66, 213, 257, 107, -75, -107, 71, 193, 18, -101, 10, 103, 195, 231, 160, -87, -175, -124, -99, -95, -262, -436, -386, -399, -313, -198, -107, -49, -22, -48, -60, -1, -73, -22, 21, 108, 1, -46, 101, 160, 102, 198, 325, 262, 88, 56, 19, 50, 20, -1, -127, -96, -21, -146, -168, -70, 1, -185, -211, -44, 69, -44, -240, -233, -249, -370, -458, -359, -301, -358]
22.86861c58MK8J20Q5o0J06R8J0J07j28j33J9R5pO8R3L5n0j72J9R9N0r5j68M0P4K25J70n0k38J9
22.66165A05k5N3J1j16o8j19M9J5R6M1P2q3j03K0J43L3m9q8j16o8L8J67M2q5m2Qm7j73j47K7O8O7
22.44800b74J15J46J6j88n4l6LN9p1R5L8J24Q3J03o1j72j81J84J30k7P2J41j23j64QJ84O5J23q5
22.25439B53k65j7R6J21j30j62j01q5J30J70l3j02j41J46L72o2k50j49O3J43l3J2N1L2nO9q5J20
22.06745A58K18j5j55j12j36p8P4J01o7Q2J86M7q7k71J9kq4MPm8j8j72n1J63J36O3j05mK81jj40
21.86049gm3R9K6q2j63o9L19K72m9j02j89J23J22j55l3L5r6r1k0O1J9j61n8J30j32r8k6p5J82M2
21.66020b19J9m5j93K7j22P0K80K6J11J44l1L4N1k26o4N3Q4K7j70r7P5K46L26Rm5j49j50O3J60p
21.45991B87j98j27p9To0N7N3J06k66j70K32O6L7J91J4P3q4rR4rj9j79k0J61M0n3m2k4k3J01n0L9
$$ y = [-358, -354, -326, -206, -121, -181, -75, 23, 33, 140, 12, -121, -102, -7, -14, 54, 147, 182, 132, -40, -21, 78, 128, 33, -135, -95, -21, 204, 374, 324, 86, 105, 80, 133, 144, 28, -40, -159, -110, -95, 1, 42, 114, 31, -72, -52, 91, 124, 75, -13, -129, -197, -159, 8, 50, -35, -77, -69, -116, -289, -436, -409, -341, -274, -159, -13, 3, -185, -239, -275, -272, -213, -284, -189, -151, -27, 56, 159, 98, -74, -255, -71, 59, 32, 104, 245, 122, -42, -34, 150, 215, 338, 253, -12, -29, 67, 188, 58, -104, -205, -290, -160, 10, -23, -125, -266, -120, 252, 190, -60, -209, -146, -3, -36, -24, 27, 59, 54, 123, 38, 158, 376, 361, 206, 94, -42, -120, -46, 55, -12, 70, 256, 303, 216, -55, -36, -38, -122, -118, -111, -159, -177, -349, -400, -237, -101, -38, -143, -147, 134, 133, -7, -50, 49, 75, -7, -170, -239, 80, 352, 303, 201, 12, 135, 257, 102, 69, 104, 8, -83, -103, -42, -23, -184, -242, -112, -244, -342, -368, -443, -261, -219, -200, -245, -438, -411, -533, -463, -183, -157, -46, 98, 67, 101, 152, -74, -138, -85, -1, 26, -144, -241, -166, 80, 406, 415, 370, 221, 71, 134, 294, 287, 89, -38, -117, -196, -256, -199, -146, -40, -306, -476, -244, -178, -141, 50, 64, 137, 53, 44, 138, 129, 110, -69, -89, 72, 112, 59, 17, -7, -30, 71, 21, 60]
21.24626F0j16M2R6R8J90l9k26j09k20n2N9N8O3l5L7J0m9O4On0K4l3j02M5R9K56O2j5j60O2N9r9
21.03262H5k96j08J14J12oJ60P0m3o5n7M4j06j17j00N9R0J74k3N3k8J06N3J4j84j16J99K36J9j87
20.83901A52j23K6Q3jO7J29l1j68MQ3M0N8M0k00j48O2Q4L3j07k52r6J76K14n4j49k0N7%j66J9J37
20.63204e1J14q4n8ROm6j17M3k4l1j3p5L5j0J36J81R7m4j85j64R0J33Rj19K6J15l7o3r2J16J78k
20.41840G3o7n9nL3%j48PN3j36J08J55K12n9j96L2o0n8j53K5J89L04k0j00l6J47J13l7p6j85j92
20.21811a36j39j1R7J74J10K5l2p0P3L9K2J27j01j25j63L3q3O3J79J09J48j9j45j01M1j4L1JKk2
20.01782A13k04l2j39p2J86M7K3l5P0r5RQ3j39k56j18J23L01K25o1L7q9L5m3R9kK9R9pr7M2J46M4
19.80417C22n8R3J9q3N2l0J56j96p2j22j74j26o1qr6O9J69R3L5k2N4o6J05j91l1J94N5pr1M8Q8
$$ y = [60, -56, -14, 82, 180, 370, 331, 105, -4, -224, -276, -217, -159, -96, -131, -94, -84, -133, -69, -63, -113, -89, -122, -224, -179, -80, 176, 238, 223, 63, 125, 184, 85, -211, -319, -205, -93, -99, 61, 131, 88, 23, -34, 10, -96, -213, -313, -254, -164, 10, -13, 40, 12, 118, 171, 185, 1, -115, 84, 320, 339, 152, 29, 55, 138, 137, 204, 333, 302, 134, 138, 221, 261, 319, 359, 159, 11, 73, 157, 190, 83, -169, -265, -89, 125, 71, -78, -98, -41, -41, -207, -188, -51, 63, -21, -79, -70, -64, -110, -227, -184, -208, -239, -252, -327, -292, -302, -166, 15, 112, 68, -117, -281, -191, -58, -49, -168, -142, -27, -64, -127, -219, -103, 75, 73, 6, -53, -58, -25, -25, -173, -166, -113, -249, -141, 14, 226, 167, -29, 3, -57, -115, -268, -243, -54, 250, 230, 130, 94, 241, 354, 317, 241, 56, -136, -275, -286, -189, -15, 95, 120, 88, 18, 91, 130, 152, 279, 178, 53, -110, -77, -160, -97, 82, 191, 339, 320, 175, 74, 115, 101, 132, 133, 135, 113, -91, -123, -262, -334, -148, -101, -78, -113, -43, -138, -129, -46, -185, -441, -559, -436, -135, 90, 29, 66, -23, 12, -31, 68, 66, 95, 194, 187, 90, 132, 278, 322, 264, 357, 376, 293, 345, 315, 471, 275, 203, 81, -93, -219, -280, -288, -384, -315, -146, -53, -18, -40, 14, -52, 53, -138, -169, 25, 80, 73, -18, 30, 118]
19.59721A18J53k3j88l5Q3K38J15m3l1j76o6N9j46l7j77l2j54J2L01K36P8k41k67J32K05L0J27n4
19.41027B17j19lj7j21k0J38R3J7LL3k3k4j45p1L20J67Nl0k04o3J42K7j54j00M3M7O3RKK8j12rn
19.18995A34o9j44r8J4L7J18o6K8J88M0j31pR3k4j07l3K2K8K35j36k59L6K80j11j16J4Q2J78l1L7
18.98966B32K6j95r6j33n5j33j48J57J66K12J15j53j32J4J30J47L1M7k9j18k04m2J63K7n3j50j78
18.80940c52r0KQ1J18L4N2N1j11j1M1n5o0P7K27P5m5K03L7j18m3k00j5J39R8J2K02o9j56k24j60j
18.60243b61R6J21J44J36j10l22l8P8J38K04K9r7k33j00O7J59K5n5J41N0Lj70m1j6j66M5J38P7q5
18.40882d3r1o8K03J74n2j15j71J4J97R5j24m13rN9N7J45J92pJ2j37j11nJ32J09n2j9j6q5RN6qJ8
18.19518e4l2r7o3P8K75O1p6j66K4P8q3j11r1J57j03L5n5j61Q7Q8K4J22ro8J48r9p5p1M2NL4j39
$$ y = [118, 271, 248, 60, 25, 108, 346, 461, 418, 387, 211, 145, 204, 58, 21, -156, -188, -342, -330, -29, 207, 285, 44, -223, -91, 114, 144, 271, 217, 98, 95, 78, -43, -63, 75, 168, 185, 188, 221, 198, 174, 29, -42, 278, 445, 450, 420, 216, 153, 295, 322, 168, 68, 111, 158, 221, 230, 232, 260, 148, 139, 134, 65, -79, -177, -163, -126, -8, -74, -46, 142, 182, 51, 44, 137, 113, 6, -27, -5, 23, 258, 122, -137, -101, 179, 68, -48, -34, 48, 226, 195, 232, 258, 63, -33, -166, -221, -354, -502, -345, -179, 33, 148, -5, -137, -123, 7, 154, 185, 232, 203, 85, -119, -161, 2, 29, -24, -174, -352, -442, -440, -359, -241, -207, -155, -104, -215, -226, -185, -240, -300, -223, 4, 79, 34, 237, 274, 156, 113, -87, -102, 37, 135, 147, 349, 280, 124, -100, -260, -261, -165, -44, 100, 236, 126, -196, -234, -156, -18, 186, 215, 118, -115, -215, -148, 11, 36, -19, 122, 172, 175, 5, -36, -52, -218, -173, -35, 42, -43, -134, -202, 1, 175, 123, 8, -163, -149, 48, 143, 19, -394, -403, -344, -287, -142, 50, 43, 55, -82, -193, -198, -66, 43, -9, -28, -44, -129, -120, -64, -72, -54, -86, -183, -246, -168, 107, 168, 92, -74, -50, 28, -55, -166, -257, -100, -203, -168, -223, -384, -297, -209, -185, -63, -72, -140, 8, -91, -166, -237, -195, -190, -156, -295]
17.98153b95j20O2K15J56Lk8QJ84j50j74p7K06J79k5m0L7J19j21p0j6k19k02j88M8J04Q4J69K31
17.79460H0O6J2j5j91j71J52K3K1Q9r6N2K25Lj86j79j22K11K07l7J2J11o7P3Mj76l73J4J84q9q3
17.59431b46o3m9J2l0M0J60J38oQ6O4O2L6M6j55n4J03m8l6M5r4j80Q6K58J11o7j39j93Q5J21J0
17.39402A03k17j63P6J56Q9m3j00N2J27l5pJ1J8n4kP0nQ8R0j8q0k1l5j48l9k7J19K14J91q7j71
17.18705A52l13n0J03P5O5n3K9L67L25j75r4j82o0k5M0j33m1k32OJ25l7J72K21Ok6k14j03mP2J50
16.98676A66J28j77k3j78Q5mL9R1J47r4j52MK4j24n1j00j15J71j72L1L08m4j41J15o4p8O6N9J1q9
16.78647a61L2QK7N4N5k7j06j69R3J50qm6q7n2r0L7K13J52J31J50%j52P6j10k7j7q8J15J93j33
16.58618B13j37o8o2P5M2l3n5J14K0m4j63j6J77q5q4J56K05r4q8rn9k4pN4j6L7Or2L8M4o3j94j31
$$ y = [-295, -415, -353, -138, 18, 21, -7, 1, 185, 35, -139, -216, -10, 169, 144, 104, 141, 260, 139, 69, 53, -166, -368, -556, -508, -404, -320, -151, 80, 146, 158, 143, -48, -219, -67, -44, -23, 66, -30, 22, 247, 250, 64, -115, -237, -26, 181, 144, 156, 267, 200, 273, 277, 101, -272, -258, -74, -163, -246, -309, -358, -346, -376, -336, -176, -38, -44, 42, 106, 168, 204, 250, 95, 41, 144, 96, 60, 105, 11, -169, -83, 175, 286, 219, 80, -113, -28, 93, 103, -114, -277, -201, -45, 44, 1, -99, -47, 80, 45, 38, 49, 67, 13, 11, 81, 76, 164, 254, 236, 156, 135, 100, -48, -87, -114, 5, 219, 410, 323, 152, -161, -211, -108, -33, 32, -21, 8, 375, 700, 525, 431, 249, 189, 164, 204, 71, 30, -202, -196, -71, -108, 64, 285, 291, 265, 51, -52, -56, 16, 166, 294, 117, 94, -84, 1, -3, 36, 127, 274, 180, 28, 32, 56, -68, -119, -219, -334, -163, -335, -304, 4, -40, -181, -66, -130, -208, -142, -83, -72, -161, -129, -121, -94, -40, 15, -12, -118, -287, -194, -44, -52, -98, -185, -237, -327, -290, -77, 75, 206, 356, 356, 204, 280, 170, 143, 126, 38, 153, 346, 213, 76, 8, -54, 21, 63, 30, -25, 89, 109, 65, -98, -114, 63, -22, -106, 50, 255, 161, 73, 64, 5, -19, -26, 28, 12, 49, 55, -37, 1, 45, -18, -212, -343]
16.36586c43J36Q5K36J34j61q8J4m1qm8n2J67M6r5k3q7kJ94J77LK2j6o0k%j47j33j67R4J21J11P9
16.15222A46o0m0j02J51J41j57q4J5p0Ml4j41r0J38K87o2j66M4K26qJ8J5L8N0k5j32j56J50J27
15.95860B23k95q8J21J7l5j9J7m5k9o2PM4P8p5J09J42j95L0L3n4j10J00J51L8rm6M5m6m2j6k04m8
15.74496b63K03o2k5N3l4p8m0L0J1Q3P2j61j34M4J09q5o6k6K1J70P5Q9N7O4j07o1J06O7N4P6k17
15.53799B5k6K27m4n1L7O7Om4j92m2o5j5O3J55oN4k1j94q8j6L1K5M6J51r2Lj12P0N9J04J19J37o5
15.31767C06l03l6J87J54o2k07l9J05l0J03J34k2j61m5j03l7j08o7j86k16M3J16K6Q8K00J10M3
15.13741gJ87j25r5p4J0M3l8O5j15J9Q5K03J35O9k23j71l7j16m1M2l2l1K7r1JJ35j08m9J79J13P5
14.93045C5o3k02j79j22l4K52J82k26k57J15K06J86Q0J57M2m4mj49N8j7k33J76J56m8n2J63J30L7
$$ y = [-343, -207, -122, 114, 248, 87, -1, 13, -28, -36, -84, -136, 31, 77, -18, -41, -128, -130, 64, 241, 244, 266, 250, 190, 188, 188, 41, -92, -259, -165, -44, 67, 146, 86, 46, -56, 95, 236, 79, -5, 10, -60, -56, -90, -231, -321, -183, 104, 42, -124, -80, 146, 138, 156, 171, 209, 259, 234, 102, -54, 96, 223, -72, -160, -39, -22, -57, -76, -59, -104, -133, -195, -188, -144, -66, -141, -32, 110, -85, -55, -22, -76, -186, -86, 65, 103, 94, 48, 93, 47, 5, -11, -215, -263, -60, -122, -147, -94, -128, -206, -246, -216, -205, -122, -50, -211, -345, -301, -192, -277, -343, -369, -348, -178, -103, -14, 43, 107, 0, -61, 45, 112, 166, 242, 25, -1, 226, 182, 131, 168, 235, 241, 197, 5, -37, -102, -117, -54, 101, 95, 149, 128, -66, -154, -170, -139, -114, -68, 83, -9, -6, -118, -48, 11, 115, 234, 371, 306, 3, -33, 154, 308, 246, 39, 0, 105, 75, 178, 312, 290, 129, 84, -19, -56, -164, -231, -417, -633, -590, -474, -448, -360, -160, -50, -7, 180, 55, -40, -114, -104, -61, -99, -34, -149, -130, -45, 158, 293, 362, 139, -32, -69, -185, -226, -184, -216, -247, -220, -311, -310, -175, -283, -332, -153, -40, 35, -28, -230, -409, -531, -565, -313, -131, -357, -614, -499, -293, -107, -27, 130, 172, 128, 124, -25, 33, 16, -217, -41, 115, 67, 15, 178, 308, 345]
14.74351C45j38p3Q0Q4j04n2L9k8rkM0pJ03ok59k96j47o8J50K82k0j69K12J08j20TM5P3m2J23K12
14.53654B36oj55J3K43P9j02j71m4q2k02r5J26Lo0O9M5Q8j2Q0k5k39m8n7J17J44K06J57M2J19O9
14.33625E38j52q3j73j27P7m4J20J75n3k9J62o6j31j95q7j9k19q1K78K50L9j16M8N1m1l8J1J17K3
14.14264B35o6M1Q4n9j64K8p7J65K16J9o0l4O6Q0MpJ19j18k03J82L06J07j9n4j59M9j27J86L38
13.94902A078L24M67Q32J566K683L663nl988l271j361o36m33l34j77r1k5Pr9MR2K0N1o9r4n9M8Q6
13.76876B79j15k91k08l6J17J25J49R2kq6j8N5M5r6J9m5j18j28J26J98O7m0QO3n3j08o1l2Q4J91
13.56847A81r1r6m5n7J21O1l5j7k9j89j88p4R5O4J42J00Q3K3K35R0j40n0k70k73L6Lj8M7O2RN7j3
13.35483a76j56JJ30pqJ8j05N5j0Q3j0J66Jj05l5p8k9j37R8M4J24J13O4J77j76j04P4q1l7O8k3n8
$$ y = [345, 207, 134, 214, 298, 194, 142, 181, 153, 144, 142, 182, 175, 278, 272, 13, -283, -430, -498, -348, -66, -86, -255, -43, 65, -55, -175, -130, -57, -99, 24, 236, 230, 75, 88, 331, 410, 308, 137, 93, 11, -191, -286, -160, -157, -217, -148, -103, -15, -27, 53, 28, -211, -259, -316, -199, -55, 151, 308, 350, 469, 538, 386, 303, 130, 3, 80, 36, 156, 331, 278, 249, 411, 345, 214, 19, -68, -87, -306, -387, -109, 141, 180, 64, 112, 163, 122, 84, 95, 212, 235, 169, 210, 294, 235, 71, 99, 22, 187, 403, 422, 362, 328, 394, 474, 478, 471, 590, 472, 269, 451, 757, 864, 845, 791, 632, 681, 554, 740, 1078, 1402, 1869, 2701, 4267, 6950, 10613, 10608, 6620, 3349, 1988, 1352, 919, 585, 408, 317, 292, 299, 200, 204, 296, 316, 367, 298, 204, 145, 193, 279, 164, -127, -335, -371, -254, -129, 20, 112, 110, 24, 6, 61, 106, 10, 29, -16, -134, -262, -136, 62, 129, 89, 97, 160, 107, -1, -62, -94, -10, 181, 90, -6, -51, -108, 13, 74, 39, 22, -7, -196, -384, -458, -363, -299, -157, -57, 26, 49, 284, 374, 234, 184, -86, -359, -323, -320, -338, -291, -229, -220, -163, -176, -332, -331, -201, -208, -216, -198, -303, -248, -258, -175, -185, -19, -18, -123, -158, -236, -265, -402, -304, -260, -136, -23, 41, 218, 42, -62, 12, -69, -106, -38, -61, -119]
13.14119a19qj1l1r5k5L5R2P5M2j24LK39l2r7R2O2k18r7Q1J30j4J5k04r9L0J22N1L7o0l4o1j05
12.92755c28j12m1J77K18K17j33LL9L4l4K3p1p0q5p0o0L2J53K7P2j39j91J51J91J92R3k03j53J92
12.73393A24M7Q2J3n4k56k74m1J78M0L5L9k1j46o0j13l7K70O8m6K75J31j54k28k05L4J36O6J4j33
12.54032b16p1J02kl4L2J65lj15J9m3J63J97r7j3jj28j61L6Q9k3j9TQ9J92K31J3m2k11j30R2J8l7
12.32667G3J81L1m9TJ58J12j12j96p6q1J5k5j07J7l2L9J33j31K4kN1J14Mj28L0M6O8o0j04j86p1
12.11971c13l2K37J51q6j16M7J74J39j37j4J2j0K64l9k29j32L2J74J9r3k36j15K1P4MJ59k3j08p7
11.92609b53j2j5R2J38J07j28r4P2J11j36j69q9J64J02J34K31O2q7M0m9N6j18k35R9J96M0j36j31
11.73916hN5J55Mm2o3r8k85m9M6k4J03K62L5K0Pq4J06K9M1j42O0j83k55q0J41K27N1k8J56l3j09
$$ y = [-119, -127, -138, -169, -264, -289, -254, -162, -87, -45, -169, -166, 73, 41, -56, 36, 98, -120, -217, -136, -6, -20, -5, -209, -308, -278, -156, -105, -68, -128, -162, -223, -328, -440, -481, -304, -86, 131, -2, 1, 40, 74, 40, 63, -8, -78, -163, -233, -293, -261, -108, -81, -9, -148, -339, -188, 3, 195, 288, 85, -68, 124, 171, 253, 266, 212, -44, -318, -359, -181, -141, -106, -67, -88, -234, -294, -407, -444, -174, -106, -152, 123, 254, 100, -128, -333, -299, -163, -97, -83, -216, -287, -185, -187, -221, -189, -24, -27, -142, -123, -166, -3, 194, 97, 84, 83, -45, -206, -170, -81, -104, -123, -142, -53, 139, 370, 383, 341, 130, 0, 92, 110, 73, 254, 285, 236, 187, 345, 457, 345, 149, 73, -8, 7, -18, -125, -108, -140, -101, 32, -99, -75, -77, -26, 88, 92, -36, -6, 40, 108, 48, -56, -242, -313, -345, -108, 43, -43, -159, -112, 62, 201, 64, 50, 62, 52, 316, 277, 48, -84, -52, 122, 141, 48, -188, -303, -282, -208, -204, -45, -68, -176, -253, -265, -280, -188, -50, 57, -71, -165, -93, 18, -118, -287, -376, -212, -110, 24, 255, 317, 230, 270, 221, 277, 159, -76, 23, 219, 259, 123, -8, 47, 202, 206, 164, 101, 3, -282, -331, -285, -309, -206, 56, 91, 111, 118, 34, 140, 169, 210, 68, 128, -55, -310, -390, -249, -22, 29, 1, 157, 124, 15]
11.53219A5L0Lp8OKJ0j0P8LR5J56j71m1k2j79L5m0j01ok7L8R0q2NJ41K30J67q1q8l8Ol3j55Q3J06
11.29852A47m3J25%l19r4o2M7J24R2M4n0p0L4O0K0J1k8L3J66K1K4n9L1K71R5l82j53j14j12q7K03
11.09155b5K54Rj57j67p7N6J32m0j22Q8pl87p0J73J68k5k23J68K89J44J12n8j20k9j74LM6M7P7
10.89794H5J79lj47l4R6J2r2k1m3j89O0K49Rk12O5M4j43J2J82J14J9nL1j07Q7J11%n6j12j14J45
10.69097B22N0k0p3j12PJ00P0L6r5j7j08j26P3J4n9Q4P4O1m4o2Lj43l4P4J55j78j00j1K5j78jK02
10.47733a11J20K39J19j53j55J13J20j06j59q2J04J71M9j77j02LJ3n7O0LRm2r4o1j0j05n1lJ4J6
10.27704c15j5J28Q5L4TJ6N3O6P0L1L3j03j54j25M9K6j66O5J74M6p4n1J24K3q1j88J9K4Q0J8k8
10.07007a02J37R6KJ1N8J8j74j43M6O9N2M3J9j9Tq8lJ51rL1m7j85j47lo0J0J82T%k10l8O5J38m3
$$ y = [15, 45, 48, -30, -24, -22, -12, -22, 56, 59, 154, 310, 139, 98, 76, -103, -68, -108, -209, -215, -242, -204, -114, -196, -191, -50, 180, 347, 266, 178, 140, 146, 113, -42, 41, 147, 104, 229, 229, -90, -184, -246, -199, -75, 17, 61, 11, -59, -25, 35, 55, 66, 38, 71, 237, 258, 282, 223, 254, 525, 620, 238, 85, -29, -141, -228, -25, 229, 238, 81, -86, -163, -107, 25, -15, -137, -49, -56, -443, -513, -340, -172, -197, -420, -252, 37, 181, 293, 235, 115, 86, -88, -85, -39, 8, 85, 264, 261, 114, 80, 176, 188, 96, 75, 32, -157, -97, 152, 161, -51, 14, 58, -85, -73, 109, 223, 242, 237, 268, 161, 248, 359, 359, 303, 191, 77, 222, 272, 252, 179, 67, 74, 174, 244, 280, 185, 168, 60, -66, 7, 21, -38, 46, 120, 181, 137, 75, 78, -65, -99, -25, 130, -48, -148, -159, -134, -312, -313, -111, 9, 248, 367, 214, 59, 172, 292, 186, 27, -55, 49, 220, 269, 92, -10, -7, 6, -51, 9, 12, 21, -21, -115, -176, -186, -291, -342, -345, -331, -315, -330, -202, -117, -83, -49, -33, 20, 86, 156, 187, 220, 117, -37, -162, -113, -87, -253, -188, -14, 32, -42, -93, 31, 54, -27, -215, -196, -172, -92, -74, -102, 35, 131, 133, 144, 202, 220, 46, -97, -51, 18, 70, 113, 132, 113, 94, 6, 3, 154, 145, 176, 129, -56, -203, -206, -266, -256, -74, 108, 108, -102, -140, -75, 63, 20]
9.84308B0o6k37K2p1j2lj0R4O1M1j3nQ0K45K4j15q1j2j17j98k9J42N5K9J18n0N5Rn4j05P0J21J2
9.62276B0Qp5q3k11J39j5j28LM5QJ24K42P1j52n9Q2o5m5j02p2J53K7J57J4omj42j27M2L6J52j24
9.40911h7q3j08j74J98j03K2K80K29N6k83r3j59O6R8m6J19J47j45j33J7L2J56J67L6K8k1O8J7r9
9.21550B02L2q6j09n9J33L0r7J33J63K2r2m8K3j29j35rm4J47j10p6J41P4M0j00J90m5P7r3k80K0
9.01521h5J80J65N2o1j93k64j75j09J26L16J39R7k3L3j34q7p7J12O6j43J24jk6N1o9KK57O2r3K7
8.81492B69j55M9O0n9J09j7KR9k45j91L3M6j12r5j41l19J12J64J62J4qJ10l5J10K57j84l56L0R4
8.62131a97r9J14K56o8j81OK84R7j19L8m1M6%m6m1p2O5J8R1j49j28l3J0N7M4Rj18L3n9j23l0J54
8.40766a82k81o9K82R0J54R0L7j09j0R8j1j03j8j73j00M1J23O2J19n8k63k1J39L9l0Rnj5o4j34
$$ y = [20, -46, -283, -261, -332, -344, -347, -357, -263, -202, -161, -174, -179, -99, 146, 170, 55, -26, -38, -155, -353, -382, -240, -185, -156, -38, -88, -33, -24, -78, -183, -113, 8, 20, 28, -47, -130, -341, -202, -217, -345, -342, -297, -289, -165, 77, 148, -4, -63, 19, -46, -91, -193, -265, -112, -85, 72, 86, 80, 76, -66, -193, -151, -115, 37, -87, -170, -278, -452, -254, -357, -335, -55, 174, 230, -53, -146, -305, -239, -141, -187, -68, 79, -66, -199, -182, -150, 6, 173, 209, 237, 216, 284, 301, 202, 234, 148, 39, -20, 113, 143, 46, 179, 342, 364, 272, 224, 247, 118, -17, -26, -70, 77, -33, -109, 32, 106, 146, 46, 236, 191, 268, 175, -105, -85, 95, 260, 312, 251, 58, -206, -381, -490, -364, -48, 91, 188, 165, 198, 64, -23, -100, 12, 78, -65, 59, 58, 32, 83, 14, 16, 273, 335, 242, 269, 114, 163, 223, 164, 273, 256, 258, 357, 112, -79, -46, 0, -112, -207, -348, -667, -555, -391, -229, -215, -223, -113, -148, -38, 219, 35, -321, -291, -197, -296, -182, 74, 6, -175, -169, 115, 212, 93, 131, 90, 136, 136, 90, 49, -23, 42, 60, 151, 2, -126, -159, -149, -92, -48, -39, -157, -124, -183, -306, -336, -182, -463, -532, -250, -160, -6, 84, 121, 12, 2, 100, 89, -14, -32, -205, -305, -264, -141, -79, 40, -18, -281, -302, -163, -124, -154, -145, -150, -165, -229, -363]
8.20737c63Q3K54P5N4M2p5J1J43N2j50j45J81k0N1M5P2lp8j88p6J41J04J4n4l9pj58j32o2J19
8.00708a09j09r9r5M0K11R5j43n8m5Q1J03O4Qk6J50N0K8n5j20m7m6J05K58J14j70n3r0N4P8l9
7.80679A35J35k2j79o8m7J69L0r4N8O9o6Qp3n2r2o0J09J42j0Qq9TML7J13J04L9km7kp8j30O5P9
7.57980A04J74p9k69J40J62k13o0P1o1M5pl9j06R9J20P0p6n4k06l8N1J04J40L7P3K8p7j14o9nP4
7.37283A9Q9n5K1n6P5P8J78O3l8j11k08l8P6or0n3j21p1J69m6r0M1K60J03j46m7j09n6N6j2j46
7.16587b71J8QL7J4K12R1OJ16o4P7N5j80n2N8M0j0j63J24j0J7J9J75lj51q5k28K22L01o9j07N6
6.95890B53j62j22j4O4Q2p1J04M2J8r8n5N3q6j52MkP6k5M2J47L6o1r5J88J8k24j53K7j7j38O9
6.75193b52J99J83J1P0J3j50r8j46l1k1J15J33p1k1M7j26q4J76m7j3k6N1J16K07K9jj86M2p2q1
$$ y = [-363, -280, -26, 49, 103, 145, 70, 81, 224, 276, 126, -19, 162, 142, 193, 238, 310, 307, 229, 41, -35, 106, 210, 224, 170, 131, 124, -34, -166, -228, -109, -218, -317, -412, -372, -161, -66, -209, -267, -312, -231, -128, -64, -56, -82, 68, 118, 146, 91, -29, -76, -122, -17, 241, 355, 185, 132, 42, 96, 174, 135, 270, 248, 69, 1, -46, 123, 153, 59, 117, 186, 120, 128, 55, 3, -89, -149, -40, 102, 92, 100, 11, -78, -74, -37, 76, 180, 219, 217, 170, 168, 90, -40, 25, 104, 278, 199, -70, 70, 232, 19, -41, 30, -31, 14, 7, -32, -138, -39, 81, 151, 75, 21, -185, -223, -172, -68, 72, 109, 182, 210, 133, 19, -50, -55, 19, 108, 53, 74, 18, 93, 171, 349, 412, 374, 263, 55, 17, 93, 87, -3, -56, -177, -248, -79, -125, -215, -174, 86, 189, 43, -4, -113, -169, -113, -125, -271, -253, -245, -208, -194, 18, 109, 115, 231, 167, 244, 299, 119, 67, 125, 165, 155, -8, 116, 106, 123, 142, 317, 314, 163, 78, -150, 72, 373, 304, 197, 253, 91, -31, -45, 19, 101, 30, 134, 176, 194, 96, 41, 94, 8, -144, -140, -142, -66, -91, -49, 98, 134, 73, -22, 166, 184, -40, -193, -166, -183, -321, -252, -53, 130, 141, 211, 224, 74, -24, -170, -201, -222, -107, 26, -45, -66, -19, -145, -229, -53, -100, -113, -139, -88, 28, 235, 264, 263, 77, 119, 47, -34]
6.55164c4M6j36J8r8k38J13P1q9j9kmK72J90j8J25Q0j6j23j42J41Or5o8K4K71j4m3j5o4J26K1
6.34468B86j07L7q8j78k8r2j42LK47M4R5M6O1K9J25J37j59k04M6m0J9p4p1l4j26m8Q9oj0L8J8
6.13771h7J12M8P5Q2J45p4j45j43L8o0mR0L0n7k31N6J03%J5l8m3m6p9P7P3n6n1K6m5L2J66j09
5.92407a00j19Q5j1J16J65k9j90j16Q4j9j13k7J13J79j61p3N6J63O9j20j09Q1N0n6k0J16k7o9N7
5.73045b5J42j03M2J7Q0k8o1j85J11J78l3l48j01J89o6j7J5j73Q1Q5m8j42K4O6J06J94J37k6j27
5.53684a6Q1L8k68p9K0j20L4K78J59p5k22l9k6j31J41J95P0O3j67k24O5M2j9M8J40p5k19P9L8K
5.33655a87j8j10P9P6q2o9J1j07O2J63j0j9R7J54Kjl1j31j00J01Q2o2Q8j60j70j74JK27J97lK14
5.12958A20J39o7k2ro9o8K3L0P0n5L7j17o8k4R9j3r9K1K31Q8m7J2k9k23j03J11kK0R5o7j29PJ9
$$ y = [-34, 12, -124, -106, -204, -442, -329, -258, -347, -366, -368, -372, -100, 90, 72, 197, 277, 261, 138, -4, 137, 143, 48, -20, 4, 275, 261, 218, 203, 139, 265, 286, 179, 216, 128, -50, -78, -170, -312, -309, -62, -18, 77, 123, 184, 213, 338, 475, 316, 112, 158, 118, 137, 63, -8, -42, -168, -216, -127, -133, -143, -105, -87, 25, 73, 148, 230, 375, 301, 156, 13, 51, -9, -13, 77, 107, 50, -181, -125, -22, -22, -7, -45, -88, -134, -213, -136, -63, -119, -170, -144, -189, -157, 9, -100, -219, -134, -145, -29, 136, 107, -83, -199, -115, -134, -247, -274, -161, 18, -143, -216, -160, 3, 72, -48, -157, -76, -26, -82, -102, 14, -13, -82, -25, 117, 14, 56, 73, 153, 125, 64, -121, -10, 168, 135, -213, -314, -125, -191, -208, -193, -366, -285, -200, -248, -390, -366, -300, -194, 0, 137, 111, -16, 65, 103, -165, -244, -224, -344, -310, -32, 127, 52, -170, -209, -235, -366, -225, -30, 40, 103, -64, -288, -223, -181, -200, -152, -12, -87, -306, -227, -189, -187, -205, -315, -236, -160, -242, -311, -300, -407, -345, -182, -192, -211, -114, 40, 42, 41, 10, -121, -221, -120, -38, -100, -12, -172, -342, -516, -515, -288, -91, -94, 120, 259, 192, 170, 161, 92, 24, 47, 77, 147, 92, 129, 12, -56, -80, 19, 6, -93, -72, 159, 247, 200, 212, 183, -40, -143, -32, -34, -14, 81, 14, -115, -108, -89]
4.90926h9N2R5n1J49o1j18P0J57R0j24r5p3K2K9r9J5J04J05q1J13j7j33p6R4k2r7N2J81k2j12P9
4.70230A37j91n3J63j70o8M9O4k0r4J65q3j64kP4o9K13m2j29J32N3mL1j6J9R2O4Kj19j59L8Q5n2
4.48865e4j67N5K20J89j62j63l7L4J7TM9L2m0oR2J8p1j79k05J19rK15n7j7J33M2j68o8k4J20J69
4.28169I4pM1k15n6P0J36j1m6J8j17j45m7J07K19O8l2lm6j71q3J85J51M5K6J88P8n6r2r6PJ11M4
4.06804C65q0j74q1o9k5P6J27l1p5loj93p4Q6R6o2j54NJ4R4r3J00Q1J34J06N9j19K01L1o6N6j86
3.85440A40k11K7K0L0J7o1j85o1R0K61J60M2K3l05q8K1r3J8K08lpJ30j51k9M0l0k8o1n2l8K3n
3.64076a58J77J33k66J6R5L8q2j00M9J42P3J9L3N9q8n8r9%J77K0j10Ok0PJ22p3j31K9k0r4J47
3.43379D3J35p8N2k67j54J32J5P4J02r3j24O7O3j41J01R8j35OO4R6j39J05j4l5P8k8mR8Q4j25o9
$$ y = [-89, -37, 58, 7, 156, 95, -23, 47, 204, 294, 170, 75, 2, 24, 53, -46, -31, 73, 178, 97, 210, 193, 60, -16, 78, 56, -41, 11, 192, 170, 58, 137, -54, -107, 56, -114, -182, -133, -69, -89, -183, -18, -101, -265, -267, -193, -262, -49, -91, -220, -88, -35, -39, -8, -24, -5, 87, 151, 153, 34, -125, -87, -2, -54, -221, -166, 54, 243, 81, -82, -119, -85, -68, -51, -2, 30, -10, -16, 76, 94, 23, -156, -361, -242, -251, -36, -93, -110, 23, 65, -103, -171, -195, -75, 94, 87, 128, -87, -143, -73, 63, 52, 6, 24, -93, -238, -285, -178, 41, 109, 77, 74, 28, -143, -226, -41, 110, 155, 181, 369, 447, 391, 299, 203, 210, 321, 365, 285, 111, 30, -39, -64, 12, 139, 108, 33, 30, 24, -169, -243, -157, -61, -123, -277, -272, -258, -164, -257, -157, -76, 58, 164, 223, 104, 305, 336, 270, 326, 140, -71, -44, -24, 6, 23, -38, -223, -284, -194, 67, 227, 269, 292, -13, -101, -80, -173, -155, 53, 50, 43, 173, 22, -7, 33, 3, -25, -86, -138, -176, -153, -158, 19, 152, -114, -98, -3, 35, -47, -147, -98, 44, 117, 136, 169, 228, 140, 82, -17, -17, 160, 180, 70, 76, 56, 63, 185, 112, -19, 10, -10, -104, 43, 178, 100, 152, -115, -269, -137, -122, -48, 54, -39, -163, -96, -33, -174, -73, 25, -110, -104, -40, 56, -83, 22, 8, -27, 51, 23, 19, 117, 201, 76, 7]
3.22683GP2m6j85QJ21p1q6L05ll75m3K11K00Q5O0j54k23m4k7J22j8q0K06J34qp6l4k36n7J8r1n0
3.01318c58m2O3J03j0J23O8j32l9j11M1P2O5k3l05j29J00k1K36J29r5J2L2j7K88K70L1k36m2o5
2.81957Hr4K4O2J15l0M8k74R2K10K23J10n7k00l7j72j65J81oj44N8mR3J56k37k08Q2J16J07K8
2.62596H5k26j57J24J22J4J1RJ57O6r6j89q4l5R0M8j23k4K36N2J5j0NL9k19k9J9Q5l7o7J8N0J83
2.41231A32q0k79o4Q3qjK3J2K8j36O2K43J59J9j39j27R3l9j16m9m4K6P6j6j9k5j5R5J56J15Q8n5
2.19867A98k35K54J27J7j06j56j19pm4p3j5j49J71nq4j32L3L26J63p4r6q6k4J7J2Q5J36l8k58
2.00506a62j67oJ43J21rl7J2J03jm8M3P5J10j11k89K8J36Q6N2o3j6o2o7m1m6J15L6j38j22O5K28
1.79809c2j30kO3jj14P3j02K19K27r1k93j3P5K26N2l4n8j6R3jR8l0k10j90j5J55L6l9M6k9J08
$$ y = [7, 79, 33, -152, -144, -23, -94, -180, 125, 122, -253, -296, -85, 115, 200, 260, 106, -117, -161, -188, -66, -84, -164, 42, 176, 168, 92, 58, -178, -235, -217, -308, -358, -400, -337, -234, -244, -121, -53, -185, -224, -335, -294, -222, -157, -180, -485, -614, -514, -535, -299, -170, -265, -253, -221, -238, 50, 320, 351, 115, 73, 8, -86, -62, 0, 115, 85, 133, -141, -49, 161, 384, 494, 437, 237, 200, 28, -137, 44, 38, -106, -48, -52, 41, 197, -40, -248, -166, -50, 57, 85, -141, -298, -174, -52, -38, -27, -18, 139, 205, 109, -80, -164, -199, -109, -61, -184, -208, 28, 80, 95, 85, 90, 129, -90, -119, -100, -15, -52, -119, -101, -51, 132, 52, -227, -291, -208, -216, -217, -194, -182, -154, -290, -228, 15, 174, 193, 54, -73, 20, -19, -135, -184, -228, -202, -126, -142, -161, -186, -201, -106, 50, 165, 253, 198, -37, 217, 344, 361, 255, 99, -20, -27, -71, -144, -159, -308, -137, -142, -226, -358, -325, 1, 164, 90, -6, -92, -116, -99, -87, -2, 134, 96, -162, -329, -335, -192, -71, -80, -117, -105, -2, -3, -51, -8, 67, 177, 66, -223, -195, -59, 27, 79, 16, 0, -62, -129, -170, -216, -101, -65, -203, -325, -260, -32, -162, -164, -101, -102, -216, -143, -245, -26, 201, 110, -183, -196, -121, 105, 157, 123, 65, 49, 142, 141, 239, 209, -1, -191, -206, -51, -15, -54, -8, -37, 71]
1.59112G1j23J11M0j07p4n0j89k33J25P1P5J55j7j57p6R1K62J49l00R3K57n6J7o0j23J63J64q4
1.40419A95n2j23N5k97M2J4j02m2M5j28r2R2J02O9l3J81R4J9j8j4J51M7k12R9J68j19r3nj04O4
1.20389CM1J14l1j79j90lJ26P0J79N5j11l7QJ15Q0l1j6L7m5K4J39M5j36j81j33r9l0MJ09K53P3
0.99693B53j19j81j00R7J80j69n5J29j05M3J43J3q7K5R9r2p9l6j52J4KP2k6r3L41N9nJ38j03q9m
0.78996A13j23k5k3p5N8K02L0r3k0O4j03l3N3j3r2m2Q3n9jj58r8kj7P1K93J10jQ9n7j37m5K1J16
0.56964H6q6r9R5J59K9K01J8k68j58J7l4L1J22R4N6o9j28k9J62J42k17q9K09J05j61k41PJ5j40
0.37603a71J12NK08R5K9j1j21N6O2j86j17N0l9q0J44J95P1J05j32k3l7MQ0r6j31j27o3n7L0K8
0.17574a17J21j23m0P6l9L4J27J18M7j05j87j79oK22J98j20J06Pj29l7L2j7K0q6P7r0n1Pj0J63
$$ y = [71, -52, 59, 99, -8, -82, -132, -321, -554, -429, -358, -283, -128, -145, -302, -378, -287, -25, 124, -176, -83, 174, 118, 135, 75, -48, 115, 279, 195, 143, 20, 75, -222, -180, -166, -268, -310, -265, -393, -485, -393, -291, -222, -255, -74, 20, 39, 21, 7, 158, 205, -7, 92, 260, 141, 48, 43, -61, 3, 44, 158, 127, -52, -242, -245, -119, -49, 130, 185, 74, 37, 45, 160, 240, 209, 193, 230, 185, 209, 348, 393, 257, 76, -57, -156, -186, -182, -73, 180, 253, 134, -47, -147, -50, 130, -39, -94, 35, -70, -27, 116, 129, 42, 67, 166, 74, -5, -41, -193, -179, -177, -105, -131, -224, 117, 176, 171, 309, 206, 117, 113, -10, -35, -58, -133, -75, 127, 157, 64, 44, 108, 5, -28, 25, 12, -80, -122, -39, -98, -99, -257, -355, -357, -374, -303, -10, 100, 99, 188, 131, -6, -51, -30, 86, 0, -99, -4, 155, 184, 385, 403, 135, -23, -6, -40, -9, 113, 207, 263, 194, 66, 37, 199, 341, 124, 35, 244, 349, 188, -53, -46, -31, -171, -59, -54, 154, 249, 278, 267, 146, 202, 264, 78, -39, 11, -28, -108, 36, 231, 302, 407, 275, 252, 215, 219, 299, 203, 72, -55, -118, -175, -145, -117, 4, -119, -159, -83, -122, -88, 39, 157, 204, 99, -88, -267, -273, -51, 147, 27, 133, 140, 11, -26, 6, -11, 9, -77, 0, -90, -141, -134, -144, 19]
-0.02455A9J57M9j46j34M0jNJ59r9j86k32J1K97M02K17k78j63k9l0n2m5J45q7r2M3m9p0Q2J06j22
-0.22484h3k5J7o7nj18q7O2K24L2L9K3j98L7M2j29pl2K2J54J88N9j19P6J24j02j87K1j06j28p3M2
-0.43181c04n7J08Q7M0j5P0R4Rn6m7J0PK1p5j27q8J57K42Lj93j52JR6J56J55J5R4p6j6j02k01R7
-0.64545d7M6j73NOjJ95j02p7Q4J14N7J01J7o9O4jr2n4j56o7pQ1J10o2R8Nl5K0J06J18j66j48Mo0
-0.87245h6o4j7Q6Q4k10p8j01N1K21N1J60M6k88mJ62K5j02m1l3J38n4q9O6Q3M20J39p4M5j33k16
-1.07274A87M4r7k22k62J20J46Lj01M8JK36J73J5j20j11q8p1J73N2L2j4o6j76K4R7R6j97j51k9R6
-1.27303a62K07j9l0Q7j18p6kk6p3k9l6q2J12J43o2M6J23J07l4J10K2j26j15j6J27o1K7j1R5p6l9
-1.47999A3J06k5Tk10n1J8m8J51rQ5R8l7j25Q0J25R5j6lJ28j25l6j59k3L9r4j22o1O1j47j6K45
$$ y = [19, 176, 225, 79, -55, -15, -16, -11, 148, 49, -137, -369, -358, -61, 341, 558, 280, 117, 88, 58, 6, -39, 106, 19, -73, -30, -79, -149, -67, 39, -83, -108, -91, -158, -163, -281, -368, -306, -82, -50, -11, 12, -186, -149, -107, -236, -243, -275, -253, -99, 89, 148, 29, 105, 229, 127, -60, -39, -145, -273, -346, -304, -361, -253, -166, -126, -141, -71, 23, 32, -24, -71, -61, -54, -33, -108, -235, -323, -166, 76, 79, -114, -266, -265, -169, -13, 142, 157, 251, 175, 159, 57, -144, -47, -1, -174, -169, -163, -164, 31, -71, -148, -64, 50, 107, 208, 225, 156, 220, 219, 127, 73, -83, -150, -157, -76, 34, -28, 70, 75, 40, 60, 166, 284, 118, -30, -26, -86, -150, -167, -81, 3, -207, -285, -386, -335, -114, -63, 97, 143, -145, -149, 13, 38, -64, -105, -138, 0, -54, -143, -77, 6, 426, 565, 491, 536, 403, 187, 231, 134, -88, -350, -230, -84, -81, -182, -134, -133, 103, 276, 291, 171, 60, -28, -99, 74, 126, 158, 144, 78, -98, -74, 23, 119, -78, -229, -258, -162, 45, 26, -4, 83, -35, -111, -113, -139, -212, -241, -277, -359, -247, -104, -166, -120, 3, 110, 76, 186, 208, 82, -33, -49, 78, 17, 44, 33, 128, 52, 13, 119, 94, 69, -141, -192, -174, -222, -71, -80, 5, 103, 66, -59, 21, 146, 241, 225, 222, 350, 225, 189, 30, 7, 46, -48, -170, -231, -170, -317, -333, -88]
-1.68696h8L30j1k31j73j38J22J53Q8j00M9J96J50kk61r0J15J78m9r4j1l9j47k5Q1j5k13q1J33
-1.87390a73K01J31Mn4l9J2ln8J35Qm4j27J30m5m2lm9P6K8j88Q6R0j00L9J97J5j36l6k31j26K4
-2.08086b78K18J66j6r6P5J85Kl6k19j34p6j83J9K25R4p1j02K4O5n4j62M1J47J32L2j26m3j22M2
-2.27448b51p2m3P8q2k1M3J30J92J93Q0q3mn5n0M9l1j21n5o0R4J76O3M0j21r9k04j06P0J70o2k01
-2.48144c43o8J3J28P6K47N3Lm7j26J48R2Q8k3k07j06P8k27k00J12J37N9J52Q4j44j52Q4O1j49L1
-2.67506a46K8o6l5J4OJ72m4q0o7J61J41j5j38j37O9J71l2r7J3oR0k9j04q6R0N0J70MK5j2p9R5
-2.88870A26j54j18K26J53n8j90OL1j53j11Q0O1k5p4N7L0N8Tq1R8J41k6r8mJ17%l2P8j06RJ05k25
-3.10234b1j50K7O8K49j0j46P4R7P8N5j13j79j29O6o8K3pL4J99J61J38l0N7j17j60j96j48pL2mn6
$$ y = [-88, 242, 231, 0, -173, -311, -189, -36, 52, -48, 1, 197, 347, 345, 84, -6, 109, 287, 238, 144, 133, 94, -53, -78, 3, -12, -225, -306, -173, 28, 159, 163, 109, 70, 82, 79, 21, 156, 164, 120, -7, 123, 78, 36, 33, -16, 60, 88, -100, -14, 76, -24, 15, 212, 227, 91, 55, -176, -302, -278, -60, 106, 90, -6, 69, 254, 256, 220, 1, -133, -209, -392, -373, -148, -54, -125, -227, -203, -138, -192, -354, -313, -166, -34, -2, -128, -171, -293, -251, -323, -366, -288, -370, -391, -348, -218, -26, 167, 247, 164, 160, 105, 55, 104, 73, -48, -103, -163, -69, 107, 170, 210, 89, -10, -214, -320, -250, -80, -142, -343, -411, -398, -270, -194, 53, 106, 109, 62, -64, 84, 176, 264, 241, 34, -72, 6, -221, -421, -309, -172, -113, 39, 123, -21, -173, -89, -28, -177, -146, -118, -184, -219, -205, -199, -27, -71, -151, -218, -57, 84, 69, -69, -206, -137, 34, 2, -95, -82, -88, 2, -27, -131, -217, -127, -77, 93, 97, 122, 110, 31, 126, -28, -146, 80, 233, 175, -15, -9, 22, -131, -242, -162, -101, -126, -200, -143, -113, -55, 3, -78, 20, 161, 135, 37, 33, 150, 150, 118, 196, 90, 99, 204, -21, -171, -144, -76, 173, 163, 17, 91, 188, 266, 321, 208, 29, -100, -34, -102, -79, -86, -52, 147, 308, 446, 416, 473, 356, 196, 0, -148, -155, -123, -127, -183]
-3.30931a83O5j00j13j42P0K00Q6K4O4M6N1k9NpQ8J38J7m7j69q6J69K02J84j75l94q2L26R3j23
-3.50292A78J51K1j26q1RL0l9j2q5m5R3j8q0P0P2p3k34j74j4K61J74p6j86q1J48K74K9MK1j01j73
-3.70989f3n3R9R7n0j48L6j32r1N4j20Q2M8Q8J70K61K9l3Q3q5j27k0p9%k1J26j1j32q2rO6Q9R6N7
-3.93021B25j02j66j8Q4m5Lm6M0j28n7M6M2oN1M1k7q3M0M3O7n7q5J70K12R9Qk24k23j42p6n7O0
-4.14385c11J23nj66l6M3J21J41j38o4J06P5N0k5j36K1R9j37J20ln4J49J19l6P1p2Pr4R4r1j00m5
-4.35082a74K4J56m5q6K5J09P0N3Oj66n9J46k00j6L9J50J10k6J76N1j20j76j65P3L9L7P8J4k0j40
-4.55111c7M6k4P4km6p3j7m4n7l2Rm1K42L0r6j35j72j96n1J69K70j00k0M8p4o5K19J35J67P9m0j53
-4.76475A3J37j75n4k4R5j91N4J70k7p7P7j7m9J12N4k93j45R8K26J29j73l1R4J22J03l2q5o8p0J67
$$ y = [-183, -118, -218, -331, -473, -403, -203, -117, -93, -29, 17, 68, 39, 44, 37, 125, 263, 280, 233, 64, -22, 147, 349, 533, 358, -36, -118, 208, 301, 178, 329, 350, 224, 143, 152, 182, 143, 131, 46, 1, 94, 76, -4, 66, 138, 65, -169, -343, -357, -96, 78, 2, -184, -265, -117, 157, 186, 190, 211, 110, -63, -116, -17, 80, 30, -118, -82, -214, -305, -251, -371, -289, -241, -153, 17, 278, 307, 274, 357, 272, 145, 125, 46, 46, 25, 151, 140, 8, -74, -83, -17, 72, 168, 225, 123, -43, -61, 23, -22, -19, -65, -25, -153, -210, -164, -122, -128, -77, -36, -63, -146, -106, -63, 4, -53, -138, 32, 244, 343, 351, 127, -96, -238, -314, -371, -311, -188, -193, -359, -395, -352, -231, -90, -228, -292, -186, -111, -61, -86, -222, -201, -102, -239, -119, -122, -176, -27, 92, 56, 127, 55, 62, -32, 62, -29, -129, -174, -150, 6, -39, -125, -100, 9, 79, 132, 138, -28, -87, 59, -141, -157, -118, 32, 142, 116, 292, 343, 223, 47, -118, -45, -6, 31, 109, 123, 103, -37, 9, -15, 59, 57, 11, -62, -79, -123, -180, -212, -203, -244, -2, 28, -68, -203, -375, -571, -622, -453, -183, -283, -303, -255, -329, -394, -175, -40, 127, 206, 166, 13, 150, -25, -79, -103, -8, -199, -145, 25, -2, -79, -2, -19, -68, 44, 98, -195, -340, -242, -16, 113, -60, -91, 3, 125, 228, 196, 111, 43, -27, 140]
-4.96504A40j3n2j19J2L2K24Q5j87k45RJ11M3q3j1J87R2m0J8M2nKj44PR4j45J04Q8q9j62n5m9M1
-5.17868f8K07n7O0K44n8k63K9m1m3P0j44k28R5J00j5j45O8jq6J18J62q9P8N4k9nM8J06On6j16j5
-5.39233a4J05r0j86p0L4J74J22J58R2j16j08k07M1p1k0K5l8q3J7To7j10J60R9J30O0O2l4j54m1
-5.59262a13J35P6j74j23J83J60j36k36K5J10J0QO7J01jL0j5j49O2l7p7J1N2J55J8q6J01J89n1k15
-5.79291H0o0j16r0Q9J64r2j22ml5k31j35P6J08P6J25K5j43K6K30J53Pq2m6j33J6NR6L4k1N1j24
-5.99987g3k22K4J83K13rj20J00J55Qk60j55j25k2o6J09L7R8J45L5o9o8N5K28k5j25k24r6j10J73
-6.19349b06J98L2m7n4J38L1N0mJ10o0j74n0kM6J33N5J17p1J9j3j07q3K15K06P9p9q8M2p0m4p8j35
-6.40713A06j65M1ro3OJ8n4N2nq6j17R0TJ49r3k7K47K7%J24J04J63L4k65q1J2j3m9K4k6j45j06J22
$$ y = [140, 127, 75, -44, -32, 0, 224, 309, 122, -123, -114, -3, 40, -43, -54, 133, 225, 185, 203, 245, 240, 242, 98, 105, 199, 54, 158, 246, 157, -5, -60, -109, -68, 139, 82, 142, 386, 328, 65, 94, 53, 10, 80, -64, -292, -197, -97, -112, -257, -189, -190, -276, -158, 4, -85, -7, 47, 18, 13, 61, 167, 173, 117, 1, -14, 91, 1, -185, -255, -221, -47, 75, 233, 325, 209, 101, -106, -65, -136, -156, -131, -169, -252, -235, -218, -285, -395, -235, -136, -6, 54, 116, 82, -72, -113, 22, 98, -76, -199, -16, 144, 8, -228, -203, -93, -83, -75, -8, 93, 92, 122, 107, -42, 20, -17, -94, -83, -31, 124, 142, 56, 157, 346, 295, 80, 20, -96, -186, -97, 67, -25, -147, -151, -186, -417, -552, -476, -368, -292, -167, -142, -285, -259, -29, 124, 131, 49, 3, -130, -114, -109, -13, 21, 0, 51, -73, -295, -271, -88, 125, 116, -4, 96, 251, 259, -1, -156, -281, -303, -369, -260, -223, -125, 20, 55, -14, -82, -27, 201, 176, 51, -173, -269, -379, -206, -8, 24, -23, -77, 61, 92, 142, 138, 248, 188, 14, -36, -38, 8, 141, 196, 313, 242, 261, 248, 141, 58, 273, 479, 558, 479, 391, 433, 363, 319, 241, 106, -59, -18, -27, -90, -84, -66, -120, -68, -73, -159, -276, -186, -96, 53, -40, -67, 180, 207, 207, 331, 435, 598, 632, 367, 286, 298, 285, 236, 260, 234, 89, -17, 105]
-6.62745A05P5o4l13o2P0J23J19nk2k1j55p6qJ22J15r0L4Q7j9j28J33k0r6j00J04m0n1P0n8m0j6l2
-6.84109b59kP6k2N1m7O7qp9L6J58J0J3N0M1n7PK0M2o8Q7q8n1o8J46k5K80R0j23k13j62n5n4j2M6
-7.06809a73L8N5l2j50k0J74Q4k8k3j16TQ5Q1J86o1j45mp1L3j00Q0R8J62n0j65j8j02m0K8TJ57Q5
-7.28173d0J25m4l8k5J11J13j55q2nLN8J02n0q5M8J30TJ25J01j13j45m5k7r9o5j73k8K60p7l7M8R8
-7.49537A19R5l5r2n1Q4Rj14J08P3M8om7l2P7R3j29p5p0k17N1L2j71K44J75K0j16j17Jq6j02O3K41
-7.70902G3J26n9k49k9k4J14J11mN5l2R8m2k62k18NJ10N0l0q6j76O1Q8j8j31j9Q2L56J66n8j62M2
-7.91598f2j65J70J73m0j27o0o6l5J55j7Q7O4p1o2Q6L3L0j15j73j09j3O5J0O3J41m7mM3O9Kk27J36
-8.12963f6K95J8l7k23n5K25J86j14j54k07L4J16r9j95o4K40K41O4k30j42O2L7n1k28o5j15r8Q5K9
$$ y = [105, 180, 116, -197, -259, -189, -66, 53, 48, 26, 5, -150, -226, -234, -112, 3, -87, -53, 34, 15, -113, 20, 0, -96, -196, -92, -132, -183, -113, -171, -211, -227, -259, -261, -185, -207, -156, -203, -136, -144, -223, -187, -29, -19, -6, 44, 85, 28, 35, 55, 97, 29, 116, 28, -23, -91, 55, 30, 310, 400, 277, 64, -98, -153, -207, -219, -173, -135, -80, -112, -262, -282, -108, -24, -52, -75, -191, -307, -222, -141, 45, -16, -161, -165, -236, -203, -303, -223, -125, 37, -13, -178, -196, -298, -338, -310, -282, -125, -40, 85, 41, 3, -22, 89, 202, 47, -35, -40, -37, 21, 123, 73, -12, 36, 166, 296, 421, 522, 409, 264, 219, 192, 93, 28, -145, -173, 87, 10, -27, 21, 119, 214, 179, 87, 36, 120, 129, 15, 123, 196, 244, 238, 191, 159, 236, 329, 200, 125, 55, -162, -111, -79, -250, -6, 169, 189, 73, -44, -43, -129, -231, -168, 73, 199, 140, -109, -138, -162, -48, 63, 59, 114, 82, 180, 138, -124, -342, -337, -227, -177, -207, -293, -469, -408, -320, -338, -469, -488, -406, -50, 116, 58, -104, -62, -227, -57, 116, 76, -51, -111, -177, -212, -57, -74, 13, 77, 6, -56, 30, 63, 93, -22, -195, -304, -317, -252, -242, -179, -38, -85, -89, -46, 23, 25, -202, -66, 229, 247, 210, -13, -68, 157, 343, 229, 75, -132, -98, 18, -81, -276, -340, -100, 141, 205, -25, -167, -105, -68, -119, -347, -412, -527, -625, -540, -511]
-8.32324e11K96J20m0l5j07n5p4j05Q5L2J61J07J52O2j75j19O5j1m9K3j8J01L4kM0R0P2l8k2p5Jm9
-8.53688d4L0J53Mj30l02j1J27Q4R6M1R9J92Q0j04k57k24n9L32J44j02k4j38k78M4Q8TJ36l8P0o9
-8.73717B8M6M1j0Q4k6Kq1l14K3J78nL1TOo6k2k7n5l0R4N2K8l8k13J36Q5j0L1m8jj8j01J35J55k2
-8.97084I9o7j69m3lJ2P1R8k6l4J07l42mJ68Q8K52l9l29p1L9L40L9o2J28J50j37j44j25J8O7N8J38
-9.17781B77q7k32L7k0K2o2r6j2J1l8J0O5K3j36k5K02J55j15q1PO1K48j74k63K7N7o6P5R0P3O8N5
-9.39145A56q2P1m5k2L9q3o0j32P8L6R1n3P4j31r1j0r1J10Q2j39R4J67j19m9MJ33m7k48j45pK51
-9.59842a68K12K2K6M2k16PJ24O5p6l8k1j36j7j34N9J44J89K14J3k22l5J47p4k11p5l7j24r1O0M0
-9.79871c11l7J2q6K17Nl6N3O6K0m9j09R9MN5J85K02r1r6J15J22o3l9p3j35L6N4PJ57j32K5L2r7r1
$$ y = [-511, -215, -95, -135, -170, -277, -332, -406, -511, -426, -394, -233, -126, 26, 88, -87, -206, -141, -152, -201, -178, -196, -95, -61, -63, -23, 67, 139, 101, 79, 4, 5, -44, -14, 139, 143, 13, -289, -300, -173, -89, 7, 48, 147, 339, 419, 315, 58, -166, -225, 107, 251, 149, 125, -13, -291, -247, -159, -71, 65, 27, 97, 28, 74, 115, 105, 189, 163, 165, 84, -230, -207, -29, -34, -3, 28, 34, -32, -54, -81, -136, -166, -72, -20, 8, -30, -243, -107, -22, -32, -1, -49, -50, -68, -169, -34, 121, 99, 32, -137, -180, -183, -171, -100, -2, -28, -62, 45, -297, -301, -133, -45, 207, 168, -161, -232, -193, 147, 186, 124, 252, 402, 265, 121, -4, 14, 81, 139, 277, 190, -42, -5, -25, -3, -65, -161, -173, -162, -200, -190, -125, -102, -238, -263, -61, 94, -21, -102, -95, -34, 214, 40, -223, -196, -139, -205, -130, -40, 33, 101, 156, 74, 145, 100, 78, 117, 34, -26, -158, -80, -44, 47, -6, 68, -63, -154, -164, -255, -145, -63, -202, -108, 59, -60, -109, -105, 28, -19, -267, -412, -419, -168, 44, 66, 92, 134, -82, -75, 49, 114, 38, 0, -21, -157, -174, -308, -249, -105, 84, 298, 311, 89, 54, 201, 127, -84, -159, -196, -320, -411, -351, -311, -348, -336, -422, -205, -200, -236, -183, -117, -97, -146, -255, -156, -152, -97, 88, 290, 199, 103, 218, 340, 277, 238, 165, 30, 66, 120, 127, 284, 152, 177, 209, 112, 21]
-10.01903B1Q2j90M2k9L3n6q0O3K34N6oK3L9oj67j49Q2Q5L7N1j26j76j17J00K56Q2k9k2k3k68k3K24
$$ y = [21, 103, -87, -45, -74, -41, -97, -177, -114, 120, 176, 170, 193, 232, 226, 59, -90, -8, 77, 114, 165, 39, -137, -254, -154, 102, 184, 155, 133, 110, -158, -181, 43]
$$ [...]
-10.92701A00    $$ checkpoint
##END=
