##TITLE= TK 1; Methyl N-Propargylindole-5-carboxylate  / CDCl3   BB
##JCAMP-DX= 4.24
##DATA TYPE= NMR SPECTRUM
##ORIGIN=      varian
##OWNER=       haider
##DATE= 
##TIME= 
##SPECTROMETER/DATA SYSTEM= 
##.OBSERVE FREQUENCY= 75.4291
##.OBSERVE NUCLEUS= ^13C
##.AVERAGES= 320
##DATA PROCESSING= 
##XUNITS= PPM
##YUNITS= ARBITRARY UNITS
##XFACTOR= 1.00000000
##YFACTOR= 0.00183474
##FIRSTX= 207.860562
##LASTX= -10.903016
##NPOINTS= 32768
##FIRSTY= 0.346765
##MAXY= 60.118828
##MINY= -1.526501
##XYDATA= (X++(Y..Y))
$$ [...]
145.1497a54K82J47o4j44r8O1L7j1K1J03N3Qlj21j08P4K2M6N6Jj36j92R5Kl2oL4L6K0
$$ -154 128 275 211 67 -31 30 67 56 77 180 233 241 238 117 9 83 105 151 207 208 72 -120 -25 -23 -55 -61 -27 9 29
144.9561B9moP8m9qL1M8j02o4Q1Q3j6N8j4r6j00j2J63k7r7K8O0Ml5q0kJ00nk1j7R7l3
$$ 29 25 19 97 48 40 71 119 17 -47 34 117 101 159 145 49 -51 -63 100 73 -24 4 64 68 33 -47 -49 51 46 25 8 105 72
144.7425G2m1Q3Jj33j5oJ22L0l7n2j1J73M0J0m8%m6j05j9j21R1J45Mj8l9O6j9K3O5k9
$$ 72 31 114 115 -18 -33 -39 83 113 76 24 13 186 226 236 188 188 142 37 18 -103 -12 133 137 119 80 146 127 150 215 186
144.5422A86q2o1j69l0J5Q0j02p1n7J06R1R9R3k8r5O4K0N6M2r1M1N6m3r2LMj5n0J0K4
$$ 186 104 43 -126 -156 -141 -61 -163 -234 -291 -185 -94 5 98 70 -25 39 59 115 157 66 107 163 120 28 31 35 20 -30 -20 4
144.3419Do7q7J21J35q2r8Q3J22P7q3O9j0q4k2q6n3L7J37J46R8q0m3l7j54K0%l6l9J3
$$ 4 -63 -150 -29 106 24 -74 9 131 208 125 194 184 100 78 -8 -61 -24 113 259 357 277 234 197 43 63 63 27 -12 1
144.1483Aj53l9J01N4M0L9j1R5j6q4k7lmM9n2l5J24M8p4J7J6p0j29J6J94Q5n6L3j7j02
$$ 1 -152 -191 -90 -36 4 43 32 127 111 27 0 -3 -7 42 -10 -45 79 127 53 70 86 16 -113 -97 97 182 126 159 142 40
143.9480D0j3nj7J9j19r9o1J01J23O7J01O9lko8K9j26k02%rQ8K03J78r5o9L7K6oo7k10
$$ 40 27 22 5 24 -95 -194 -255 -154 -31 36 137 206 203 201 133 162 36 -166 -166 -175 -87 116 294 199 130 167 193 187 120 -90
143.7477i0j34K2L1J79rnJ92j9j33o5rp2N6l3J33J70p8O2r4jj13p9k2R8J4Q1m6r8k8
$$ -90 -224 -202 -171 8 -1 -6 186 167 34 -31 -40 -112 -56 -89 44 214 136 198 104 103 -10 -89 -111 -13 1 82 36 -62 -90
143.5541i0qK3R0M8M5j46M1J74K6k64k01O5J48L8o4l3m4o9o8J30O6l2rK6j13k1L1K9
$$ -90 -98 -75 15 63 108 -38 3 177 203 -61 -262 -197 -49 -11 -75 -108 -152 -221 -289 -159 -93 -125 -134 -108 -221 -242 -211 -182
143.3671a82K5K0o3J45J01K8k8r4k8j8j18Q8L5m0M0L0Q8J19j31m7P4q8j60oJ10O3K0
$$ -182 -157 -137 -200 -55 46 74 46 -48 -76 -94 -212 -124 -89 -129 -89 -59 29 148 17 -30 44 -44 -204 -210 -100 -37 -17
143.1869a7r1Q6J55nj39p4k1J43P2L4R7m9p2n0PK8J15J4r7K1j15K0J24K4n4p7mR6l0
$$ -17 -108 -22 133 128 -11 -85 -106 37 109 143 240 191 119 69 76 104 219 233 136 157 42 62 186 210 156 79 75 171 141
142.9933A41j75j0N1L3j21J8n0KJ20N3j06j35L4L6o0KP0R9r8p7J16N8k1J15J69m6k2
$$ 141 -34 -44 7 40 -81 -63 -113 -111 9 62 -44 -179 -145 -109 -169 -167 -97 2 -96 -173 -57 1 -20 95 264 218 196
142.8130A96P0k9k7k2j09j31J8%M0P2mJ24M2r1m9Q7l0m1n8r9j09OJ08K4P1j35j20k7
$$ 196 266 237 210 188 79 -52 -34 -34 6 78 74 198 240 149 100 187 157 116 58 -41 -150 -144 -36 -12 59 -76 -196 -223
142.6261b23l7K9j00L0J12J85n7j33kJ8R9k0k1j8k8QM7Q1K5%kJ45J64l5l7j43k9k5l9
$$ -223 -260 -231 -331 -301 -189 -4 -61 -194 -196 -178 -79 -99 -120 -138 -166 -158 -111 -30 -5 -5 -7 138 302 267 230 87 58 33 -6
142.4324frP8oo0N1ro2M0m3L8O8Q0P4o2Tj47p4m7n5m4k2J24R2P1L3N6K6r3l5J2J3p9
$$ -6 -15 63 57 -3 48 39 -23 17 -26 12 80 160 234 172 110 -37 -111 -158 -213 -257 -279 -155 -63 8 41 97 123 30 -5 7 20 -59
142.2188e9n8Tj51Q3J03P0p0K2J16K2N0KPM4j9J4l9j07n9L2J19qL7%m9l0J9n4l1O4j3
$$ -59 -117 -175 -326 -243 -140 -70 -140 -118 -2 20 70 72 79 123 104 118 79 -28 -87 -55 64 56 93 93 44 14 33 -21 -52 12 -1
142.0118aO2P6j1N9N3J8l3j24j22j6r6OJ01N6j7q6J02m2p5o0JQ8Q4p0j00L6j71M9K58
$$ -1 61 137 126 185 238 256 223 99 -23 -39 -135 -129 -28 28 11 -75 27 -15 -90 -150 -149 -61 23 -47 -147 -111 -282 -233 25
141.8182B5L2q3J0j0m1lJ55L3l2j5j7m1Q9k3K6k6m2L2j3L5q9j45Q0R1K5m4o3R4N6J63
$$ 25 57 -26 -16 -26 -67 -70 85 118 86 71 54 13 102 79 105 79 37 69 56 91 2 -143 -63 28 53 9 -54 40 96 259
141.6179B59Qn0j21j67q2j3J78L7j32j52N4R9J58J2j83j6R4L9M0O2j6j35j14l9k9j13
$$ 259 267 217 96 -71 -153 -166 12 49 -83 -235 -181 -82 76 88 -95 -111 -17 22 62 124 108 -27 -141 -180 -209 -322
141.4444c22M2j1N7P8N4O8o0k6l1k7QK7R2qP5j5k6M8nO5r2p3p7o8J76K4n7K8O1n0p8
$$ -322 -280 -291 -234 -156 -102 -34 -94 -120 -151 -178 -170 -143 -51 -59 16 1 -25 23 18 83 -9 -82 -159 -227 -51 -27 -84 -56 5 -45 -123
141.2374a23l0m6l0k0K6m4j1N4J73J65M6l5k7L7J15J2o9j54j02R4P1J9N7J1q6L3j14
$$ -123 -153 -199 -229 -249 -223 -267 -278 -224 -51 114 160 125 98 135 250 262 193 39 -63 31 102 121 178 189 103 136 22
141.0571B2j40j6k2pO3Pm9J56l8K0N1O2j3M0m0m8l3N4K0l5r1j2O9P8NM1M7Nl4O7M3n0
$$ 22 -118 -134 -156 -163 -100 -93 -142 14 -24 -4 47 109 96 136 96 48 15 69 89 54 -37 -49 20 98 103 144 191 196 162 229 272 222
140.8435B22j05k4K6J9n8n1K5o0N1N9P4Ok8j28Qo3o1o0R9J79R4q7r6l0J5J12J50j9p0
$$ 222 117 93 119 138 80 29 54 -6 45 104 178 184 156 28 36 -27 -88 -148 -49 130 224 137 41 11 26 138 288 269 199
140.6499A99j1J7l5j90n9J21R1N2m6nM0j8Mr2k2N8L6k5k4qR0J7l2q5j38M4J0R9l7K1
$$ 199 188 205 170 -20 -79 42 133 185 139 134 174 156 160 68 46 104 140 115 91 83 173 190 158 73 -65 -21 -11 88 51 72
140.4496G2k7p4j11Km8J0k0N8R9j17Q5J26j4L5Ok0l5Tq3J7k2J1O0R8KJ2rq0j7j01j04
$$ 72 45 -29 -140 -138 -186 -176 -196 -138 -39 -156 -71 55 41 76 82 62 27 -8 -91 -74 -96 -85 -25 73 75 87 78 -2 -19 -120 -224
140.2426b24R2R5K6L2Q7Q1j72n4J2q8j18J57J35K7J4%J2K0nm9l4m9mN5J08L3l8j24j52
$$ -224 -132 -37 -11 21 108 189 17 -37 -25 -113 -231 -74 61 88 102 102 114 134 129 80 46 -3 -7 48 156 189 151 27 -125
140.0490a25l3k2mnj0K1lOJ25P4q6Ol9jO1O3K0J1lj1kQK1K8J4p6o2J1M5lj7J38l8j22
$$ -125 -158 -180 -184 -189 -199 -178 -181 -175 -50 24 -62 -56 -95 -96 -35 28 48 59 56 45 43 51 72 100 114 38 -24 -13 32 29 12 150 112 -10
139.8220a0J16mN0J18m2Tp6j24r9K5J32M1o7m6J26K1r3j05k2L7m4o2Jj0o2J52k7L2K1
$$ -10 106 102 152 270 228 186 110 -14 -113 -88 44 85 18 -28 98 119 26 -79 -101 -64 -108 -170 -169 -179 -241 -89 -116 -84 -63
139.6284f3m7M1n6L0N0j10K1K21On2j34n9n5n2k7p6p8K02J84R9j1p4O5pm7M9O2o3O4
$$ -63 -110 -69 -125 -95 -45 -155 -134 87 93 41 -93 -152 -207 -259 -286 -362 -440 -238 -54 45 34 -40 25 18 -29 20 82 19 83
139.4348H3j2n3r0MK7oJ3p7o0m5J11L6l9J37J43l0j42q8m8l2rJ38J73Q6m0KJ9L7r3n
$$ 83 71 18 -72 -68 -41 -47 -34 -111 -171 -216 -105 -69 -108 29 172 142 0 -88 -136 -168 -177 -39 134 220 180 182 201 238 145 140
139.2345A40J48j0j7j40o0J4J3RmP3L2j3no8k05j00J13J58k6j63M0l5R2O4L0Ro9kk1
$$ 140 288 278 261 121 61 75 88 97 93 166 198 185 180 112 -93 -193 -80 78 52 -111 -71 -106 -14 50 80 89 20 18 -3
139.0409cp5K0M2QQ3J50k6j16j22j07J44J97Nj5j41j19j2K5q5m4K5J25N6O5K8Jq2n3
$$ -3 -78 -58 -16 -8 75 225 199 83 -39 -146 -2 195 200 185 44 -75 -87 -62 -147 -191 -166 -41 15 80 108 109 27 -26
138.8539b6l4K3L3n3l2m5j3J26J30L6l0J4O6j01n2j2r0m1J22QLPN0J05n1M7o6n0j40
$$ -26 -60 -37 -4 -57 -89 -134 -147 -21 109 145 115 129 195 94 42 30 -60 -101 21 29 32 39 89 194 143 190 124 74 -66
138.6603f6j06O7P8MM4p3o4j8Q4N2J76Rr8o4J05j25R4J10Nj15j62p6m6LJ37J51R4j53
$$ -66 -172 -105 -27 -23 21 -52 -116 -134 -50 2 178 187 89 25 130 5 99 209 214 99 -63 -139 -185 -182 -45 106 200 47
138.4734D7j50O8n8r5N5J71j2j27l5K0M6l8k7K5PN5q2JK2Mk0o2N5J60O8oJ12K4j29j00
$$ 47 -103 -35 -93 -188 -133 38 26 -101 -136 -116 -70 -108 -135 -110 -103 -48 -130 -129 -107 -103 -123 -185 -130 30 98 92 204 228 99 -1
138.2731aoN6M1J19r6l1J25J11o0o1R2O7k00N8K44J12J05N4Q7L79O76J215J844J54k052
$$ -1 -7 49 90 209 113 82 207 318 258 197 289 356 156 214 458 570 675 729 816 1195 1871 3086 4930 5084 3032
138.1062C032j372o48m34k17m5p0m3q8j29o3L8M0N0J9m7O5R8j1j42l3M0M2nM2r0j40
$$ 3032 1660 1012 578 361 316 246 203 115 -14 -77 -39 1 51 70 23 88 186 175 33 0 40 82 77 119 29 -111
137.9326a11p2R8P4P3K1j17o7R9o3j1j5L5k8L8J11R1l1N7j7j47o0P3M4nj7j84j23J9
$$ -111 -183 -85 -11 62 83 -34 -101 -2 -65 -76 -91 -56 -84 -46 65 156 125 182 165 18 -42 31 75 70 53 -131 -254 -235
137.7457b35Ln4J22O8l0j3J12LM5k6k1mj07R2O6M3J14R6p0o0PQ0N9JM5L0j3j03k04j40
$$ -235 -232 -286 -164 -96 -126 -139 -27 -24 21 -5 -26 -30 -137 -45 21 64 178 274 204 144 151 231 290 291 336 366 353 250 46 -94
137.5454i4Q1j4j48n4L8J29j2q5O7j6k3k4J5K9K35ok9J9k5j13k2%rq4R8J04q4O8J06
$$ -94 -13 -27 -175 -229 -191 -62 -74 -159 -92 -108 -131 -155 -140 -111 124 118 89 108 83 -30 -52 -52 -61 -145 -47 57 -27 41 147
137.3518A47q6q7k9l8l6J14J06J5o4M9K2k4L2j36O8J6r7o9P1J07R7k7k0j21j17O9TJ0
$$ 147 61 -26 -55 -93 -129 -15 91 106 42 91 113 89 121 -15 53 69 -28 -97 -26 81 178 151 131 10 -107 -38 31 41
137.1648D1L2J07n4j04m3J02m3qp7j10L6O0k8O4J13j1j58m3J21Pn1m8K4j24o3m8o4J4
$$ 41 73 180 126 22 -21 81 38 30 -47 -157 -121 -61 -89 -25 88 77 -81 -124 -3 4 -47 -95 -71 -195 -258 -306 -370 -356
136.9779c56Q2O5N4J00J93o1j45j40P1q8nP5N1Q2m0j00mP2O7r7M5L0M0n1m5Q1n5o4K6
$$ -356 -274 -209 -155 -55 138 77 -68 -208 -137 -225 -230 -155 -104 -22 -62 -162 -166 -94 -27 -124 -79 -49 -9 -60 -105 -24 -79 -143 -117
136.7843a17J20Rj15l5pO9J44n0p9OM1K2l1L9l9QN2j3L5J32k7q7k7n6Q6N8r4J18jl9
$$ -117 3 12 -103 -138 -145 -76 68 18 -61 -55 -14 8 -23 16 -23 -15 37 24 59 191 164 77 50 -6 80 138 44 162 161 122
136.5840A22n4k7j7l5l0J28rj85pL4K5ro2p1l3J71K00K8k2j3J1R6J13Rr8j98j58oJ0
$$ 122 68 41 24 -11 -41 87 78 -107 -114 -80 -55 -64 -126 -197 -230 -59 141 169 147 134 145 241 354 363 265 67 -91 -97 -87
136.3904h7J23O0m3O8N4R2L0k11r9N2Tj33Q5L6r0MR8o3o6j26NL6j6J0J30J04L4j56n0
$$ -87 36 96 53 121 175 267 297 86 -13 39 91 -42 43 79 -11 -7 91 28 -38 -164 -159 -123 -139 -129 1 105 139 -17 -67
136.1967f7P0lM3N3O9j8k3J0p9n9j2J04jkk1L3O8qo3p8n8m2N0Ll8j28J6R3J41O3j76
$$ -67 3 0 43 96 165 147 124 134 55 -4 -16 88 87 85 64 97 165 157 94 16 -42 -84 -34 -31 -69 -197 -181 -88 53 116 -60
135.9898f0p7O6L0L5P5m2r5j02L4R4R3R1O3M5Mj04l1n8K5n7r9l3m2kL7Q5J02n2k3l1
$$ -60 -137 -71 -41 -6 69 27 -68 -170 -136 -42 51 142 205 250 254 150 119 61 86 29 -70 -103 -145 -147 -110 -25 77 25 2 -29
135.7895b9J6jm6PJ16lJ27M9n2o3j00K4lk27R3Q1J06lk5J27J23j33l9j06r8m3Q2k3q6
$$ -29 -13 -14 -60 -53 63 60 187 236 184 121 21 45 42 -185 -92 -11 95 92 67 194 317 184 145 39 -59 -102 -20 -43 -129
135.5959a29J7N0k2L6J21q0j04J3Q8L2r6N9J0k7P9J37J01N0o8q3n7k3J01O1o0m3n4j12
$$ -129 -112 -62 -84 -48 73 -7 -111 -98 -10 22 -74 -15 -5 -32 47 184 285 335 267 184 127 104 205 266 206 163 109 -3
135.4089cl3j02Np4j09M5J40J31O5J9l0k0M8m2j4j6o2p5P5n2o7r9J11K19J1j11l5J56
$$ -3 -36 -138 -133 -207 -316 -271 -131 0 65 84 54 34 82 40 26 10 -52 -127 -52 -104 -171 -270 -159 60 71 -40 -75 81
135.2220H1L2j8l4o8q0q3J53K7r7o1l2L3O5O6Q9p3n9l0J32Q3k8n3j2J05j5K6j25k1J69
$$ 81 113 95 61 -7 -87 -170 -17 10 -87 -148 -180 -147 -82 -16 73 0 -59 -89 43 126 98 45 33 138 123 149 24 3 172
135.0284A72J84K2m5j23K3M0p9r0j3o1o0O2jn6O0N2m2j45m2p3O6R6Q7j5m5J7N1J7j35
$$ 172 356 378 333 210 233 273 194 104 91 30 -30 32 31 -25 35 87 45 -100 -142 -215 -149 -53 34 19 -26 -9 42 59 -76
134.8348g6k23l6J64J36M2Q0J52jo7r8r5N6k1j72o1j4n1J3P7o1K8P4jj01M8L6M8J06
$$ -76 -299 -335 -171 -35 7 87 239 238 171 73 -22 34 13 -159 -220 -234 -285 -272 -195 -256 -228 -154 -155 -256 -208 -172 -124 -18
134.6478a8lk7Mqn1l4j06O4J50K9J0M3Om0n1n9J4q0pK7P9J33p0pk7l3P0L9mOm7M4MM7
$$ -18 -21 -48 -44 -52 -103 -137 -243 -179 -29 0 10 53 59 19 -32 -91 -77 -157 -164 -137 -58 75 5 -2 -29 -62 8 47 43 49 2 46 50 97
134.4208I7m6k0p8n4j12j6J29j9P7n6p0o8Q3R9J57J3N4m8J08J07j24j02Q4o0k11m7Q6
$$ 97 51 31 -47 -101 -213 -229 -100 -119 -42 -98 -168 -236 -153 -54 103 116 170 122 230 337 213 111 195 135 -76 -123 -37
134.2406c7J8l1l3Q1J5o9O3M9r6l1l3J28O3m6M4j2l6K5j9L1J01O0q1j14j32P4J19J00
$$ -37 -19 -50 -83 -2 13 -56 7 56 -40 -71 -104 24 87 41 85 73 37 62 43 74 175 235 154 40 -92 -18 101 201
134.0536B01j24q6k0m5P0O0Q5O2K8o5mK8j5m4N4l2j57J6R8J5M5Tj09p5j5J4n9m5oO5
$$ 201 77 -9 -29 -74 -4 56 141 203 231 166 162 190 175 131 185 153 -4 12 110 125 170 215 106 31 16 30 -29 -74 -80 -15
133.8533a5P5R4L5j21M3Oj17pk9J3J02r9k3O2M2j13r1J%j2M5J21J68L6q4p5n6k12k2
$$ -15 60 154 189 68 111 117 0 -7 -36 -23 79 -20 -43 19 61 -52 -143 -142 -142 -154 -109 12 180 216 132 57 1 -211 -233
133.6597b33K25K4k9j5M0N3k3L4O1M0p0o8Qo2lJ8O1LN7k1j39K1P0j3r3j42m1J05R2K5
$$ -233 -8 16 -13 -28 12 65 42 76 137 177 107 39 47 -15 -18 0 61 64 121 100 -39 -18 52 39 -54 -196 -237 -132 -40 -15
133.4594a5o9J2m5MRo7J8N9Q8n0q9N3RR7M5j0o1K5q6o8J01P9j07qj30k1rk3J03J15K
$$ -15 -84 -72 -117 -113 -104 -171 -153 -94 -6 -56 -145 -92 -83 14 59 49 -12 13 -73 -141 -40 39 -68 -76 -206 -227 -236 -259 -156 -41 -39
133.2525c9p0J8J84J90p3j84j49LJ58o0n9M2J32j1n0O5O4oj82L0O8N5r7j3P5m5JL0P3
$$ -39 -109 -91 93 283 210 26 -123 -120 38 -22 -81 -39 93 82 32 97 161 155 -27 3 71 126 29 16 91 46 47 77 150
133.0589A50M8j13j04N3L1K8j01Q6O1m7j71QRj1Tj68m6J5j49J43J60L9l1qk4Nn1KJ16
$$ 150 198 85 -19 34 65 93 -8 78 139 92 -79 -71 -62 -73 -84 -252 -298 -283 -432 -289 -129 -90 -121 -129 -153 -148 -199 -197 -81
132.8652h1Q7M2Q8nq1l1l8K0m6j23j18n1j6O1R0J05N1O6M5j7q1J03O9o1L8l5o2j4k7
$$ -81 6 48 136 131 50 19 -19 1 -45 -168 -286 -337 -353 -292 -202 -97 -46 20 65 48 -33 70 139 78 116 81 19 5 -22
132.6716b2l9m6p3p5N4Q5K7n5L1Q2k6n4J3Q6O3n2Jl3K3l6K4k5l2N8J71J84n7r5k6Np9
$$ -22 -61 -107 -180 -255 -201 -116 -89 -144 -113 -31 -57 -111 -98 -12 51 -1 0 -33 -10 -46 -22 -47 -79 -21 150 334 277 182 156 161 82
132.4647H2p3K4J01N6m3j13M1p9k2N6P4l3j42M8q5p3N5n1k5O0K9P5R2J7j2m6Nmq9N4
$$ 82 9 33 134 190 147 34 75 -4 -26 30 104 71 -71 -23 -108 -181 -126 -177 -202 -142 -113 -38 54 71 59 13 18 14 -75 -21
132.2644b1N9J61O5j29j37ql2l8k1J17Q9P3M4j46j7L4J12M2j49k5l6%J30Jj34j5Q1n9
$$ -21 38 199 264 135 -2 -10 -42 -80 -101 16 105 178 222 76 59 93 205 247 98 73 37 37 167 168 34 19 100 41
132.0774D1j43p2O7K8J1M8k6j19o7N6J13N5l9N2J88L6rr0p3m7n8R1J04l8k6j44p7K8
$$ 41 -102 -174 -107 -79 -68 -20 -46 -165 -232 -176 -63 -8 -47 5 193 229 220 130 57 10 -48 43 147 109 83 -61 -138 -110
131.8905a10J6O6J3qQP8K1k2k5k1n7m3L0L7P3Q2j9l2m2l7L1N4Q4M4l3q3q1p4O9j03O3
$$ -110 -94 -28 -15 -23 -15 63 84 62 37 16 -41 -84 -54 -17 56 138 119 87 45 8 39 93 177 221 188 105 24 -50 19 -84 -21
131.6835b1J20L4o4j07j55O3J12m4nr7p3P1J41R5n4q5J5J00Qm8L2kP8q9m7N4N5m8l6
$$ -21 99 133 69 -38 -193 -130 -18 -62 -67 -164 -237 -166 -25 70 16 -69 -54 46 54 6 38 36 114 25 -22 32 87 39 3
131.4899Cnl5j91kJ7KJ03J23LQ1n9M0P0K3O3k9j07q3O6n2j13r4qP8p9n6K08J11J0R5
$$ 3 -2 -37 -228 -230 -213 -211 -108 15 18 99 40 80 150 173 236 207 100 17 83 31 -82 -176 -184 -106 -185 -241 -33 78 88 183
131.2896A83k1J0P2N9l2p7j25L4J9J12q1j38r3L6l1L4J86l1j18J8j8Mj9Q3K0l3nM9L1
$$ 183 162 172 244 303 271 194 69 103 122 234 153 15 -78 -42 -73 -39 147 116 -2 16 -2 2 -17 66 86 53 48 97 128
131.0960A28QL8o9j76Q5J8j5O2p9p7J18J38n9k3kp5j48J08kj01K0M1M7l0J14M7q0j75
$$ 128 136 174 105 -71 14 32 17 79 0 -77 41 179 120 97 95 20 -128 -20 -22 -123 -103 -62 -15 -45 69 116 36 -139
130.9091a39J66R7m1Mq1qR3J28K2n4M7r9j25l7L3K6j19j09J02O9N5P0m6M2N9L3m7q5
$$ -139 27 124 83 87 6 -2 91 219 241 187 234 135 10 -27 6 32 -87 -196 -94 -25 30 100 54 96 155 188 141 56
130.7222E6r6P3K74R3q7j47p8p1l4P1M8%q5l2QM7N8Q4J0m5k6l4L8j2o0J62m9o2J0k0
$$ 56 -40 33 307 400 313 166 88 17 -17 54 102 102 17 -15 -7 40 98 182 192 147 121 87 125 113 53 215 166 104 114 94
130.5219I4J4k4m3J7Q3P6q4r9J07%J33q8l7m3l1kM3P2m4q6K9J16M2l1Mn2m5P0L1o4p3
$$ 94 108 84 41 58 141 217 133 34 141 141 274 186 149 106 75 73 116 188 144 58 87 203 245 214 218 166 121 191 222 158 85
130.3149H5n7j30K0J0P2Q1K7oo7q6qM7M9o5j41O9J29Qp6O2L1K6p2r3k0R8nj8k4m0n9
$$ 85 28 -102 -82 -72 0 81 108 102 35 -51 -59 -12 37 -28 -169 -100 29 37 -39 23 54 80 8 -85 -105 -7 -12 -30 -54 -94 -153
130.1079a53J09K4N5K2q3l3N0R7J30j0o5k26j40J4J21L9J8j01m6M2M6K25Qn1r3o5J54
$$ -153 -44 -20 35 57 -26 -59 -9 88 218 208 143 -83 -223 -209 -88 -49 -31 -132 -178 -136 -90 135 143 92 -1 -66 88
129.9277H8J42k0j34j40M9O1J09O5J46l1j64j7K7ON4L1q3n5J1O7J2j37j32P6J08O0j53
$$ 88 230 210 76 -64 -15 46 155 220 366 335 171 154 181 187 241 272 189 134 145 212 224 87 -45 31 139 199 46
129.7474D6Oj5R1p3l6L6RO4J05K9q6j33m2m7L5J05rJN6O5J87p8k04n5M0M9K8ko2m1q5
$$ 46 52 37 128 55 19 55 64 128 233 262 176 43 1 -46 -11 94 85 86 142 207 394 316 112 57 97 146 174 172 110 69 -16
129.5404a6J0l0m5Q1N4kM5Q1J2j3R4J39n7k12m8K3r4n4l1L5Q7R5O0l1K9K6l4q9q1j4
$$ -16 -6 -36 -81 0 54 52 97 178 190 177 271 410 353 141 93 116 22 -32 -63 -28 59 154 214 183 212 238 204 115 34 20
129.3401B0L7K5j18k2N3oj00j19N5J32J04J49m7OM6j05lj4L3K1J8j42j28N6J24M5Q0
$$ 20 57 82 -36 -58 -5 -11 -111 -230 -175 -43 61 210 163 169 215 110 107 93 126 147 165 23 -105 -49 75 120 200
129.1599B00O0p7k7j7q4j6p7m4J35K0R2k4N0l9J9k2N8Q3L3l2Nl1q3p2J4O7J0m6Kk8m3
$$ 200 260 183 156 139 55 39 -38 -82 53 73 165 141 191 152 171 149 207 290 323 291 296 265 182 110 124 191 201 155 157 129 86
128.9529H6Rm5Q1M6K4J26L0O4j12j25Q9L9K7K2l6j02N3K0Q3K9m5L4Q8j2L6J3j92j04
$$ 86 95 50 131 177 201 327 357 421 309 184 273 312 339 361 325 223 276 296 379 408 363 397 485 473 509 522 330 226
128.7660B26J12J65o1K7j6M7o4l0K02M4K9J73J17NJ19K28K45K02K88L37M54Q96J489
$$ 226 338 503 442 469 453 500 436 406 608 652 681 854 971 976 1095 1323 1568 1770 2058 2395 2849 3745 5234
128.6124E234K789N564R898N727r198r381m772k410j184p65l19j60l16k29j52L3op0
$$ 5234 8023 13587 23485 29212 20014 10633 5861 3451 2267 1502 1183 1023 707 478 326 359 353 283
128.4922B83o4m3J9J8l4q3o4M1J05J11LJ4j3J06K18J17J36O05J246K612K453k839k869
$$ 283 219 176 195 213 179 96 32 73 178 289 292 306 293 399 617 734 870 1475 2721 5333 7786 4947 2078
128.3387B078j037l70j38k31r9J3r3j74k5K4O6o1P7J26l8j41m6P0K0P9m5q1l4o6J56
$$ 2078 1041 671 533 302 203 216 123 -51 -76 -52 14 -47 30 156 118 -23 -69 1 21 100 55 -26 -60 -126 30
128.1718C0J49L6M6k1o1m2M8m8j68j12k3J01K6n4n2n4K8P7L2n2Kk1OL7lk8j94q4J47
$$ 30 179 215 261 240 179 137 185 137 -31 -143 -166 -65 -39 -93 -145 -199 -171 -94 -62 -114 -112 -133 -127 -90 -93 -121 -315 -399 -252
127.9782b52Q6J27O2N7m5o0j9L5m5j01J2J17K8k4J2P3M0l7q8J02P6k3O0k3r7J4J5m8
$$ -252 -166 -39 23 80 35 -25 -44 -9 -54 -155 -143 -26 2 -22 -10 63 103 66 -22 80 156 133 193 170 73 87 102 54
127.7912E4o8pm1p7m5L2q0O2J02j04k2J19K03j28k66n3l3KJ25J56Q8OM9Kp7l8L7KL6
$$ 54 -14 -21 -62 -139 -184 -152 -232 -170 -68 -172 -194 -75 128 0 -266 -319 -352 -350 -225 -69 19 25 74 76 -1 -39 -2 0 36
127.5976C6nk9n5k8j3Q3L4Nj13L6l0k5K5N3l6k6P1m1L8O0N8M0Q3L3p9j15o8J01Qj3N5
$$ 36 31 2 -53 -81 -94 -11 23 28 -85 -49 -79 -104 -79 -26 -62 -88 -17 -58 -20 40 98 138 221 254 175 60 -8 93 101 88 143
127.3906A43O3K8r3r7q1N1P9k2j49r1p4J46J45p7j50J0l4k5R2k4O0RO8M8J9K8O4r8K7
$$ 143 206 234 141 44 -37 14 93 71 -78 -169 -243 -97 48 -29 -179 -169 -203 -228 -136 -160 -100 -91 -23 25 44 72 136 38 65
127.1970F5J58o3j49K4N1j23J8Q6RNl7p8J2M8Q7Q3l6L8n3nK3N0k0NO8N0j93k24j2M1
$$ 65 223 160 11 35 86 -37 -19 67 76 81 44 -34 -22 26 113 196 160 198 145 140 163 213 193 198 266 316 123 -101 -113 -72
126.9968g2r5l0j9J34R2no3q3Q2O6k1JO5l7j19q6q9J53J5j11pJ55R8N4N2o7L4J09k2
$$ -72 -167 -197 -216 -82 10 5 -58 -141 -59 7 -14 -13 52 15 -104 -190 -279 -126 -111 -222 -229 -74 24 78 130 63 97 206 184
126.8031A84q1M1L9J3O1o6j20K9l5j90n0J15J13O4Np1j84j53J42Lr4L6pKQ5Q4m8n1m
$$ 184 103 144 183 196 257 191 71 100 65 -125 -175 -60 53 117 122 51 -133 -286 -144 -141 -235 -199 -206 -204 -119 -35 -83 -134 -138
126.6095a38J43O4rJ02J62jk8n0n1L5o1o3P3J3j7j11l5J02K6r4m3Q3M1r6Om4L8P4J8
$$ -138 5 69 60 162 324 323 295 245 194 229 168 105 178 191 174 63 28 130 156 62 19 102 143 47 53 9 47 121 139
126.4159A39J4J26O8r4j97j38q1K1J11N4M7l8L5Q7O4m8l2l7n7K9O1j8K0k1o9r2MO1O
$$ 139 153 279 347 253 56 -82 -163 -142 -31 23 70 32 67 154 218 170 138 101 44 73 134 116 136 115 46 -46 -42 19 25
126.2223B5JJ24R5j50j55N3M1J3j7J7J3J5M5K2p7l5K5O0L6J1j07m5o1O7J7q0n0J73K03
$$ 25 26 150 245 95 -60 -7 34 47 30 47 60 75 120 142 65 30 55 115 151 162 55 10 -51 16 33 -47 -97 76 279
126.0287B79m3l7q9j26p4O0K4R1Nj3r5p0k2l6J2J8Q6M2j7K6m8k8Q6P1J21mj22k1R0K4
$$ 279 236 199 110 -16 -90 -30 -6 85 90 77 -18 -88 -110 -146 -134 -116 -30 12 -5 21 -27 -55 31 102 223 219 97 76 166 190
125.8284A90K9j20o5r2j0q4J28P1K7n6KQ4P0J21R4j8j38Kq0o5L8nLj7l4l9J2J66N8j5
$$ 190 219 99 34 -58 -68 -152 -24 47 74 18 20 104 174 295 389 371 233 235 155 90 128 123 126 109 75 36 48 214 272 257
125.6281B57M7k5o2m4r9Nk2pjl2K8j1L3P1Q0n5j1J06l4j12j1L7j8q9q1J4m5J9J11j3
$$ 257 304 279 217 173 74 79 57 50 49 17 45 34 67 138 218 163 152 258 224 112 101 138 120 31 -50 -36 -81 -62 49 36
125.4278C6o9n9K1J29O6j36l0l3j7K1M2J4m5k4K3M7J5qN2Q8R3k5n5j4q1TJ30J19J30
$$ 36 -33 -92 -71 58 124 -12 -42 -75 -92 -71 -29 -15 -60 -84 -61 -14 1 -7 45 133 226 201 146 132 51 -30 100 219 349
125.2342C49n4M9L4j34q9q0j08J1O3j09m3K1Q8O7J16J15p7n9l3m9o4L2N5k5o5J5J27
$$ 349 295 344 378 244 155 75 -33 -22 41 -68 -111 -90 -2 65 181 296 219 160 127 78 14 46 101 76 11 26 153
125.0539A53Q0j4R9r7j89r9N6J0J46PN9J06l7j24L0Pj40no1m2J16J38j2o6JL3j04p1
$$ 153 233 219 318 221 32 -67 -11 -1 145 152 211 317 280 156 186 193 53 48 -13 -55 61 199 187 121 122 155 51 -20
124.8670b0J50J63M1m1p6j42K8p9JK3j6R9J2m1P8j07n1j3o0M9Q6P8j0k8Jj32j15N4K27
$$ -20 130 293 334 293 217 75 103 24 25 48 32 131 143 102 180 73 22 9 -51 -2 84 162 152 124 125 -7 -122 -68 159
124.6734A59%r5J3N4L9N7q9MjJ0Q4J4n2j7J21nq7j6P8o1j00j42K1Kj9QP3K7P5J61Np4
$$ 159 159 64 77 131 170 227 138 142 141 151 235 249 197 180 301 296 209 193 271 210 110 -32 -11 -9 -28 -20 53 80 155 316 321 247
124.4597B47j50l5J76J71K6q8q4o9%J2R6l6n9N7J50J5m2j69p2k3Q7j0j34N5Rm4M8M7
$$ 247 97 62 238 409 435 347 263 194 194 206 302 266 207 264 414 429 387 218 146 123 210 200 66 121 130 86 134 181
124.2728A81R4N8p5j97K6M2%j0R1P4j6q8J0J10J41Q4O1l3o7M4J10q8r2k2M0O0J49J71
$$ 181 275 333 258 61 87 129 129 119 210 284 268 180 190 300 441 525 586 553 486 530 640 552 460 438 478 538 687 858
124.0859H58J45k7O8K65K50M11O07P61J029J726L973Q837J2750o051j3842n970k377
$$ 858 1003 976 1044 1309 1559 1970 2577 3338 4367 6093 10066 18903 31653 25602 11760 5790 3413
123.9724C413j169o43n38l34k28j09R4k9j80j60q7L6j3m9L6L2k03j26oR2J24M7NP6M9
$$ 3413 2244 1601 1063 729 501 392 486 457 277 117 30 66 53 4 40 72 -131 -257 -263 -171 -47 0 5 81 130
123.8055A30j7n4l2j81l7P0j42n8P9J55K28Q1N7l7j37l2J08K25n3j51J1J45m4o2r5o4
$$ 130 113 59 27 -154 -191 -121 -263 -321 -242 -87 141 222 279 242 105 73 181 406 353 202 213 358 314 252 157 93
123.6319I3O6K18J36j06j67j44R8J57l1n4o6j18R3P2J10K1j14r4j30o5k0J18L7L2NL5
$$ 93 159 377 513 407 240 96 194 351 320 266 200 82 175 247 357 378 264 170 40 -25 -45 73 110 142 147 182
123.4583A82R1k9q1L0R6m5j04n1J2J66K15J83l4p9k6J31j27p8R3J8r6R8K42J51R4oJ01
$$ 182 273 244 163 193 289 244 140 89 101 267 482 665 631 552 526 657 530 452 545 563 467 565 807 958 1052 1046 1147
123.2780A147L29M77N31P57J204K444N406J2050Q422j3278j1205m214j753q47m29k98
$$ 1147 1476 1953 2484 3241 4445 6889 12295 24345 32767 19489 8284 4070 2317 1470 1041 743
123.1712G43l24j01k4L3Kn2k0k8k2l0o0k8Tj4p3J26K01K1j01j05m7k2P7J13k7r2p8O
$$ 743 419 318 294 327 329 277 257 229 207 177 117 89 61 47 -26 100 301 322 221 116 69 47 124 237 210 118 40 46
122.9843D6N1J9j09m4m8R0J16M3J63ok23q9N5%n3l6Q3N8n5k18N5p8L2J03K9Mm8q8O0
$$ 46 97 116 7 -37 -85 5 121 164 327 321 98 9 64 64 11 -25 58 116 61 -157 -102 -180 -148 -45 -16 -12 -60 -148 -88
122.7907h8J47j35j5J19J6L5l7k6j0N9K7Km5p4NmM9K9j31p0N9QJ34M5N7j38m3rk3J00
$$ -88 59 -76 -91 28 44 79 42 16 6 65 92 94 49 -25 -20 -24 25 54 -77 -147 -88 -80 54 99 156 18 -25 -34 -57 43
122.5904D3J45j33m1n5L3j3O0L8k7m2l3J2o1j02p9R4Kp4N1L4J41J82N3Q4p2j63p0k0
$$ 43 188 55 14 -41 -8 -21 39 77 50 8 -25 -13 -74 -176 -255 -161 -159 -233 -182 -148 -7 175 228 312 240 77 7 -13
122.4034a3p5l8j4L9j70o7K2K07R9J47%n0Q3J71q1j43L3p6r2O8j6J6L8j20Oj0j21J37
$$ -13 -88 -126 -140 -101 -271 -338 -316 -109 -10 137 137 87 170 341 260 117 150 74 -18 50 34 50 88 -32 -26 -36 -157 -20
122.2165b0J08M1m6n7J4O4j14k4M8K8k5K8P4j37nm1k3J35K4j4n5J2J41L7j3M4j26L2
$$ -20 88 129 83 26 40 104 -10 -34 14 42 17 45 119 -18 -23 -64 -87 48 72 58 3 15 156 193 180 224 98 130
122.0296A30P2K7K2n9J23J27j3J4K19L51L92R47K052K877p22l196j863o58j90j55j40
$$ 130 202 229 251 192 315 442 429 443 662 1013 1405 2352 4404 7281 6559 3363 1500 842 652 497 357
121.8894C57r9n9j01R1Q7P6J35n7l28k96O1N6n4r9j06R6J13J27P4q9p2KJ10n7m6L4l3
$$ 357 258 199 98 189 276 352 487 430 102 -194 -133 -77 -131 -230 -336 -240 -127 0 74 -15 -87 -85 25 -32 -78 -44 -77
121.7091g7qj4m2k4J20J00p0J5J14L5Jo2j01q9J02k6L9Q8Q6j74j06J26R9Jl3p0n4j19
$$ -77 -85 -99 -141 -165 -45 55 -15 0 114 149 150 88 -13 -102 0 -26 13 101 187 13 -93 33 132 133 100 30 -24 -143
121.5222a43J07R7l7l1n8OR3n7o8MN7Q0J08j3k4O0j00o4MJ55P1J4Pj21j06o6pPJ6J38
$$ -143 -36 61 24 -7 -65 -59 34 -23 -91 -87 -30 50 158 145 121 181 81 17 21 176 247 261 268 147 41 -25 -32 -25 -9 129
121.3219A29j6j93j35m8j9n0L7J55J53m7o7M4J30J02j2q3p6j64j04R4J60J80j2j09J4
$$ 129 113 -80 -215 -263 -282 -332 -295 -140 13 -34 -101 -57 73 175 163 80 4 -160 -264 -170 -10 170 158 49 63
121.1550F3lO0k9L8K3k6M3mJ3j26J1o2K0J57N9j0P5j10q7r7K9J49k2j96K1Q4K8J2o0
$$ 63 60 120 91 129 152 126 169 165 178 52 63 1 21 178 237 227 302 192 105 8 37 186 164 -32 -11 73 101 113 53
120.9613E3j29O9J63L2q7j43k6J12P5K7k3j3OK3N2j06p3K9L1pq3qO0n6k76j88j3J71
$$ 53 -76 -7 156 188 101 -42 -68 44 119 146 123 110 116 139 191 85 12 41 72 65 -18 -26 34 -22 -298 -486 -499 -328
120.7744c28J41Q4J64pm9K%o2j45r1J06J27R7nk2P8P7o5j25m1j3P4Q2n5q1n4Q6J10l3
$$ -328 -187 -103 61 54 5 7 7 -55 -200 -291 -185 -58 39 34 12 90 167 102 -23 -64 -77 -3 79 24 -57 -111 -25 85 52
120.5808E2J2m5j4j05j4m7p1R3J69J05J7J00Q2j75j87N4O5J4Qj14j15O3J07Q4M5NK0
$$ 52 64 19 5 -100 -114 -161 -232 -139 30 135 152 252 334 159 -28 26 91 105 113 -1 -116 -53 54 138 183 188 208
120.4005B08m1m5r9Q5J7k4n9K3O5Jq5p4J5j14J1P6P8M4K9n0L7J0l4j12J77L9j11K8K4
$$ 208 167 122 23 108 125 101 42 65 130 131 46 -28 -13 -127 -116 -40 38 82 111 61 98 108 74 -38 139 178 67 95 119
120.2069A19q6m1P1r5o9j15p6J41K38m9j78q8N6N5QP8m6K0JM8P2mp5J7K1M4k0L3o7j11
$$ 119 33 -8 63 -32 -101 -216 -292 -151 87 38 -140 -228 -172 -117 -109 -31 -77 -57 -56 -8 64 60 -15 2 23 67 47 80 13 -98
120.0066i8p5OM5J2k2P5L7N0n6l4L7N6K9M4j8n4M6J21l0m4j6l7j48n0L5J39J05p2l6
$$ -98 -173 -167 -122 -110 -132 -57 -20 30 -26 -60 -23 33 62 106 88 34 80 201 171 127 111 74 -74 -124 -89 50 155 83 47
119.8130D7k6p1O3kL7o2n1j5J08N5j3j06o8M3O1k0J1l7L8p5K7OP8P0m6j06lrj5L5Q4
$$ 47 21 -50 13 11 48 -14 -65 -80 28 83 70 -36 -104 -61 0 -20 -9 -46 -8 -83 -56 -50 28 98 52 -54 -57 -66 -81 -46 38
119.6060C8J32l3q6o4K1o9j25l0m2k3K8J55j1j9Q1K07R6j69k39O0J69PQ5P2L0l3j57
$$ 38 170 137 51 -13 8 -61 -186 -216 -258 -281 -253 -98 -109 -128 -47 160 256 87 -152 -92 77 84 169 241 271 238 81
119.4258H1p7pO8j1j2p4p1P0K7l4j26k14J1J64J60m1l3L6L2l0N3r2j22J17K54N9m4J5
$$ 81 4 -3 65 54 42 -32 -103 -33 -6 -40 -166 -380 -369 -205 -45 -86 -119 -83 -51 -81 -28 -120 -242 -125 129 188 144 159
119.2388A59j25j70m7J6N4N0p9K9J42J07o7r6rjK3M7Q7m5J29J6j0p8k14q1R1M2O9j7
$$ 159 34 -136 -183 -167 -113 -63 -142 -113 29 136 69 -27 -36 -37 -14 33 120 75 204 220 210 132 -82 -163 -72 -30 39 22
119.0519B2n6QJ28k6o3p5mP4qj02j11l0J5n4O3K5J33L8LM7pl9K3P9J5j43M0Q0K1m5r6
$$ 22 -34 -26 102 76 13 -62 -66 8 0 -102 -213 -243 -228 -282 -219 -194 -61 -23 -20 27 20 -19 4 83 98 -45 -5 75 96 51 -45
118.8449d5o9J69P6k1nK0R3or6J9L7Koq1j11o1Q5O9OM5P4j2k54r3M0P7L7M8j1q9o5N5
$$ -45 -114 55 131 110 105 125 218 212 116 135 172 174 168 87 -24 -85 0 69 75 120 194 182 -72 -165 -125 -48 -11 37 26 -63 -128 -73
118.6313g3R6k7q5K7m7p1PN4n6l1K01M7j4l5q2M9J27q1o0k1M9l1M1o9m9JM3K5J13J24
$$ -73 23 -4 -89 -62 -109 -180 -173 -119 -175 -206 -5 42 28 -7 -89 -40 87 6 -54 -75 -26 -57 -16 -85 -134 -133 -90 -65 48 172
118.4310A72Mj63j95q4J02o6J74N9N1k4m6k9p1o0nq1Q2Q7N5N6J1q6k3j4ML9J46oL0K6
$$ 172 176 13 -182 -266 -164 -230 -56 3 54 30 -16 -45 -116 -176 -181 -262 -180 -93 -38 18 29 -57 -80 -94 -90 -51 95 89 119 145
118.2307A45o8%R9k1q2J8J5m8j06LJ03P2J4K2j13p0n5l0%O9M9l9j5L8N0KP9j1P0J9n3
$$ 145 77 77 176 155 73 91 106 58 -48 -45 58 130 144 166 53 -17 -72 -102 -102 -33 16 -23 -38 0 50 52 131 120 190 209 156
118.0238A56n8q4l1np5J8M7q3N5J03L5lN9M1k6m1N1Mj04j73l2P3O6N5q0J5N7k1n0q6
$$ 156 98 14 -17 -22 -97 -79 -32 -115 -60 43 78 75 134 175 149 108 159 163 59 -114 -146 -73 -7 48 -32 -17 40 19 -31 -117
117.8235a17m0k3QJ00K5N5L8l9o4OJ53k9j1Q4q2Ko9j04lM7J09N5%qk5L2Q8p2K2N4j83
$$ -117 -157 -180 -172 -72 -47 8 46 7 -57 -51 102 73 62 146 64 66 -3 -107 -110 -63 46 101 101 93 68 100 188 116 138 192 9
117.6165Ij14J4J02j49o1N3L6k8Q8k4j7k8p4mK7N5R7Q3P0r8J6k9N2J33n9M4l6j61M1
$$ 9 -105 -91 11 -138 -199 -146 -110 -138 -50 -74 -91 -119 -193 -197 -170 -115 -18 65 135 37 53 24 76 209 150 194 158 -3 38
117.4229C8k1j29q4L8O3j9J6K0m1j4Q7m4Nm0j1J0M7o7n1J00J1p3n5L8J13oNO0L2l1L0
$$ 38 17 -112 -196 -158 -95 -114 -98 -78 -119 -133 -46 -90 -85 -125 -136 -126 -79 -146 -197 -97 -86 -159 -214 -176 -63 -69 -64 -4 28 -3 27
117.2159B7l2kK6o7j41o4J54p4n1K0J29J8Pr6o6m8JJ42K5k4nr6J0J30J19n7L9O1j5q
$$ 27 -5 -7 19 -48 -189 -253 -99 -173 -224 -204 -75 -57 -50 -146 -212 -260 -259 -117 -92 -116 -121 -217 -207 -77 42 -15 24 85 70 62
117.0156F2R6J9n9j15q7LP4j2j03J8J0P5M0L5n6p2OO0p2L7K1P1J18Pq3r9M7%k5p0nK0
$$ 62 158 177 118 3 -84 -81 -7 -19 -122 -104 -94 -19 21 56 0 -72 -66 -6 -78 -41 -20 51 169 176 93 -6 41 41 16 -54 -59 -39
116.8020c9J4J20J24%l0n8J5n8J4Q4N5j2j51j53j52l3J33J62k1JN7n0m4J0J18j8k7Q5
$$ -39 -25 95 219 219 189 131 146 88 102 186 241 229 78 -75 -227 -260 -127 35 14 15 72 22 -22 -12 106 88 61 146
116.6150A46l5q4m2Q0J08P3N1l0p7j2N1M1l7k5p0j00r1j0N0n7j9RJ25J51L9j12o4M4
$$ 146 111 27 -15 65 173 246 297 267 190 178 229 270 233 208 138 38 -53 -63 -13 -70 -89 -80 45 196 235 123 59 103
116.4281A03l6r7Lk8n8K3J26N7Q2j08k1Np0o7PO5Q7n4q4J9K7K6Q5N6j78O4Q6n6n1k9
$$ 103 67 -30 -27 -55 -113 -90 36 93 175 67 46 51 -19 -86 -79 -14 73 19 -65 -46 -19 7 92 148 -30 34 120 64 13 -16
116.2278a6k0L3K2l4J0q5j9N4M3k7M8jl9R8l1l7q2j8n4qJ9n7Q0J93K3k0j3l2M8j05Q4
$$ -16 -36 -3 19 -15 -5 -90 -109 -55 -12 -39 9 8 -31 67 36 -1 -83 -101 -155 -163 -144 -201 -121 72 95 75 62 30 78 -27 57
116.0209E7Q6N7j52nN9q3j51Q9J38N4J7l3q2N4J39Q8J8n6q9r1J1K9j06LP3N7l1M1j5
$$ 57 143 200 48 43 102 19 -132 -43 95 149 166 133 51 105 244 332 350 294 205 114 125 154 48 51 124 181 150 191 176
115.8272A76j2j21k1n4J1K4NQ3P0Ll2PNl7o9j93M6J25P3O7L3k7k9N0m7j1N2j53k19l7
$$ 176 164 43 22 -32 -21 3 8 91 161 164 132 139 144 107 38 -155 -109 16 89 156 189 162 133 183 136 125 177 24 -195 -232
115.6269b32J05J23Nm3M1L8N1o1n2N2M9J57Mk4J9j37r2k9J11N4J1o0r3RQ3j5j11P8M9
$$ -232 -127 -4 1 -42 -1 37 88 27 -25 27 76 233 237 213 232 95 3 -26 85 139 150 90 -3 6 89 74 -37 41 90
115.4333I0KJ9qr3l1p2J6M3rN2lMO0J05rj9L6M3Mj06j32l7m5Q6J47M0j25j36j9M6K1
$$ 90 92 111 103 10 -21 -93 -77 -34 -43 9 6 10 70 175 166 147 183 226 230 124 -8 -45 -90 -4 143 183 58 -78 -97 -51 -30
115.2264c0J1j1K1l4J61N3k27J1J27R5q0k25k7P6o1R6Q7l7K4k0j1j0q6o8o9Q5Kl6R1
$$ -30 -19 -30 -9 -43 118 171 -56 -45 82 177 97 -128 -155 -79 -140 -44 43 6 30 10 -1 -11 -97 -165 -234 -149 -147 -183 -92
115.0328i2J30L8M8n5o7qj0J00j1j08j16k5J12N0pO4R9l9j06p6L0O3L4o1j6J16k2o2
$$ -92 38 76 124 69 2 -6 -16 84 73 -35 -151 -176 -64 -14 -21 43 142 103 -3 -79 -49 14 48 -13 -29 87 65 3
114.8458Cj6J6kJ2p0%P5J12J2Mq6K8L1K6Q2K7J8j03k1K3No4o7j40n2J30K4pKO2KQ2o1
$$ 3 -13 3 1 13 -57 -57 18 130 142 146 60 88 119 145 227 254 272 169 148 171 176 112 45 -95 -147 -17 7 0 2 64 66 148 87
114.6255H7k0mq8k8j1r0j0N6R1J3Q5m3l1J7R2kJ0O3M6m3J24j8j32n6j08r5O1P1J6k6
$$ 87 67 63 -25 -53 -64 -154 -164 -108 -17 -4 81 38 7 24 116 114 124 187 233 190 314 296 164 108 0 -95 -34 37 53 27
114.4252B7j11q3J0J65R1O3m3j16KM8OM2n5l9qk8kp9o1M9p0N4Q7P3n0l4l3l8P6P2P6
$$ 27 -84 -167 -157 8 99 162 119 3 5 53 59 101 46 7 -1 -29 -31 -110 -171 -122 -192 -138 -51 22 -28 -62 -95 -133 -57 15 91
114.2182I1p8kO1Q1m2r6J5N9j57j4R8O9Mk0K2k7r9l5p8M5LK1mQ0J97kn8lP7J2j18p2
$$ 91 13 11 72 153 111 15 30 89 -68 -82 16 85 89 69 91 64 -35 -70 -148 -103 -100 -79 -83 -3 194 192 134 131 208 220 102 30
114.0046C0K7k5O2n5p7j5l1qO5L7J0%j8M6P6L8n8n4j03K3Q5l3j1J0M6Q4O3j92j60j1
$$ 30 57 32 94 39 -38 -53 -84 -92 -27 10 20 20 2 48 124 162 104 50 -53 -30 55 22 11 21 67 151 214 22 -138 -149
113.8043a49J27J08o5qj4q1m4l2kK34J36r2j0j10n9pK9j6P3J1M2m3J0n5N3pm8m5m7J4
$$ -149 -22 86 21 13 -1 -82 -126 -158 -160 74 210 118 108 -2 -61 -68 -39 -55 18 29 71 28 38 -17 36 29 -19 -64 -111 -97
113.6040i7MM6M9k3J84P3j16k5k2p9p8RO8k3k6j02Tj9Q5Q1L6J12J02Kj21r6M0N0J10
$$ -97 -93 -47 2 -21 163 236 120 95 73 -6 -84 -75 -7 -30 -56 -158 -260 -279 -194 -113 -77 35 137 139 18 -78 -38 12 122
113.4104A22R3M0n1l5l6j56n3l1Q5J21mK7n5lO9oPK3K1%q7j11n0M6J12mqo0j13j8m7
$$ 122 215 255 204 169 133 -23 -76 -107 -22 99 95 122 67 64 133 127 134 157 178 178 91 -20 -70 -24 88 84 76 16 -97 -115 -162
113.2034a62j04Q2J34M7Op0j00m4N5k0RK6M9l2kj1m3O4K15R8J2j10j08jq0L3J70M9N0
$$ -162 -266 -184 -50 -3 3 -67 -167 -211 -156 -176 -167 -141 -92 -124 -126 -137 -180 -116 99 197 209 99 -9 -10 -90 -57 113 162 212
113.0098B12J39m8l1j79k22K8L1kj57r1k4K12M8kM4j1N4J17Jl0q2%J5Rl1R8M5r8j58
$$ 212 351 303 272 93 -129 -101 -70 -72 -229 -320 -344 -132 -84 -86 -42 -53 1 118 119 89 7 7 22 31 0 98 143 45 -113
112.8162a13nK9R3j2L2Lr4o6p8L4Q5J04K6K5k8n1N0j4K7o6p8M3O6j9kr6q6J49J37O3
$$ -113 -118 -89 4 -8 24 27 -67 -133 -211 -177 -92 12 38 63 35 -16 34 20 47 -19 -97 -54 12 -7 -9 -105 -191 -42 95 158
112.6159A58j6j78j3K0K4M2m0p7r0P9J57J3p8k7j12J4J51J27J41q4ol5j7q6n7Q6r9j45
$$ 158 142 -36 -49 -29 -5 37 -3 -80 -170 -91 66 79 1 -26 -138 -124 27 154 295 211 205 170 153 67 10 96 -3 -148
112.4290a48Q0L2j05j22N9K12P0ql3m3k0j2j6J8m6m1pN1O2Q9M4r1m2k9k1K2P7J22N9
$$ -148 -68 -36 -141 -263 -204 8 78 70 37 -6 -26 -38 -54 -36 -82 -123 -130 -79 -17 72 116 25 -17 -46 -67 -45 32 154 213
112.2354B13N2J0j6m9o0j31k7J05O6k32j10J5M0l5q3k2J43l5l1O4Tm8j20N2R4p5L5J83
$$ 213 265 275 259 210 150 19 -8 97 163 -69 -179 -164 -124 -159 -242 -264 -121 -156 -187 -123 -59 -107 -227 -175 -81 -156 -121 62
112.0484F2O1N6q9L6q3p1K0K9j9lLM9p2K2j9J4n7lJ55Q2J24M2j08j49j04M4j13J4j3
$$ 62 123 179 90 126 43 -28 -8 21 2 -1 2 51 -21 1 -18 -4 -61 -64 91 173 297 339 231 82 -22 22 -91 -77 -90
111.8548i0JO5ok3LL5q7j5N3knM5k7o4L3M8%N0O2l0N4j8p8k7o1m2K9%J00O9n6n1M2N1
$$ -90 -89 -24 -30 -53 -50 -15 -102 -117 -64 -66 -71 -26 -53 -117 -84 -36 -36 14 76 46 100 82 4 -23 -84 -126 -97 -97 3 72 16 -35 7 58
111.6278E8K0J4q2R7mPok2j04K7p5r5Q7l5M5O8j6Pm7l4R1J36J01Q3o3j55n5%O0p2K2
$$ 58 78 92 10 107 103 110 104 82 -22 5 -70 -165 -78 -113 -68 0 -16 -9 -56 -90 1 137 238 321 258 103 48 48 108 36 58
111.4209E8O2J3K9lj42mK9j40j3P8J70P6K6p4k46j79J14J12L8P2j55n0J19K7n6N8J31
$$ 58 120 133 162 159 17 13 42 -98 -111 -33 137 213 239 165 -81 -260 -146 -34 4 76 -79 -129 -10 17 -39 19 150
111.2406A50K8l2om1J6J43j3r9j2O6j4o1j27k7M6J0L7J8J53L1j25j31j26P7NQ4M6qm5
$$ 150 178 146 140 99 115 258 245 146 134 200 186 125 -2 -29 17 27 64 82 235 266 141 10 -116 -39 -34 50 96 88 43
111.0470D3Jk9L1n7m4N8L1J9J3o3P1L4o2lJ90rr6j28R3Kk0qk3n6M0P3N6n7j29p4Q4K41
$$ 43 44 15 46 -11 -55 3 34 53 66 3 74 108 46 43 233 224 128 0 93 95 75 67 44 -12 28 101 157 100 -29 -103 -19 222
110.8333B22O5k11k9J3O4k0J1N9o7j34p9L6N9K3N0J9m4p9J5j3j07J17P5l3L6M7k6Q0
$$ 222 287 76 47 60 124 104 115 174 107 -27 -106 -70 -11 12 62 81 37 -42 -27 -40 -147 -30 45 12 48 95 69 149
110.6464A49p0r2j86r2j18J25J80J30mr1k5j3j19l3L4J01P8O2%M1J18n3n4O1p8o5J1
$$ 149 79 -13 -199 -291 -409 -284 -104 26 22 -69 -94 -107 -226 -259 -225 -124 -46 16 16 57 175 122 68 129 51 -14 -3
110.4661cK0Pk4Kjk4L6K9j3j25o7L0J05N2p7L6K4J10J57r2j72k0Q9kJ45K3Nk0j02m2
$$ -3 17 24 0 2 1 -23 13 42 29 -96 -163 -133 -28 24 -53 -17 7 117 274 182 10 -10 79 77 222 245 250 230 128 86
110.2658H6m6Qm6J43l1p0j06n5k6l3JN8O9J46N0K3l0n4M0R2L7l5j22j57l6J31Jj40J50
$$ 86 40 48 2 145 114 44 -62 -117 -143 -176 -175 -117 -48 98 148 171 141 87 127 219 256 221 99 -58 -94 37 38 -102 48
110.0722D8L8N2K1o2K9j5q9O0M5l1oL4O0L4j7j35j19j6J46P6J08or6j33k7J3N0n8j32
$$ 48 86 138 159 97 126 111 22 82 127 96 90 124 184 218 201 66 -53 -69 77 153 261 255 159 26 -1 12 62 4 -128
109.8786a28R3J44J6l2m6J3O7j58p4M6L3N5K0m3R8J47l4p1N4N6o8TL0R9P1J6j24r0o5
$$ -128 -35 109 125 93 47 60 127 -31 -105 -59 -26 29 49 6 104 251 217 146 200 256 188 120 150 249 320 336 212 122 57
109.6850E7m3L0k0K0K3p0j01j5R0L2lJ9k1l7n9o3K6P1M9R8O2k0l8o0k6P8j6L4n7j81
$$ 57 14 44 24 44 67 -3 -104 -119 -29 3 0 19 -2 -39 -98 -161 -135 -64 -15 83 145 125 87 27 1 79 63 97 40 -141
109.4847a41J1K04M3M5q5J7O3O0n8JKo7J17J23K2l8j43L3J09o9J4J16O8K1%j17j23j51
$$ -141 -130 74 117 162 77 94 157 217 159 160 162 95 212 335 357 319 176 209 318 249 263 379 447 468 468 351 228 77
109.2978G7m4M7M9k7J31M8o6M4n1k7p1n9J3N9J05m1j02J6O9J10M3M1l5j4l5J12J91J30
$$ 77 33 80 129 102 233 281 215 259 208 181 110 51 64 123 228 187 85 101 170 280 323 364 329 315 280 392 583 713
109.1108G13m8j80j17L9M9J2O6J43k9oP5l0J25K18J87O8J42L15N17O36R66J714L581
$$ 713 665 485 368 407 456 468 534 677 648 642 717 687 812 1030 1217 1285 1427 1742 2259 2895 3861 5575 9156
108.9573I156Q119J3677l273j4295o980k874j256p55m84k77k75j96j14k9j4j66j6N3
$$ 9156 17275 30952 27679 13384 6404 3530 2274 1519 1035 758 483 287 173 144 130 -36 -52 1
108.8371AJ4k6q5L4O3Q3L4O8L0j51j17j08P9k7Jm2o4l4Q8L2Nr3q3n2P4J67R6M7o4K25
$$ 1 15 -11 -96 -62 1 84 118 186 216 65 -52 -160 -81 -108 -107 -149 -213 -247 -159 -127 -122 -215 -298 -350 -276 -109 -13 34 -30 195
108.6368A95K4j32j04j68RQ3K5j6l7r8L5J00n7l3J18mk8J37J15J17m8l6j2j49j37O5
$$ 195 219 87 -17 -185 -176 -93 -68 -84 -121 -219 -184 -84 -141 -174 -56 -60 -88 49 164 281 233 197 185 36 -101 -36
108.4632c6M7m8r8k5O4r9j16P3p6j5O3K7J14L6j13qJ92J16l3k9Pl6Q6Kq9n8p3M1k3j1
$$ -36 11 -37 -135 -160 -96 -195 -311 -238 -314 -329 -266 -239 -125 -89 -202 -210 -18 98 65 36 43 7 93 95 6 -52 -125 -84 -107 -118
108.2629a18m1j9M9Q1J34O0j03m6P2J5Qj77l4R0MLj40j05J44J42P3P6j15j22j42J9N9
$$ -118 -159 -178 -129 -48 86 146 43 -3 69 84 92 -85 -119 -29 -25 -22 -162 -267 -123 19 92 168 53 -69 -211 -192 -133
108.0827a33M4j03j38J5K13J43p7k4mp0R4J85K4K3nl7o5l1o6P0k9TJ4m0o9N2O6o0n4
$$ -133 -89 -192 -330 -315 -102 41 -36 -60 -64 -134 -40 145 169 192 187 150 85 54 -12 58 29 0 14 -26 -95 -43 23 -37 -91
107.8891i1j0j4PJ17l8kJ59J64k9Tr8q7L6k1p7q0kO8L2l3J5n8K1pTJ01j7j10O1P6J20
$$ -91 -101 -115 -108 9 -29 -31 128 292 263 234 136 49 85 64 -13 -93 -95 -27 5 -28 -13 -71 -50 -57 -64 37 20 -90 -29 47 167
107.6821A67n6j18m5n0M8J3j1J35L6L7j7qn2j10o6l4l2L9J07qK5m8n6J9NJ8L9Q4m8j01
$$ 167 111 -7 -52 -102 -54 -41 -52 83 119 156 139 131 79 -31 -97 -131 -163 -124 -17 -25 0 -48 -104 -85 -80 -62 -23 61 13 -88
107.4818h8N0J31N6q2q4m4n3M4O7q3j17J37J93Q6n1m2J4k1K3J24k8j37M9O4j01j16j11
$$ -88 -38 93 149 67 -17 -61 -114 -70 -3 -86 -203 -66 127 213 162 120 134 113 136 260 232 95 144 208 107 -9 -120
107.3016a20o2q5j2K3k7p7M8J33M3M0J7j3TL5o9J6O4P2n9lr4Q5J68Ml4p4j06K7k0n3
$$ -120 -182 -267 -279 -256 -283 -360 -312 -179 -136 -96 -79 -92 -105 -70 -139 -123 -59 13 -46 -49 -143 -58 110 114 80 6 -100 -73 -93 -146
107.1013a46q7Q4J28l3K5q6j7%o3n7Q8Q2oR0Pj8j09ON0J2o2m7J45QOJ7J45pr1rNJ9Q0
$$ -146 -233 -149 -21 -54 -29 -115 -132 -132 -195 -252 -164 -82 -88 2 9 -9 -118 -112 -62 -50 -112 -159 -14 -6 0 17 162 155 64 55 60 79 159
106.8809A59KK4m3qm0l0o4j34o6L5J00N1J16M0j22j41Q2L1j98k6k7o6o1O5J31Q8J98
$$ 159 161 185 142 134 94 64 0 -134 -200 -165 -65 -14 102 142 20 -121 -39 -8 -206 -232 -259 -325 -386 -321 -190 -102 96
106.7007I6Q6j7j23o2j08K1N8L7k7lk6m6j1J02M7j2m4K1p4M2N2L5k6K2L2L4N5j24J0
$$ 96 182 165 42 -20 -128 -107 -49 -12 -39 -42 -68 -114 -125 -23 24 12 -32 -11 -85 -43 9 44 18 40 72 106 161 37 47
106.5071D7P4j6j09j10O0J14R2qj08j52K4J04l7n0K9Jj02K3L4J95m5r7L4rnN4qN4j64
$$ 47 121 105 -4 -114 -54 60 152 144 36 -116 -92 12 -25 -75 -46 -45 -147 -124 -90 105 60 -37 -3 -12 -17 37 29 83 -81
106.3134h1L3J63L3p7k9o5j40n5P9Q8j8k1JR2N4J26Q0J0n5j23n4L8m6l7l5qk2J26J9
$$ -81 -48 115 148 71 42 -23 -163 -218 -139 -51 -69 -90 -89 3 57 183 263 273 218 95 41 79 33 -4 -39 -47 -69 57 76
106.1198G6j04k3jm5P3M6k2J8j08l1P3n4k9M4QJ29J84N7n1q1r4L1m9j8k1l1j1l0jO5
$$ 76 -28 -51 -52 -97 -24 22 0 18 -90 -121 -48 -102 -131 -87 -79 50 234 291 240 159 65 96 47 29 8 -23 -34 -64 -65 0
105.9196@K5r2p7N6J61q2k4mJ3Kq3j17K7J18K3k9O2M2L7L5Nj2r1k9lO0j7N4L7o8q2O4
$$ 0 25 -67 -144 -88 73 -9 -33 -37 -24 -22 -105 -222 -195 -77 -54 -83 -21 21 58 93 98 86 -5 -34 -37 23 6 60 97 29 -53 11
105.7059A1O4j2N0p9p8j2q2n7M6K9o7K4J75PJ1Kl6P2l3o4k5j60J05J2m8P4J43%j1K3
$$ 11 75 63 113 34 -44 -56 -138 -195 -149 -120 -187 -163 12 19 30 32 -4 68 35 -29 -54 -214 -109 -97 -145 -71 72 72 61 84
105.5056H4j19l1O1J8J4m5J7P0N6O6p0O0Rp0o2j34n3O5P2J06n2q2k2j30q1M7L5J32m2
$$ 84 -35 -66 -5 13 27 -18 -1 69 125 191 121 181 190 120 58 -76 -129 -64 8 114 62 -20 -42 -172 -253 -206 -171 -39 -81
105.3120h1l5P1J6j27p3J02P3q7L2J67kl4K9l2oL9k%l4m4M8q3j27mJ7J8P7R7J39J7j67
$$ -81 -116 -45 -29 -156 -229 -127 -54 -141 -109 58 56 22 51 19 13 52 50 50 16 -28 20 -63 -190 -194 -177 -159 -82 15 154 171 4
105.1050Dj36k8J00N6J8L1nJ8l4l2n3r4o6O5J13N1o7P1J10M7p1j19m8P0O1PR0K6o8k
$$ 4 -132 -160 -60 -4 14 45 40 58 24 -8 -61 -155 -221 -156 -43 8 -59 12 122 169 98 -21 -69 1 62 69 159 185 117 115
104.9048A15NM7n3q8L1j2j10j20jJ50p5N4J35l6p5j6k4K5J02k0n5J1J8J7l9L0r9q3J3
$$ 115 120 167 114 26 57 45 -65 -185 -186 -36 -111 -57 78 42 -33 -49 -73 -48 54 34 -21 -10 8 25 -14 16 -83 -166 -153
104.7111a53j6r6J28Oo2N1J89j7j15l7J4j5M6Mm7l1O2l3o8O6J04Q8K05R9p7j88q1k9
$$ -153 -169 -265 -137 -131 -193 -142 47 30 -85 -122 -108 -123 -77 -73 -120 -151 -89 -122 -190 -124 -20 68 273 372 295 107 26 -3
104.5242cj4O0J21j0m6N5k6TK0j84p9oNM6p4J9R7M5L7O7RN4no1j4r8m0M1N9m7o2n1j0
$$ -3 -17 43 164 154 108 163 137 111 131 -53 -132 -138 -133 -87 -161 -142 -45 0 37 104 113 167 162 101 87 -11 -51 -10 49 2 -60 -111 -121
104.3039a21J5r8R6M3j33j8Q0j9O3J32J9P1lo4J1J9j12j1M3l3m5Q5PjQ1j2l8Q2j5L6
$$ -121 -106 -204 -108 -65 -198 -216 -136 -155 -92 40 59 130 127 63 74 93 -19 -30 13 -20 -65 20 27 26 107 95 57 139 124 160
104.1036A60m8o9L6R7M6P6J62L4j94r0l6j56m4r5lK2Q2J53Q4J0p5O4M2j40j68j04J02
$$ 160 112 43 79 176 222 298 460 494 300 210 174 18 -26 -121 -124 -102 -20 133 217 227 152 216 258 118 -50 -154 -52
103.9233e2Q4O9M2R6p7P7J46j18j30M4l6m1l3J4K9OlJ28J6j6kk3k5K5j09k6R7Q2J07
$$ -52 32 101 143 239 162 239 385 267 137 181 145 104 71 85 114 120 117 245 261 245 243 220 195 220 111 85 182 264 371
103.7297C71N6N2j6j30j02K0j06P4J05P3TM2p7J9J09N7O4K29J95K00J63K23K73M53P57
$$ 371 427 479 463 333 231 251 145 219 324 397 470 512 435 454 563 620 684 913 1108 1308 1471 1694 1967 2420 3177
103.5628C177J400K393N029J1011Q949j2171j1070m176j867q36n90m99k12j43q5o2k1
$$ 3177 4577 6970 11999 23010 31959 19788 8718 4542 2675 1839 1249 750 538 395 310 248 227
103.4493B27J13m1j53j76m2J05r2k1O9j09n9K5N3J7L5j43O5R3o3K1P5L8p2OO5J41R3
$$ 227 340 299 146 -30 -72 33 -59 -80 -11 -120 -179 -154 -101 -84 -49 -192 -127 -34 -97 -76 -1 37 -35 -29 36 177 270
103.2690B70m0r0n2n7k9K9J02L9K3m6p2l4pl1j9R5O6m6q8R6O5Q2J8j64o2K8P5j01o1
$$ 270 230 140 88 31 2 31 133 172 195 149 77 43 36 5 -14 81 147 101 13 109 174 256 274 110 48 76 151 50 -11
103.0754a1K3o1k2m8J07J66L3k0k9m8k5m9J05l0o2r8P8Q8Q1P6l7j72l6J19J4p7n7K5
$$ -11 12 -49 -71 -119 -12 154 187 167 138 90 65 16 121 91 29 -69 9 97 178 254 217 45 9 128 142 65 8 33
102.8885C3m2O8Q1o0m8n2J07KPN0j1j14k1l8j0K6O5k3j21M9K5TP4Lm7K1O5p4j07K6L3
$$ 33 -9 59 140 80 32 -20 87 89 96 146 135 21 0 -38 -48 -22 43 20 -101 -52 -27 -2 72 75 28 49 114 40 -67 -41 -8
102.6815hm0k0Q7j35J19P3J5j01q3o3Q4P7n2km9k0j0k4O6J59L9o4n8j04MQ7J20p0MN2
$$ -8 -48 -68 19 -116 3 76 91 -10 -93 -156 -72 5 -47 -49 -98 -118 -128 -152 -86 73 112 48 -10 -114 -110 -23 97 27 31 83
102.4812H3M6n8o8mnk0O4Pk4j13o8pR9K8R9N1r9l7J23M3j14j80j18N8J48J15p1j10j
$$ 83 129 71 3 -1 -6 -26 38 45 21 -92 -160 -167 -68 -40 59 110 11 -26 97 140 26 -154 -272 -214 -66 49 -22 -132 -133
102.2876a33R5q7p1J03kL3mn1o5R3K3L1L0m0O4J46l5j26JP8L3o6p0m4J15J24n4q8j9
$$ -133 -38 -125 -196 -93 -95 -62 -66 -117 -182 -89 -66 -35 -5 -45 19 165 130 4 5 83 116 50 -20 -64 51 175 121 33 14
102.0940A4j7k0J1N6M9j%m5o1Mk2J4l9o9O2k0l8O8K4o7J7M9J7p9O9L4M9J00k1j73j36
$$ 14 -3 -23 -12 44 93 92 92 47 -14 -10 -32 -18 -57 -126 -64 -84 -122 -54 -30 -97 -80 -31 -14 -93 -24 10 59 159 138 -35 -171
101.8870a71O1J84j4j30n0Q8M8n7n4o7J4P0M2M8j6J16J9Rj57p1n2r5m5M7J61Jj9k9J9
$$ -171 -110 74 60 -70 -120 -32 16 -41 -95 -162 -148 -78 -36 12 -4 112 131 140 -17 -88 -140 -235 -280 -233 -72 -71 -90 -119 -100
101.6934a00jj6%N5K4M9Rq3M7J10J8j07j84m9J10R3n4L4n1K1Q3NN7J2LQ4p3r3n1O7N2
$$ -100 -101 -117 -117 -62 -38 11 20 -63 -16 94 112 5 -179 -228 -118 -25 -79 -45 -96 -75 8 13 70 82 85 169 96 3 -48 19 71
101.4865G1R5Rk08j07M7J21N3j36o9K5j12Nn8J0N7r7NQ9J72J19Nj26k4J5j08n2J13M8
$$ 71 166 175 -33 -140 -93 28 81 -55 -124 -99 -211 -206 -264 -254 -197 -294 -289 -200 -28 91 96 -30 -54 -39 -147 -199 -86 -38
101.2995c8L1L5M5l3M2lj27R0K7k3P3N8o3o6n2RK5N6K0L3j17K6N1N4p8j18k0N5J9n4
$$ -38 -7 28 73 40 82 79 -48 42 69 46 119 177 114 48 -4 5 30 86 106 139 22 48 99 153 75 -43 -63 -8 11 -43
101.0992d3N7J6k9k1Q2L2K2LJ3j01r6n8J0m2l1l7m8J35R1p8o7L1K3K9r4lJ69J00NJ5
$$ -43 14 30 1 -20 62 94 116 119 132 31 -65 -123 -113 -155 -186 -223 -271 -136 -45 -123 -190 -159 -136 -107 -201 -204 -35 65 70 85
100.8989H5j6OKK2M9l0J2k6j55j5O6O1k8o0K1J17J28q4j24Kj65PJ88K5n9n7L1k7L9J7
$$ 85 69 75 77 99 148 118 130 104 -51 -66 0 61 33 -27 -6 111 239 155 31 33 -132 -125 63 88 29 -28 3 -24 15 32
100.6987C2k0p0m4k8o5k1P3J07K3J4Q8k6m7P7l0j28p9q7O0M4J7M9o2k3Q7j02J8jL3k
$$ 32 12 -58 -102 -130 -195 -216 -143 -36 -13 1 89 63 16 93 63 -65 -144 -231 -171 -127 -110 -61 -123 -146 -59 -161 -143 -144 -111 -113
100.4984a13pK8J07J8j03KN5J23j13L0J75N0j2M7R2N1l5j78k56p7Jl2pQ7M8K3k0lL6
$$ -113 -120 -92 15 33 -70 -68 -13 110 -3 27 202 252 240 287 379 430 395 217 -39 -116 -115 -147 -154 -67 -19 4 -16 -19 17
100.3048A7J6Q8p9o9p5m0p0J85J34j14K5j4r2j7M1P6N0L6l0M4J48l9j99r7l6R1M7n6
$$ 17 33 121 42 -27 -102 -142 -212 -27 107 -7 18 4 -88 -105 -64 12 62 98 68 112 260 221 22 -75 -111 -20 27 -29
100.1178b9n4M8R4K0J04J6j09r6L0Tj5r1k4L2N6n6jj6J63Q4o6k0l4L8j90j37rJ21J07
$$ -29 -83 -35 59 79 183 199 90 -6 24 54 39 -52 -76 -44 12 -44 -45 -61 102 186 120 100 66 104 -86 -223 -232 -111 -4
99.9242dp3K2R2j03J6L8n8%n4q6R9Q2m7K7Q2j16LQ1K1l8P8R6k0j00j9Mn5LQ6o7m8J1
$$ -4 -77 -55 37 -66 -50 -12 -70 -70 -124 -210 -111 -29 -76 -49 33 -83 -80 1 22 -16 62 158 138 38 19 23 -32 -29 57 -10 -58 -47
99.7106d7M7k1J1K0M9N8k7n4M4j17j42n6J8J3M5P8R0J04o0qNk9k1J3Rj07rK5Q2J38j
$$ -47 0 -21 -10 10 59 117 90 36 80 -37 -179 -235 -217 -204 -159 -81 9 113 53 45 50 21 0 13 22 -85 -94 -69 13 151 150
99.5036A50j29p8n3N2J69k6m7J10j00j18Nj7n4Q2J07j20j42J17O7M3p3M4l0J57J02j24
$$ 150 21 -57 -110 -58 111 85 38 148 48 -70 -65 -82 -136 -54 53 -67 -209 -92 -25 18 -55 -11 -41 116 218 94
99.3300I4n0j1Qn1k3L7p7q8L2P3Mn1o5m8P4L9m8m0R0l7L6j0k2l1R1R2Q4M1q0n7l4N3
$$ 94 44 33 41 -10 -33 4 -73 -161 -129 -56 -52 -103 -168 -216 -142 -103 -151 -191 -101 -138 -102 -112 -134 -165 -74 18 102 143 63 6 -28 25
99.1164B5p1l5j40M6J4M7Q4M7P6j13p3M1p3j0J2J08o2J03R0j12j08R1O1k4p3l5J24r8
$$ 25 -46 -81 -221 -175 -161 -114 -30 17 93 -20 -93 -52 -125 -135 -123 -15 -77 26 116 4 -104 -13 48 24 -49 -84 40 -58
98.9294e8m0N3l3m1j66o9J44J11K7j16kJ22M2o0j25l6J63J00J6q5N5N1nJ05P9Rm7j09
$$ -58 -98 -45 -78 -119 -285 -354 -210 -99 -72 -188 -190 -68 -26 -86 -211 -247 -84 16 32 -53 2 53 48 153 232 241 194 85
98.7425H5j74j31n8Q8M8J36J71p3Rl0r0k8p2RQ9Q8L8J38m8k13j33p1L1J42n1l6J4J2
$$ 85 -89 -220 -278 -190 -142 -6 165 92 101 71 -19 -47 -119 -110 -21 67 105 243 195 -18 -151 -222 -191 -49 -100 -136 -122 -110
98.5555a10j12j4m8O9J23P4q4o3q1j08n3k0K75K8o7l1J06O9m6K4P9R2l7q3j37N8R9N3
$$ -110 -222 -236 -284 -215 -92 -18 -102 -165 -246 -354 -407 -427 -152 -124 -191 -222 -116 -47 -93 -69 10 102 65 -18 -155 -97 2 55
98.3686E5m1k3K9j36j39J0J75N1j22pj00mJ15J25k2q0J0K1O3L7l0j67p9R2J20R5p5p3
$$ 55 14 -9 20 -116 -255 -245 -70 -19 -141 -148 -248 -252 -137 -12 -34 -114 -104 -83 -20 17 -13 -180 -259 -167 -47 48 -27 -100
98.1817a00L4J01Mn5m3K6J1n0k8o9j15j2J19K5J3P2q2j9N0P4QM2P5p2J7n9o8l0K3J28
$$ -100 -66 35 39 -16 -59 -33 -22 -72 -100 -169 -284 -296 -177 -152 -139 -67 -149 -168 -118 -44 -36 6 81 9 26 -33 -101 -131 -108 20
97.9814B0qm7r3P6k4j2J8j9j15ON3L2No0J3K7qpP0R1J19L5q0j54j24Q3N5k2q4LJ51m0
$$ 20 12 -35 -128 -52 -76 -88 -70 -89 -204 -198 -145 -113 -108 -168 -155 -128 -136 -143 -73 18 137 172 92 -62 -186 -103 -48 -70 -154 -151 0 -40
97.7677d0j22K5N1KJ30Q8J7K9m7j70m0K1j43L4J49J12M7p3p9O6K0p6nL0J33q7j36j10
$$ -40 -162 -137 -86 -84 46 134 151 180 133 -37 -77 -56 -199 -165 -16 96 143 70 -9 57 77 1 -4 26 159 72 -64 -174
97.5808a74JJ11O2P3oq3PM7j1q9j5Q9P0j7K1j17l4Om0j0L1q3j08j97K6J70J77nk8o1
$$ -174 -173 -62 0 73 67 -16 -9 38 27 -62 -77 12 82 65 86 -31 -65 -59 -99 -109 -78 -161 -269 -466 -440 -270 -93 -98 -126 -187
97.3805a87M7R5j29r8j8j20J05J34j42k39k80L63K68R4Q7j9OkTK7l4j9O7L9l5o1M4p3
$$ -187 -140 -45 -174 -272 -290 -410 -305 -171 -313 -552 -832 -469 -201 -107 -20 -39 -33 -35 -37 -10 -44 -63 4 43 8 -53 -9 -82
97.1936h2K1o0j31J07K10j2N8l2j13j79o7J38TL3O4N1j2q4p5l3K3kO7J9K1o7j19KJ12
$$ -82 -61 -121 -252 -145 65 53 111 79 -34 -213 -280 -142 -4 29 93 144 132 48 -27 -60 -37 -39 28 47 68 1 -118 -116 -4
97.0000dJ0p5rJ46N9Kj17q0L1J16QP1R0n0m6n3Kr2rN1K0m5J00M7j33r2J3k0L1K6N6n4
$$ -4 6 -69 -78 68 127 129 12 -68 -37 79 87 158 248 198 152 99 101 9 0 51 71 26 126 173 40 -52 -39 -59 -28 -2 54 0
96.7863@k03p0J42J43Jk4p8o3Q5O1o2J29M9j25o7k2p2L1Q4K2L5j4l4n9j05krj0R8O5
$$ 0 -203 -273 -131 12 13 -11 -89 -152 -67 -6 -68 61 110 -15 -82 -104 -176 -145 -61 -39 -4 -18 -52 -111 -216 -218 -227 -237 -139 -74
96.5860g4R1Q9l1m8n7J43J08n6j09pj05o2R7M0O4J24M5J05j49j39n2K3K7o6N3m4j20
$$ -74 17 106 75 27 -30 113 221 165 56 49 -56 -118 -21 19 83 207 252 357 208 69 17 40 67 1 54 10 -110
96.4058a10j1Rq8M8J31M9k0J03j5Tj0j23j1J05O0k0L1P4q4j27j32M1J04l6jJ19RK13
$$ -110 -121 -112 -200 -152 -21 28 8 111 96 81 71 -52 -63 42 102 82 113 187 103 -24 -156 -115 -11 -47 -48 71 80 293
96.2188B93Q7j72j4O2j2m6p6r1j9O6nq9j4R8K4M3O8l6j1q8j13j29q3O0J59N9P6l4n3
$$ 293 380 208 194 256 244 198 122 31 12 78 73 -16 -30 68 92 135 203 167 156 68 -45 -174 -257 -197 -38 21 97 63 10
96.0252A0r9j14JM5j7K1J9j8J4l1q4J0J27LJ5Pj5Q0L6r1j30J5K2M6oN2J64j3RNK0qj7
$$ 10 -89 -203 -202 -157 -174 -153 -134 -152 -138 -169 -253 -243 -116 -113 -98 -91 -106 -26 10 -81 -211 -196 -174 -128 -134 -82 82 69 78 83 103 95 78
95.8049G8j73j53o3K8J81J51o4j05M3L4J4j28m2M6N8Q8j6L0N9N4J41k4l8q2q8j9o6n5
$$ 78 -95 -248 -311 -283 -102 49 -15 -120 -77 -43 -29 -157 -199 -153 -95 -7 -23 7 66 120 261 237 199 117 29 10 -56 -111
95.6180a11J38J28n4k2r9pj2rP2Q4m1M5j47N%l5L7L5O9J32J9q9q8J7J35J7j79o0j6M1
$$ -111 27 155 101 79 -20 -27 -39 -48 24 108 67 112 -35 -30 -30 -65 -28 7 76 208 227 138 50 67 202 219 40 -20 -36 5
95.4177EO1n9mJ7n9J3qO8K7q4n9L7R9m3p1n0J2O4N9J2O7j1Q2QO2O9j00j86OM3l0J6n1
$$ 5 66 7 3 20 -39 -26 -34 34 61 -23 -82 -45 54 11 -60 -110 -98 -34 25 37 104 93 175 183 245 314 214 28 34 77 47 63 12
95.1973A2j09Q9O3n7j14n3l5lQ0J14M4k5q5M9O8M5k9m0l5k18m0J59K17LL5k7K1No5m7
$$ 12 -97 -8 55 -2 -116 -169 -204 -207 -127 -13 31 6 -79 -30 38 83 54 14 -21 -239 -279 -120 97 100 135 108 129 134 69 22
94.9971B2l0N1o6J6K9Lj05l4M4j6J07N9M8k24q5J34R8lj29j85O9K40L4p3o7J03P5P6
$$ 22 -8 43 -23 -7 22 25 -80 -114 -70 -86 21 80 128 -96 -181 -47 51 48 -81 -266 -197 43 77 4 -63 40 115 191
94.8101A91r4l3m0r2l2j9n6J01J44r2j84qN9J59J34N4j08n7L9p0M7Q0r3m3o9p9j4R1
$$ 191 97 64 24 -68 -100 -119 -175 -74 70 -22 -206 -214 -155 4 138 192 84 27 66 -4 43 123 30 -13 -82 -161 -175 -84
94.6232h4R4n0l6J13Q9lj01q7o6N4L2o5J8j29J21J48J01Nj15n8m9M4O0oj86n8J23L4
$$ -84 10 -40 -76 37 126 123 22 -65 -131 -77 -45 -110 -92 -221 -100 48 149 154 39 -19 -68 -24 36 30 -156 -214 -91 -57
94.4362e7L3K6j8k2R0L3m5J56L1k4j15k14m4J2J18L9m4rkR3j7l8j08L4J10J8K9p9J4
$$ -57 -24 2 -16 -38 52 85 40 196 227 203 88 -126 -170 -158 -40 -1 -45 -54 -56 37 20 -18 -126 -92 18 36 65 -14 0
94.2426@k2l5p3J2J17J2j6k9K3N6J21N6n0q6PN2Nj72r0O5K6K9L9J10K5j29k9K8q9mj00
$$ 0 -22 -57 -130 -118 -1 11 -5 -34 -11 45 166 222 172 86 93 145 150 -22 -112 -47 -21 8 47 157 182 53 24 52 -37 -41 -141
94.0357a41n3R7N3n6J2On6J58J79k1j30j00N8J15jl5j16q9p1N8l0P5R7O6K1m0m2q0J31
$$ -141 -194 -97 -44 -100 -88 -82 -138 20 199 178 48 -52 6 121 120 85 -31 -120 -191 -133 -163 -88 9 75 96 56 14 -66 65
93.8421F5J6j32Q2K1M5Q6m5j41p4Ko5L4J14J8m5o1O5J20k7r0J27K4l2J13p4p9j6q8L6
$$ 65 81 -51 31 52 97 183 138 -3 -77 -75 -140 -106 8 26 -19 -80 -15 105 78 -12 115 139 107 220 146 67 51 -37 -1
93.6484aN3J15Kj33q8k1q1M5J08P4N1K9J2j11p9KM2k0j91l5M0N8J03J12n9j19Q0j17
$$ -1 52 167 169 36 -52 -73 -154 -109 -1 73 124 153 165 54 -25 -23 19 -1 -192 -227 -187 -129 -26 86 27 -92 -12 -129
93.4615a29M5Q3J0K2J51k2r1m7o4q0k0j35Q1J27M0j31p2J20P6m5k3qM5J09l3J3M1J01
$$ -129 -84 -1 9 31 182 160 69 22 -42 -122 -142 -277 -196 -69 -29 -160 -232 -112 -36 -81 -104 -112 -67 42 9 22 63 164
93.2746A64J54N8K0Jj38n4l1n4r4j06Q6J47%q7r2k9j0k8jN5J17n4j33o5J20P8j3M0P2
$$ 164 318 376 396 397 259 205 174 120 26 -80 6 153 153 66 -26 -55 -65 -93 -94 -39 78 24 -109 -174 -54 24 11 51 123
93.0810A23j2o7j29o7M8L9K3L7O7l7r5L0lqM7l8j43p1P5J21N0k04l3N5N0R0l4J8l5j0
$$ 123 111 44 -85 -152 -104 -65 -42 -5 62 25 -70 -40 -43 -51 -4 -42 -185 -256 -181 -60 -10 -214 -247 -192 -142 -52 -86 -68 -103 -113
92.8807a13pj4l0J25J12J08Orj05%l1Pr9r2J75J29m7LJ11m0mL4ON6k7n9r6k34k6J59
$$ -113 -120 -134 -164 -39 73 181 187 178 73 73 42 49 -50 -142 33 162 115 118 229 189 185 219 225 281 254 195 99 -135 -161 -2
92.6804bP8j76r2k7P0N3L1K9O2J22m5k27m5K8J4M1N5K7O9m8p3J0L0l5L2O2k7r4o5o4
$$ -2 76 -100 -192 -219 -149 -96 -65 -36 26 148 103 -124 -169 -141 -127 -86 -31 -4 65 17 -56 -46 -16 -51 -19 43 16 -78 -143 -207
92.4801b07N5J53J8p6m6o1ON4j07J72L02N8j6j06o1L5L2o6j32j56J5J70R9o2p2M6j0
$$ -207 -152 1 19 -57 -103 -164 -158 -104 -211 -39 263 321 305 199 138 173 205 139 7 -149 -134 36 135 73 1 47 37
92.2998C7lOl3j26k2J60M7Q3j16k0R0L8l9k9k2qo8O8K4p3N6n0j3j36k20P7J60J26n6
$$ 37 34 40 7 -119 -141 19 66 149 33 13 103 141 102 73 51 43 -25 43 67 -6 50 0 -13 -149 -369 -292 -132 -6 -62
92.1062f2n4n1J04M6L3oj4l9O0Q6k2L2r6l5j0TJ19J28j34j11L6Kpm5m4Q7j9r9n1J66
$$ -62 -116 -167 -63 -17 16 10 -4 -43 17 103 81 113 17 -18 -28 -38 81 209 75 -36 0 2 -5 -50 -94 -7 -26 -125 -176 -10
91.9059a0R0o2nTJ9l7q9j3k6r9PO3Q3LJ4j0J2P8N4l2j59k7K4J8O2m3qk0o7j05M4O7P4
$$ -10 80 18 13 8 27 -10 -99 -112 -138 -237 -230 -167 -84 -81 -67 -77 -65 13 67 35 -124 -151 -127 -109 -47 -90 -98 -118 -185 -290 -246 -179 -105
91.6856a05k1q1j4J31J00o4k0N7P2Q3l6j02l3j24n8N6K63R3r8J2J66J30n4j16Rl2p2
$$ -105 -126 -207 -221 -90 10 -54 -74 -17 55 138 102 0 -33 -157 -215 -159 104 197 99 111 277 407 353 237 246 214 142
91.5053A42m5R8j7r0j47k2n7P5j6J2J5M8n5m4Q9pN0M6rn6L9NN4j8l8r6j4J10%j03oM6
$$ 142 97 195 178 88 -59 -81 -138 -63 -79 -67 -52 -4 -59 -103 -14 -21 29 75 66 10 49 54 108 90 52 -44 -58 52 52 -51 -57 -11
91.2917a1M9O9M1J1l2K2J0j6k8Ll2Ml0J5k3q0r2m4j12OJ17K7k1M9j7Kmo7J9K47J19j6
$$ -11 38 107 148 159 127 149 159 143 115 118 86 90 60 75 52 -28 -120 -164 -276 -270 -153 -126 -147 -98 -115 -113 -117 -184 -165 82 201 185
91.0780A85k1Qj0Q8O7j61j70l3o5JJ9oJ15J00L7J5j8r0j12j9J14k3p1l9m6P2J7J45K1
$$ 185 164 172 162 250 317 156 -14 -47 -112 -111 -92 -98 17 117 154 169 151 61 -51 -70 44 21 -50 -89 -135 -63 -46 99 120
90.8844A20o4Tj22n9O4J16n3j18j04P4M5j00pJ4n5M5J98J65n8j11J46J09L6j28p2Rp3
$$ 120 56 -8 -130 -189 -125 -9 -62 -180 -284 -210 -165 -265 -272 -258 -313 -268 -70 95 37 -74 72 181 217 89 17 26 -47
90.7042d7o5R4M9p4o0K0O0P5L6p4Nm5j3j14Q2L4q5P5Q3K4j0j14o8n5j9J06Q8K7M4Tn6
$$ -47 -112 -18 31 -43 -103 -83 -23 52 88 14 19 -26 -39 -153 -71 -37 -122 -47 36 60 50 -64 -132 -187 -206 -100 -12 15 59 103 47
90.4972D7O1p2q4j8R3P5jr7Rp3L8k3M7J3q8M6m9J63Q2N3l5J0l7n0l8l6Mn4j9qP6Q6M
$$ 47 108 36 -48 -66 27 102 101 4 13 -60 -22 -45 2 15 -73 -27 -76 87 169 222 187 197 160 110 72 36 40 -14 -33 -41 35 121 125
90.2769A25Q1O3P5j03j12p5L3n0j15o1J6L2ll1P0Q3P0n9m8J0M0Rm6M2J14m3N7P6j31
$$ 125 206 269 344 241 129 54 87 37 -78 -139 -123 -91 -94 -125 -55 28 98 39 -9 1 41 50 4 46 160 117 174 250 119
90.0833A19j06l6L8P1L0q4j00Tj6P5Q5m8m3k7O2J18J2j09n2j0O9N8R8j19l8J73Rk1M
$$ 119 13 -23 15 86 116 32 -68 -168 -184 -109 -24 -72 -115 -142 -80 38 50 -59 -111 -121 -52 6 104 -15 -53 120 129 108 112
89.8897A12K0R8p2j66p0QnR2K6j1j66m3P4R0Ljk0o9M8N8q6r1N7L6j08P3J39p6%J0L7
$$ 112 132 230 158 -8 -78 -70 -75 17 43 32 -134 -177 -103 -13 -10 -11 -31 -100 -52 6 -80 -171 -114 -78 -186 -113 26 -50 -50 -40 -3
89.6827cJ6J23L6j49q7J32M4QK6o4j9J8j57k3N8M4o1J6J01N7j06j3N7Ll0OL8K1j7q7
$$ -3 13 136 172 23 -64 68 112 120 146 82 63 81 -76 -99 -41 3 -58 -42 59 116 10 -3 54 57 27 33 71 92 75 -12
89.4824a2o3P2O9j52m5P7J12n0j02j00o4J08N5m1L4L9J39n2m9K5J24L9q6j85l7K9J78
$$ -12 -75 -3 66 -86 -131 -54 58 8 -94 -194 -258 -150 -95 -136 -102 -63 76 24 -25 0 124 163 77 -108 -145 -116 62
89.3021F2N8oj9q5ml5LR5P9j3m5j25oJ28m5j35p0n3n4N8J07j13K8K13k3k1J67Kj32O9
$$ 62 120 114 95 10 6 -29 -26 69 148 135 90 -35 -41 87 42 -93 -163 -216 -270 -212 -105 -218 -190 23 0 -21 146 148 16 85
89.1019H5k5m2m4nl7J8k5j7k1p9k2P4J00l6P2M5Rpm7j0nl9J5r9k01l6J63O4O0m1J55
$$ 85 60 18 -26 -31 -68 -50 -75 -92 -113 -192 -214 -140 -40 -76 -4 41 50 43 -4 -14 -19 -58 -43 -142 -343 -379 -216 -152 -92 -133 22
88.8949B2J16J7j17J5O6lkk6l9q0j08o2J81j6o1rK23J12o0l8j23R9L2J9j2kl5j47o0
$$ 22 138 155 38 53 119 116 114 88 49 -31 -139 -201 -20 -36 -97 -106 117 229 169 131 8 107 139 158 146 144 109 -38 -98
88.7013i8l1J39M2pk3j2pp9m7pJ9J27O2J06m7l8Q1pn3N7j26lm4r9J08RK5P9M0ml3J3
$$ -98 -129 10 52 45 22 10 3 -76 -123 -130 -111 16 78 184 137 99 180 173 120 177 51 48 4 -95 13 22 47 126 166 162 129 142
88.4876A42J3k05q9k6k8J15J44n1r1mJ02Pj06K6jN4J7p2L4L8j5o1K4K6j02j4O4K21R
$$ 142 155 -50 -139 -165 -193 -78 66 15 -76 -80 22 29 -77 -51 -52 2 19 -53 -19 19 4 -57 -33 -7 -109 -123 -59 162 171
88.2940A71l6j14j9J5L2KTO8l2j79j34M5O1R2M8N8Lj36j27m2J1M2K9m8N3k8K6M1m1n8
$$ 171 135 21 2 17 49 51 53 121 89 -90 -224 -179 -118 -26 22 80 83 -53 -180 -222 -211 -169 -140 -188 -135 -163 -137 -96 -137 -195
88.0937a95k8L9kj0oM6O5m3n9J13J45p9j37J17J0P1Q3qo7M8R2l5k29r6O7R8J18K0K5
$$ -195 -223 -184 -186 -196 -202 -156 -91 -134 -193 -80 65 -14 -151 -34 -24 47 130 122 55 103 195 160 -69 -165 -98 0 118 138 163
87.9001A63l3m9L3MTq5J19R5Oj35j20j3P9k5j05K9R5ll1n8p8l3K8l4K8Rj2J53J74K7
$$ 163 130 81 114 118 122 37 156 251 257 122 2 -11 68 43 -62 -33 62 59 28 -30 -108 -141 -113 -147 -119 -110 -122 31 205 232
87.6998B32Q8j15k01j31M3M6N7kmR6r9L3j5m2p5M4J46k1p5j01j11J1J02J36K0r5j07
$$ 232 320 205 4 -127 -84 -38 19 17 13 109 10 43 28 -14 -89 -45 101 80 5 -96 -207 -196 -94 42 62 -33 -140
87.5196a40OlR5J63O1n9j0p0m4L3J4kKjJ03R5j21n7P3R3p3q9l8n0N3N0j3Q3k6j56jk9
$$ -140 -134 -137 -42 121 182 123 113 43 -1 32 46 44 46 45 148 243 122 65 138 231 158 69 31 -19 34 84 71 154 128 -28 -29 -58
87.3059e8R5Q3j9J7J9J1o0P0J92K8l4q7j62r1J08M9J1m5o2j07L7J26j6Ql5j4o3j30J6
$$ -58 37 120 101 118 137 148 88 158 350 378 344 257 95 4 112 161 172 127 65 -42 -5 121 105 113 78 64 1 -129 -113
87.1123a13L2p1J30O5r4j4J8j7k8O7K8j39n2jj3N9KM1L6j1J4MN0Q2P2k4j18j32q5j3
$$ -113 -81 -152 -22 43 -51 -65 -47 -64 -92 -25 3 -136 -188 -189 -202 -143 -141 -100 -64 -75 -61 -57 -7 75 147 123 5 -127 -212 -225
86.9120b25P2J86J14j47J3J72j7rK6j49j51n0nn1j69J17qj0K1J35J13M9j35J0j7k3L2
$$ -225 -153 33 147 0 13 185 168 159 185 36 -115 -165 -170 -221 -390 -273 -281 -291 -270 -135 -22 27 -108 -98 -115 -138 -106
86.7318a06Q9L4o5J2M3Q4J64Nj28m8mL8l6RJ8n6j40j38n6P3J00P4L6p9K1j0k2q4M9J02
$$ -106 -17 17 -48 -36 7 91 255 260 132 84 80 118 82 91 109 53 -87 -225 -281 -208 -108 -34 2 -77 -56 -66 -88 -172 -123 -21
86.5315b1O4M3K0m9l0J06N5l6p6l6r9o3q7j02J27J64j07q8M8N5J06O1l8m4m5o3j9K7
$$ -21 43 86 106 57 27 133 188 152 76 40 -59 -122 -209 -311 -184 -20 -127 -215 -167 -112 -6 55 17 -27 -72 -135 -154 -127
86.3445a27P8l%J18J23M9Mp6m0K8j7m8j4k2l4K0MM3J01j79m5j3j2Qn7l3J88R3l0k0m9
$$ -127 -49 -52 -52 66 189 238 242 166 126 154 137 89 75 53 19 39 43 86 187 8 -37 -50 -62 -54 -111 -144 44 137 107 87 38
86.1376C8j27m9NJ21Nk0M3J71K8r2Lp2jm7J5P0Q1j0o8o0P4Mj27k2P7O2K2j26j43M7l
$$ 38 -89 -138 -133 -12 -7 -27 16 187 215 123 126 54 53 6 21 91 172 162 94 34 108 112 -15 -37 40 102 124 -2 -145 -98 -101
85.9306a01m6Q1l2NP7N6N3q8k9L8R1K8o2r8QL1J04m4r6M0K9L5j9k3j17n8N3J15Jqp6
$$ -101 -147 -66 -98 -93 -16 40 93 5 -24 14 105 133 71 -27 -19 12 116 72 -24 16 45 80 61 38 -79 -137 -84 31 32 24 -52
85.7236e2Q7J69J4j44j27n4J12kj68K6TJ05N0M3J50r3j48L0M0K6J8l5L1LL6j07M2J20
$$ -52 35 204 218 74 -53 -107 5 3 -165 -139 -113 -8 42 85 235 142 -6 24 64 90 108 73 104 107 143 36 78 198
85.5367A98l6J2Ol6n7j15K8P5L7j35N4K5j2Q2pK1j14j39j8K%j1l8L0J41l4p3j40k6j
$$ 198 162 174 180 144 87 -28 0 75 112 -23 31 56 44 126 119 140 26 -113 -131 -129 -129 -140 -178 -148 -7 -41 -114 -254 -280 -281
85.3364b81j8k5J56J95M7l5k2J5n5QL0o3MJ05k0m5l2J43J61n7j03M8K4n0p9j25K3n4
$$ -281 -299 -324 -168 27 74 39 17 32 -23 -15 15 -48 -44 61 41 -4 -36 107 268 211 108 156 180 130 51 -74 -51 -105
85.1495a05K0p4o7k0K4R0Q8L8J44N6j8j21l5j03J04R4o4j4k3J19p4j64M6K2j7q4M1J41
$$ -105 -85 -159 -226 -246 -222 -132 -44 -6 138 194 176 55 20 -83 21 115 51 37 14 133 59 -105 -59 -37 -54 -138 -97 44
84.9625D4Q3P9Np7j48r3m4J43N4l2J4P0Q7o1j38k2L7jN7K2l0N4M5n6l2R6p4m6n6j05
$$ 44 127 206 211 134 -14 -107 -151 -8 46 14 28 98 185 124 -14 -36 1 0 57 79 49 103 148 92 60 156 82 36 -20 -125
84.7622a25m3%l7J36m9R7J09M1p8j33j0o7o2J1K1RQ3j19%L1J68K1n8L4Q9L3o6r9j6p9
$$ -125 -168 -168 -205 -69 -118 -21 88 129 51 -82 -92 -159 -221 -210 -189 -180 -97 -216 -216 -185 -17 4 -54 -20 69 102 36 -63 -79 -158
84.5619a58k4j26J35J97J39j46j3J01l3k7R8J06q6l6Lr0j6J9pJ1m2j25M6po5O1oj53
$$ -158 -182 -308 -173 24 163 17 4 105 72 45 143 249 163 127 130 40 24 43 36 47 5 -120 -74 -81 -146 -85 -91 -244
84.3750b44J11Q0Q8m1K3Q2j1Ql5J1L8j02q1j1p0j2j0O1n9M3N2Oj02k5K2M8P5o3K1J00
$$ -244 -133 -53 35 -6 17 99 88 96 61 72 110 8 -73 -84 -154 -166 -176 -115 -174 -131 -79 -73 -175 -200 -178 -130 -55 -118 -97 3
84.1747CO2O7p2q7J15j8p0P9J21R8kl2mj52p7j07L0j5k1P9RR5o5j11q8Ko6L6M1J03k
$$ 3 65 132 60 -27 88 70 0 79 200 298 296 264 260 108 31 -76 -46 -61 -82 -3 6 101 36 -75 -163 -161 -227 -191 -150 -47 -49
83.9678d9p4P5M9m4J4j05r9J4J20N3J03J39J9j21M2P3K3N3J0j02j44N5K2j7m1k7Q3m5
$$ -49 -123 -48 1 -43 -29 -134 -233 -219 -99 -46 57 196 215 94 136 209 232 285 295 193 49 104 126 109 68 41 124 79
83.7808G9k9N1n0m0RN1Ql2r2j0n1J29J25N3j69r8K4p2m0o9P4J09R0M2%Kj23Jk9Q5Q9
$$ 79 50 101 51 11 20 71 79 47 -45 -55 -106 23 148 201 32 -66 -42 -114 -154 -223 -149 -40 50 92 92 94 -29 -28 -57 28 117
83.5738A17K4j03m1o5K7n8R4j10n6J15R4m2j48r0l4l9JJ57J50M8M2J6j20q6M6J66J8
$$ 117 141 38 -3 -68 -41 -99 -5 -115 -171 -56 38 -4 -152 -242 -276 -315 -314 -157 -7 41 83 99 -21 -107 -61 105 123
83.3936A23M1m4q7q0j17K5N1m6m7rM2l8l0k6R4J44P5J16mJ3o0O0Jj11r8J7J0j8L7J19
$$ 123 164 120 33 -47 -164 -139 -88 -134 -181 -190 -148 -186 -216 -242 -148 -4 71 187 183 196 136 196 197 86 -12 5 15 -3 34 153
83.1933A53J42P1J2q9j35N9p7n8j64N7M5o2Mp2r4J24M2j07l4kKL9J39Lp3l5N4n7O6J48
$$ 153 295 366 378 289 154 213 136 78 -86 -29 16 -46 -42 -114 -208 -84 -42 -149 -183 -185 -183 -144 -5 -2 -75 -110 -56 -113 -47 101
82.9930A01O6j4l4K4o0j55p2O4J39L9J13m1j7L2l7j38L0r4p6N9qJ2m8Q2K32N2K8p7j00
$$ 101 167 153 119 143 83 -72 -144 -80 59 98 211 170 153 185 148 10 40 -54 -130 -71 -79 -67 -115 -33 199 251 279 202 102
82.7994A02P0M6O6j19j97j43Q7qn3MO6N3J31P9M1P6l6l3m3j9j86p2M2K75N0j10j17N3
$$ 102 172 218 284 165 -32 -175 -88 -96 -149 -145 -79 -26 105 184 225 301 265 232 189 170 -16 -88 -46 229 279 169 52 105
82.6124A05n6n5n4j0R4N3K2k3n0k7l7k7m5m6LR2Q8J9P5M0R6P4J4j48o0L5p4j19n4P5
$$ 105 49 -6 -60 -70 24 77 99 76 26 -1 -38 -65 -110 -156 -153 -61 27 46 121 161 257 331 345 197 137 172 98 -21 -75 0
82.4122@J08r3l2Q8J3M6O1L1r3l4n2p0l6J20K9o4J2j6k6q3Qrj0N6q3n0n1Nj2L4J20J07
$$ 0 108 15 -17 71 84 130 191 222 129 95 43 -27 -63 57 86 22 34 18 -8 -91 -83 -92 -102 -46 -129 -179 -230 -225 -237 -203 -83 24
82.1985B4j7j09P0J07J2j2J54N3p4j09q6n2j67l5J29j1lR6R2l2r6ol1j1J16J59L8l4
$$ 24 7 -102 -32 75 87 75 229 282 208 99 13 -39 -206 -241 -112 -123 -126 -30 62 30 -66 -72 -103 -114 2 161 199 165
82.0116A65j30o8J9PMm9l9R7rJ0N5Jq6K05J29m0k35rnj38n0LP2K8MO5J50J1k35k24r0
$$ 165 35 -33 -14 -7 -3 -52 -91 6 -3 7 62 63 -23 182 311 271 36 27 22 -116 -166 -163 -91 -63 -59 6 156 167 -68 -292 -382
81.8046c82J18J22NKn3K8J19j0mL9N8J0q5j24J4J36L9r1L3J21m2p9n6K4J65R9k09q3
$$ -382 -264 -142 -137 -135 -188 -160 -41 -51 -55 -16 42 52 -33 -157 -143 -7 32 -59 -26 95 53 -26 -82 -58 107 206 -3 -86
81.6177h6J42j33j58L3O0O2J76j25n9p6M6KM5K9nj31J5J38P6l6j68j90J07J04q5N7J57
$$ -86 56 -77 -235 -202 -142 -80 96 -29 -88 -164 -118 -116 -71 -42 -47 -178 -163 -25 51 15 -153 -343 -236 -132 -217 -160 -3
81.4374cJ44N7p5k8r2q4L6M1R6m3n0qJ4q9K9j4m8n3j22L7mJ7J95M3r8J4J26Q7m6k9j9
$$ -3 141 198 123 95 3 -81 -45 -4 92 49 -1 -9 5 -84 -55 -69 -117 -170 -292 -255 -259 -242 -47 -4 -102 -88 38 125 79 50 31
81.2305C1j51j04K5mq2K34J59o7r6l0K6m1m9k4Q3J15J5j18K7M5j2n9J30J77P6j5j46
$$ 31 -120 -224 -199 -203 -285 -51 108 41 -55 -85 -59 -100 -149 -173 -90 25 40 -78 -51 -6 -18 -77 53 230 306 291 145
81.0502A45k38n0l2%J21J14k0o1L2L5k7R2M2K3k3J02m7k1j85n5P2m0m6l3r5j07M5J52
$$ 145 -93 -143 -175 -175 -54 60 40 -21 11 46 19 111 153 176 153 255 208 187 2 -53 19 -21 -67 -100 -195 -302 -257 -105
80.8633a05M9n4k0k7RlK7N6O2P0Kk2P6Q5j9k6o8k3K3j0p4r2lTJ02J14M5j28j58n5j9
$$ -105 -56 -110 -130 -157 -148 -151 -124 -68 -6 64 66 44 120 205 186 160 92 69 92 82 8 -84 -87 -90 12 126 171 43 -115 -170 -189
80.6563a89m2l0Q4Q3O3Q4j55p6K1K9n8k7K9O2N6j5j02j09M2J44O1J4N0m4L4l5j9L5j33
$$ -189 -231 -261 -177 -94 -31 53 -102 -178 -157 -128 -186 -213 -184 -122 -66 -81 -183 -292 -250 -106 -45 -31 19 -25 9 -26 -45 -10 -143
80.4627a43J3J31K2J63J13k0j36k4Q2ro5j26m2k1j4L3Mj27r0J28J5k2Q4N3kM5O6l4N1
$$ -143 -130 1 23 186 299 279 143 119 201 192 127 1 -41 -62 -76 -43 -39 -166 -256 -128 -113 -135 -51 2 0 45 111 77 128
80.2691A28j35J2J37j26k9J1q9J4R0N5nk9lR2r3j4N4j05K3o1m2R5n1O3K0O8j25j64r8
$$ 128 -7 5 142 16 -13 -2 -91 -77 13 68 63 34 31 123 30 16 70 -35 -12 -73 -115 -20 -71 -8 12 80 -45 -209 -307
80.0754c07J13J55J8R9MK4l6m0j14K0J13P1k7o7K4mN1P5p3m2O5n1q3j02jJ15R1L2O1
$$ -307 -194 -39 -21 78 82 106 70 30 -84 -64 49 120 93 26 50 46 97 172 99 57 122 71 -12 -114 -115 0 91 123 184
79.8818A84J0k8l4qK1O3q2P4RR1O9q0j25m0l0M9k5p9o7O3N8J30R4J2j57J3N8M2p1m7
$$ 184 194 166 132 124 145 208 126 200 209 300 369 289 164 124 94 143 118 39 -28 35 93 223 317 329 172 185 243 285 214 167
79.6815A67N9p1j0K4q7n2R7O0n7j65P1j3np4q1J5L9P7K7j8o4N3J07k6O4Q0j0l2k8r4
$$ 167 226 155 145 169 82 30 127 187 130 -35 36 23 18 -56 -137 -122 -83 -6 21 3 -61 -8 99 73 137 217 207 175 147 53
79.4813E3m7M5K2r5q2M3P8M6n8K8j3j40k1N8N9j2k6oOM0o3mR0R5QQ2p1J3l2P2rr9k8
$$ 53 6 51 73 -22 -104 -61 17 63 5 33 20 -120 -141 -83 -24 -36 -62 -68 -62 -22 -85 -89 1 96 104 186 115 128 96 168 159 60 32
79.2609C2m3o0O8j0n0m0j37n5M4M5r5k4J75Q2m9K0J43k3m6R7MJ6J00R4J4jm1p8q0qj58
$$ 32 -11 -71 -3 -13 -63 -103 -240 -295 -251 -206 -301 -325 -150 -68 -117 -97 46 23 -23 74 78 94 194 288 302 301 260 182 102 94 -64
79.0540f4q7k0n6l8PJ58R4P8k1j01j28M1J04q3p4O1J13j9J7q3L2Q7K0K8P6NM6L4o6j45
$$ -64 -151 -171 -227 -265 -258 -100 -6 72 51 -50 -178 -137 -33 -116 -190 -129 -16 -35 -18 -101 -69 18 38 66 142 147 193 227 161 16
78.8537A6r4o8J2N2j8j20J7R7J9o9J00J02j0j1J90M1N6J7j04q5m4j27N2Q9j0N9l9j27
$$ 16 -78 -146 -134 -82 -100 -220 -203 -106 -87 -156 -56 46 36 25 215 256 312 329 225 140 96 -31 21 110 100 159 120 -7
78.6667go7Q2L9J1k9J02P8m0o2j51m5P2J15R3m6K5j79q2j0J9l3j9q0J0N9J65J8P1pl3
$$ -7 -74 8 47 58 29 131 209 169 107 -44 -89 -17 98 191 145 170 -9 -91 -101 -82 -115 -134 -214 -204 -145 20 38 109 102 69
78.4664F9K3okK7J06J22j8j3j68rr5j10k4m3j48qK12J26R2J5r1%Nk7L6O2M7k8K0q7J2
$$ 69 92 86 84 111 217 339 321 308 140 131 36 -74 -98 -141 -289 -297 -85 41 133 148 57 57 62 35 71 133 180 152 172 85 97
78.2595I7q4o7J04m9M3p5n6P5K1J28L5o5N3O9O4J1p4r6j17OR3m4r7L7J43J3r6p8q0J76
$$ 97 13 -54 50 1 44 -31 -87 -12 9 137 172 107 160 229 293 304 230 134 17 23 116 72 -25 12 155 168 72 -6 -86 90
78.0592I0K09nj1j5L5M2m8j63oM4q6J4R1M9Jm5J16K0k2K6j39PM9l5j2K1k4j14m7p4l0
$$ 90 299 294 283 268 303 345 297 134 128 172 86 100 191 240 241 196 312 332 310 336 197 204 253 218 206 227 203 89 42 -32 -62
77.8522f2R3J38RKjr3J6M4Q8J13rL1j06J3P3n3M1J9k7j47j71R9J5M3J09l6N0J24Kl5
$$ -62 31 169 178 180 179 86 102 146 234 347 338 369 263 276 349 296 337 356 329 182 11 110 125 168 277 241 291 415 417 382
77.6519C82q5m9M5K2q5r9n7J28J83j0QK0m4O4J06m6K6qk2K8N7J0j2K95J80J68L66M61
$$ 382 297 248 293 315 230 131 74 202 385 375 383 403 359 423 529 483 509 501 479 507 564 574 562 857 1037 1205 1571 2032
77.4650B032O88J030J594K736L726K432j430l769l362k168j203n66n42k27j62k22l1
$$ 2032 2720 3750 5344 8080 11806 14238 12808 9039 5677 3509 2306 1740 1198 971 809 587 556
77.3515E56n3qk1j27j5L9oQqJ0o7n6n2J29P7k2k4J3N0J12Q4J59Q9j70j93j00l5L9N9
$$ 556 503 495 474 347 332 371 365 373 365 375 308 252 200 329 406 384 360 373 423 535 619 778 867 697 504 404 369 408 467
77.1579D67M9R5K49J37J18Q9J88L75Q65K478K063l178j692n50r0J27K25M28Q45J360
$$ 467 516 611 860 997 1115 1204 1392 1767 2632 5110 7173 3995 2303 1753 1663 1790 2015 2443 3288 4648
77.0244D648K195L437L704N56l322m005k803j801j048m72l27k45j04m4L6m0p7j9m7j05
$$ 4648 6843 10280 13984 14540 11218 7213 4410 2609 1561 1089 762 517 413 369 405 365 288 269 222 117
76.8908A17j10n9J39J74j35l1k9p9J1M0L7oj9J45K4Tj4J17Q6r0K6j2J9L1l7j06J07J41
$$ 117 7 -52 87 261 126 95 66 -13 -2 38 75 69 50 195 219 243 229 346 432 342 368 356 375 406 369 263 370 511
76.7039E11O9JN0J00K2j54p2J64J48K34K88K97L86P89R21J584K625L812K592j670l965
$$ 511 580 581 631 731 753 599 527 691 839 1073 1361 1658 2044 2833 3754 5338 7963 11775 14367 12697 8732
76.5637H732l404j986j224p81m51k50j59j91r5k7l7RN6n7j37j52j18k3J33N0ll1J13
$$ 8732 5328 3342 2118 1337 886 636 477 286 191 164 127 136 192 135 -2 -154 -272 -295 -162 -112 -115 -146 -33
76.4101c3Jm0J7j8K8j09L0K7k2q9O8MN5J32l8Kp5J47M7J10q2j88j52K7p9K8K7J65J86
$$ -33 -32 -72 -55 -73 -45 -154 -124 -97 -119 -208 -140 -136 -81 51 13 15 -60 87 134 244 162 -26 -178 -151 -230 -202 -175 -10 176
76.2165A76j9q5r8p2j24j18j8Q6K25P2o0l1P0J6N9j32n1J2J7J02j94k1j7qQ1O7Q3K8
$$ 176 157 72 -26 -98 -222 -340 -358 -272 -47 25 -35 -66 4 20 79 -53 -104 -92 -75 27 -167 -188 -205 -213 -132 -65 18 46
76.0296D6j34k8oQ0Rm4P1q7p0J1%l2K6K3o0J4J31R2n3j34j9L1p3L6N7m9o3L5J09j9M0
$$ 46 -88 -116 -122 -42 -33 -77 -6 -93 -163 -152 -152 -184 -158 -135 -195 -181 -50 42 -11 -145 -164 -133 -206 -170 -113 -162 -225 -190 -81 -100 -60
75.8226f0k3j0Q5O9j00n6lN9n8j51j37q4J7J42N3M0K2K9k8M2l9l8m2O4N7m8J02M0k2
$$ -60 -83 -93 -8 61 -39 -95 -98 -39 -97 -248 -385 -469 -452 -310 -257 -217 -195 -166 -194 -152 -191 -229 -271 -207 -150 -198 -96 -56 -78
75.6290g8j34q2J2N7J69J09m7q6k4q8l0nj6n4M3P1L0j7p8R3J01n6lJ54l4j77R9O7l8
$$ -78 -212 -294 -282 -225 -56 53 6 -80 -104 -192 -222 -227 -243 -297 -254 -183 -153 -170 -248 -155 -54 -110 -113 41 7 -170 -71 -4 -42
75.4354d2k61pO5J00J20k8J6K2J01K9j07q2M4L4j69m3K8J4J47J00nl9o2j36O1o9m5P0
$$ -42 -303 -310 -245 -145 -25 -53 -37 -15 86 115 8 -74 -30 4 -165 -208 -180 -166 -19 81 76 37 -25 -161 -100 -169 -214 -144
75.2485a44J29p1K0j5J15P2J27p8k00j12j00J15M6q4J8O4J1Q8kN9o6j48j46o2J28O7
$$ -144 -15 -86 -66 -81 34 106 233 155 -45 -157 -257 -142 -96 -180 -162 -98 -87 1 -1 58 -8 -156 -302 -364 -236 -169
75.0749a69N3jk3J12Q7N5j57nK6k5L3Jj9k7NqO6K2n0l5j05Q0J02O2l1OP9N1L4j8q4R2
$$ -169 -116 -117 -140 -28 59 114 -43 -48 -22 -47 -14 -13 -32 -59 -54 -62 4 26 -24 -59 -164 -84 18 80 49 55 134 185 219 201 117 209
74.8612B09N6j00k37j37kJ1K5j6P2J7L8Q9l0j47Kl0k5N2R0k7RM9N7Rn8j36K7P5J9J8
$$ 209 265 165 -72 -209 -211 -200 -175 -191 -119 -102 -64 25 -5 -152 -150 -180 -205 -153 -63 -90 -81 -32 25 34 -24 -160 -133 -58 -39 -21
74.6609b1r2K7J3M8k2k6R9pj43K1J38k7m7R1J52Nk36j09k8J14O0M4q3ol8L3M4O2L6K
$$ -21 -113 -86 -73 -25 -47 -73 26 19 -124 -103 35 8 -39 52 204 209 -27 -136 -164 -50 10 54 -29 -35 -73 -40 4 66 102 104
74.4606A04o0J0M4k4j03k1N0Q2O3rj45n1L6j6Q4J33O5j22k2J11J41l9mn9J6N6p3jk4
$$ 104 44 54 98 74 -29 -50 0 82 145 136 -9 -60 -24 -40 44 177 242 120 98 209 350 311 307 248 264 320 247 246 222
74.2670B22n5nR1r8m0K9j3J36J04KK8j18q6K2O8P9l5q0J9N5P3P6O7q5p1O3L1l9pJ73
$$ 222 167 162 253 155 115 144 131 267 371 373 401 283 197 219 287 366 331 251 270 325 398 474 541 456 385 448 479 440 433 606
74.0667F06K55J29m2j1J58J38R7L69N76J098K403N740J1444K731j2122p699l046j282
$$ 606 861 990 948 937 1095 1233 1330 1699 2275 3373 5776 11516 22960 25691 13569 5870 2824 1542
73.9466A542m73k86k55j73j32r3j01q1M9l7M7MQ7J14N7k8j81j08o7n9M4oq1j6qK6O7
$$ 1542 1069 783 528 355 223 130 29 -52 -3 -40 7 11 98 212 269 241 60 -48 -115 -174 -130 -136 -217 -233 -241 -215 -148
73.7663a48R9%R1R2j00j11j5Q9M4l8l7O7M2m4n7k1k6K6L7j24Lk6J9O5m9J8O6P1p1l4
$$ -148 -49 -49 42 134 34 -77 -92 -3 41 3 -34 33 75 31 -26 -47 -73 -47 -10 -134 -131 -157 -138 -73 -122 -104 -38 33 -38 -72
73.5660g2L0j40q4P1J06M2N6L8J9Q0k9k09n8rK7m5Q9J5O1O2J62o4j93p5m7n8J12J2N6
$$ -72 -42 -182 -266 -195 -89 -47 9 47 66 146 117 -92 -150 -159 -132 -177 -88 -73 -12 50 212 148 -45 -120 -167 -225 -113 -101 -45
73.3724d5N0o7J00nn8j11qL2J9R0P9J3R2J5j72j13m9q1Q2L0j7l2m4J41O1pR8Lj26p0
$$ -45 5 -62 38 33 -25 -136 -144 -112 -93 -3 76 89 181 196 24 -89 -138 -219 -137 -107 -124 -156 -200 -59 2 -5 93 96 -30 -100
73.1721a00P7J16J37o8j85O5L3l4Kp1%mj20j6K2m0J0J01O2o1K7J2m6%P3n2K9l9J3k1
$$ -100 -23 93 230 162 -23 42 75 41 43 -28 -28 -32 -152 -168 -146 -186 -176 -75 -13 -74 -47 -35 -81 -81 -8 -60 -31 -70 -57 -78
72.9718g8m5q9M7M6m1k1J44J38l8p0l5r3L1N9m6Q4P2j10j65NK17p6qQ6N0j63k1J30j4
$$ -78 -123 -212 -165 -119 -160 -181 -37 101 63 -7 -42 -135 -104 -45 -91 -7 65 -45 -210 -205 12 -64 -72 14 64 -99 -120 10 -4
72.7782dk3n9J06P8q7j13r0K3P7R2m2o9l9MN1K0ROR6k0lJ7j29j00J06J40N8N3P9j24
$$ -4 -27 -86 20 98 11 -102 -192 -169 -92 0 -42 -111 -150 -146 -95 -75 -66 -60 36 16 13 30 -99 -199 -93 47 105 158 237 113
72.5779A13q3J5J29Pl5j1j63j85J5L7J39J2j09J37m2q3o0n5R0J60K7P4L4r5l5n6rO7
$$ 113 30 45 174 181 146 135 -28 -213 -198 -161 -22 -10 -119 18 -24 -107 -167 -222 -132 28 55 129 163 68 33 -23 -32 35
72.3910C5M7jNrj14j8k9O5L4R0l3o0r5l4q3l2N9P0oo6Q7K7q8r0J93O8r2m9N9K4J06M7
$$ 35 82 81 86 77 -37 -55 -84 -19 15 105 72 12 -83 -117 -200 -232 -173 -103 -109 -175 -88 -61 -149 -239 -46 22 -70 -119 -60 -36 70 117
72.1773A17R6K3q1o5Pj6l1m1j0L3p8o4Oj06j10N9OJ37R1k3p6N8M4K9qJ18l9r1M1J17
$$ 117 213 236 155 90 97 81 50 9 -1 32 -46 -110 -104 -210 -320 -261 -255 -118 -27 -50 -126 -68 -24 5 -3 115 76 -15 26 143
71.9771A43J7p2j54j20rJ44J0o0J4L8kj8P6O1q4q5j6R7K1P3p9r5m0l0m3J00L7q9m8j99
$$ 143 160 88 -66 -186 -195 -51 -41 -101 -87 -49 -51 -69 7 68 -16 -101 -117 -20 1 74 -5 -100 -140 -170 -213 -113 -76 -165 -213 -412
71.7768d12N7O9R8j1r5k1J1L5K3K1M0J03Q3l5N3N6M3p8j34j3oM8K8M5j60P7n7pk7k4
$$ -412 -355 -286 -188 -199 -294 -315 -304 -269 -246 -225 -185 -82 1 -34 19 75 118 40 -94 -107 -113 -65 -37 8 -152 -75 -132 -139 -166 -190
71.5765a90J67J7p3k6J5M3r6m5k3Qj5KJ52K2K7O7No3j00M4kK7n4j77j4L0J26O0R4J65
$$ -190 -23 -6 -79 -105 -90 -47 -143 -188 -211 -203 -218 -216 -64 -42 -15 52 57 -6 -106 -62 -64 -37 -91 -268 -282 -252 -126 -66 28 193
71.3762A93J17r5k06j20M1O2r1q2j5M2K6P0K9Kj09j11J05L1L9j4m5m1r2n2l5J10J09
$$ 193 310 215 9 -111 -70 -8 -99 -181 -196 -154 -128 -58 -29 -27 -136 -247 -142 -111 -72 -86 -131 -172 -264 -316 -351 -241 -132
71.1959a32m1mK1L2Q0J8K3k7N4l8j34j3J43M9r0nm3Uj8L8J36K6m3j23q0j2Q6R2O3J69
$$ -132 -173 -177 -156 -124 -44 -26 -3 -30 24 -14 -148 -161 -18 31 -59 -64 -107 -150 -193 -211 -173 -37 -11 -54 -177 -257 -269 -183 -91 -28 141
70.9890A41J2p6j29j53m1n6K6J9P4P2Lk5r4m1M8q0J62J85M9m8Lj4o3j3N6L8L3n2q7M2
$$ 141 153 77 -52 -205 -246 -302 -276 -257 -183 -111 -108 -133 -227 -268 -220 -300 -138 47 96 48 51 37 -26 -39 17 55 88 36 -51 -9
70.7887iJ42Lq2m7q4j33J7R3J07j40j6J13J09K2n5r7J0Tp9j59KM5J10o8o4P8J71O8N6
$$ -9 133 136 54 7 -77 -210 -193 -100 7 -133 -149 -36 73 95 40 -57 -47 -37 -116 -275 -273 -228 -118 -186 -250 -172 -1 67 123
70.5950A23K9j6o5K2l9j47L8L4P4nm4j89j33J0J25J85K8j39J5n7J68J06J6K2j09j80
$$ 123 152 136 71 93 54 -93 -55 -21 53 48 4 -185 -318 -308 -183 2 30 -109 -94 -151 17 123 139 161 52 -128
70.4215a28Nn8J00N8R9M0K7l9p3l3J47j9o2K3n5M5m5Q1n4rK5j9Mp5j1j6P0l4j72q4n8
$$ -128 -123 -181 -81 -23 76 116 143 104 31 -2 145 126 64 87 32 77 32 113 59 50 75 56 60 -15 -26 -42 28 -6 -178 -262 -320
70.2145c20P2K6pN4J40J24J33nm5q4m7jP3J17O7p3K8lj43k40M2J58N4P8j08j00o7j38
$$ -320 -248 -222 -229 -175 -35 89 222 217 172 88 41 40 113 230 297 224 252 249 106 -134 -92 66 120 198 90 -10 -77 -215
70.0276b15j1P4J18j1m1lN9J23n8o7kLKqr2K9R7J3R3L4k4j51r5n2J64K17l7j01p1Tj0
$$ -215 -226 -152 -34 -45 -86 -89 -30 93 35 -32 -34 -31 -29 -37 -129 -100 -3 10 103 137 113 -38 -133 -185 -21 196 159 58 -13 -84 -94
69.8206i4r5lL0mm8J18L6k2K2L3L4J9oj55j30L9J3j0J7l4J25jq9L7J49n6Tl5j14rR8
$$ -94 -189 -192 -162 -166 -214 -96 -60 -82 -60 -27 7 26 20 -135 -265 -226 -213 -223 -206 -240 -115 -116 -205 -168 -19 -75 -131 -166 -280 -289 -191
69.6136a91L6P6J03pN2j6q7l0N6J6J98K34n3l59o6P8k8nm4o2J14N3l8J2q6r1J2J03n
$$ -191 -155 -79 24 17 69 53 -34 -64 -8 8 206 440 387 28 -38 40 12 7 -37 -99 15 68 30 42 -44 -135 -123 -20 -25
69.4200b5J7Q7k7J19k8kj2j09PJ54k7o3J1n6o6L1O4k9j7M7j04n0M2O6L2o3O2Q9Rnk55
$$ -25 -8 79 52 171 143 141 129 20 27 181 154 91 102 46 -20 11 75 46 29 76 -28 -78 -36 30 62 -1 61 150 159 154 -101
69.2130a01j42L9k1j85R9J45P0K7n0p4P3J55n8o0O3l7j25l7J18J53j7O3R9j72q5M9O2
$$ -101 -243 -204 -225 -410 -311 -166 -96 -69 -119 -193 -120 35 -23 -83 -20 -57 -182 -219 -101 52 35 98 197 25 -60 -11 51
69.0328E1n7NK6k7KN0q9q6P8J9l1J0M1m3j28J3O4k3L3N8j3o3m8J34R0M6Mj04j05L2Tn0
$$ 51 -6 -1 25 -2 0 50 -39 -125 -47 -28 -59 -49 -8 -51 -179 -166 -102 -125 -92 -34 -47 -110 -158 -24 66 112 116 12 -93 -61 -29 -79
68.8191g9o4QNL4J8O4N8l6o9J5l6M4L4k9n4J2Q6j1rK0J7R2n1j73j29J10J68Q9o6P9J61
$$ -79 -143 -135 -130 -96 -78 -14 44 8 -61 -46 -82 -38 -4 -33 -87 -75 11 0 -9 11 28 120 69 -104 -233 -123 45 134 68 147 308
68.6122C08J2m7R2QM8K9j64j52j12J7M7j9j42J5Q0p6q7N8J6O9L8l5PR1K0p0r4r9q4J58
$$ 308 320 273 365 373 421 450 286 134 22 39 86 67 -75 -60 20 -56 -143 -85 -69 0 38 3 10 101 121 51 -43 -142 -226 -68
68.4119f8P6R8J63j35q2l8j03l6J36J5j47r5K3N0O1kj3K1J50K45Q5j02k64j51k2O2N5
$$ -68 8 106 269 134 52 14 -89 -125 11 26 -121 -216 -193 -143 -82 -84 -97 -76 74 319 404 302 38 -113 -135 -73 -18
68.2316a8O1l4p7K4l6q2kQ9K6J7j08l3l5M2J26RP2q6K3J5k5qo8j6J34J6Q5Pj52m9M1
$$ -18 43 9 -68 -44 -80 -162 -164 -75 -49 -32 -140 -173 -208 -166 -40 -31 41 -45 -22 -7 -32 -40 -108 -124 10 26 111 118 -34 -83 -42
68.0247d2m2J2K10J07j18j39q3L8M1j47n5J01Q9j1o9J6J45rp1o7Nk1O6N2Pk7Jm1j02
$$ -42 -84 -72 138 245 127 -12 -95 -57 -16 -163 -218 -117 -28 -39 -108 -92 53 44 -27 -94 -89 -110 -44 8 15 -12 -11 -52 -154
67.8310a54J3P3K2J9m5K5LR2J2j11j65J7m2m6Q4L4Mk2Q7J10J11M0j7j64p8J39J13n9
$$ -154 -141 -68 -46 -27 -72 -47 -44 48 60 -51 -216 -199 -241 -287 -203 -169 -165 -187 -100 10 121 161 144 -20 -98 41 154 95
67.6441I5N4j0j02N5Lj10k4K4Lr6k7O0J27M9o4j02r4J21J8m7L3M9j13rpp6N3J45k7J8
$$ 95 149 139 37 92 95 -15 -39 -15 -12 -108 -135 -75 52 101 37 -65 -159 -38 -20 -67 -34 15 -98 -107 -114 -190 -137 8 -19 -1
67.4438aq5o6J84J27j5K2j22P0p9n2p7MJ49P8n6q6l6O9N8j62p1K4J32j4P0R1l8j20o7
$$ -1 -86 -152 32 159 144 166 44 114 35 -17 -94 -90 59 137 81 -5 -41 28 86 -76 -147 -123 9 -5 65 156 118 -2 -69
67.2502f9J4K2%r7J0Q7n7J38nk4KK1J09R8nJ78r1j35j66o5Q4L5n4j42j41M2O6J9M6r
$$ -69 -55 -33 -33 -130 -120 -33 -90 48 43 19 21 42 151 249 244 422 331 196 30 -35 49 84 30 -112 -253 -211 -145 -126 -80 -89
67.0499h9j09J9M1N3L1O5q9P7J01j36j2J00P9J6p1k04p4l6J2L2m1K8l8Q1j2l0J22J0
$$ -89 -198 -179 -138 -85 -54 11 -78 -1 100 -36 -48 52 131 147 76 -128 -202 -238 -226 -194 -235 -207 -245 -164 -176 -206 -84 -74
66.8630g4L6k2pj13Rn2NJ43k4N6N0j01j9k3n7N1J73N4m6Mr3N5P7j2L2N0k4o2r7J1M4
$$ -74 -38 -60 -67 -180 -171 -223 -218 -75 -99 -43 7 -94 -113 -136 -193 -142 31 85 39 43 -50 5 82 70 102 152 128 66 -31 -20 24
66.6560B4K7L5j78o8Q6J65J1q8O0k1N8k3l9mm4L4M6n4l2L0j01j4L3M2m0LN0oOj23Ol4
$$ 24 51 86 -92 -160 -74 91 102 14 74 53 111 88 49 45 1 35 81 27 -5 25 -76 -90 -57 -15 -55 -52 -2 -8 -2 -125 -119 -153
66.4424a53J18N0q7j5n4j7J17j0o2k0M6P4k8Np7O8o5P6j1l2PL6jJ1M9J42M8j67k37p
$$ -153 -35 15 -72 -87 -141 -158 -41 -51 -113 -133 -87 -13 -41 -36 -113 -45 -110 -34 -45 -77 -70 -34 -35 -24 25 167 215 48 -189 -196
66.2421a96O1O5n0O1%J06L4l6M1N0J02k5qj15p2q1K1J7Jm7j4p4L0N8l4J5l5k5M0J6k3
$$ -196 -135 -70 -120 -59 -59 47 81 45 86 136 238 213 205 90 18 -63 -42 -25 -24 -71 -85 -159 -129 -71 -105 -90 -125 -150 -110 -94 -117
66.0351a17Jp0J30Q8j13K9R3m9j96k3j2K7R9j6L3L9To0J11O6l1J58M2j17j11m8L0M8
$$ -117 -116 -186 -56 32 -81 -52 41 -8 -204 -227 -239 -212 -113 -129 -96 -57 -18 -78 33 99 68 226 268 151 40 -8 22 70
65.8482G0jN9J7k0J8j2q7pN7j24o5O6L6nK4j29p9P0J74j9q4J7R6N3n1j00m9k9K3j2J37
$$ 70 69 128 145 125 143 131 44 37 94 -30 -95 -29 7 2 26 -103 -182 -112 62 43 -41 -24 72 125 74 -26 -75 -104 -81 -93 44
65.6412D4J0q5j39J04J88O1K9L4j15o3j48k7O0K9p1j39J25k3O3K7j59q4J54R8%q4j2
$$ 44 54 -31 -170 -66 122 183 212 246 131 68 -80 -107 -47 -18 -89 -228 -103 -126 -63 -36 -195 -279 -125 -27 -27 -111 -123
65.4609a23J15p6m1j5j03o9P6O0N1R0J13n1q5kQ1m1K5J9j33rJ29qP9M0n2p0l3qJj10
$$ -123 -8 -84 -125 -140 -243 -312 -236 -176 -125 -35 78 27 -58 -60 21 -20 5 24 -109 -118 11 3 82 122 70 0 -33 -41 -40 -150
65.2607a50L2o5J04J24j9k03p0L2M2J1l3j04n0N8J48P4j7k0j9q7nM2k0N0O2J08j9j5
$$ -150 -118 -183 -79 45 26 -177 -247 -215 -173 -162 -195 -299 -349 -291 -143 -69 -86 -106 -125 -212 -217 -175 -195 -145 -83 25 6 -9
65.0737iM9K6q1o4M0Q9K8Pr7j2P7J66mn6j23p9nk8M6Q7j6J4k32j06N3O0J34n2J3O7n2
$$ -9 40 66 -15 -79 -39 50 78 85 -12 -24 53 219 215 159 36 -43 -48 -76 -30 57 41 55 -177 -283 -230 -170 -36 -88 -75 -8 -60
64.8668f0L5N1j4L0M9J08M2o6j06r9l6pp3j26N0K6N7j7K9R1Q0j02j61k5p2R5J74k5j03
$$ -60 -25 26 12 42 91 199 241 175 69 -30 -66 -73 -146 -272 -222 -196 -139 -156 -127 -36 44 -58 -219 -244 -316 -221 -47 -72 -175
64.6731a75O0L7N9QM6J26j0j48j85n9J18Q2L8o4j23nK4J03J7m9R8n6k56P2J59Q6j4P7
$$ -175 -115 -78 -19 -11 35 161 151 3 -182 -241 -123 -41 -3 -67 -190 -195 -171 -68 -51 -100 -2 -58 -314 -242 -83 3 -11 66
64.4862F6O0r6r3Q2J00n6p9o1qL5J47k4p1l9N0p7j13M1J46R2J12n0j50K2q5J8J33k0
$$ 66 126 30 -63 19 119 63 -16 -77 -85 -50 97 73 2 -37 13 -64 -177 -136 10 102 214 164 14 36 -49 -31 102 82
64.2993H2m1j11l5L6n9l9J2K5R7nM7qj1j10m1N5k0j8P3J8L0N8K9r0R5P1l7K4N5k5Km6
$$ 82 41 -70 -105 -69 -128 -167 -155 -130 -33 -38 9 1 -10 -120 -161 -106 -126 -144 -71 -53 -23 35 64 -26 69 140 103 127 182 157 159 113
64.0856A13p1J2P9Ol6q3J0j6Or4p8O2N1o7l8M6J61P0k0q1O4R7j11m4J9l5j70l5N0P3
$$ 113 42 54 133 139 103 20 30 14 20 -74 -152 -90 -39 -106 -144 -98 63 133 113 32 96 193 82 38 57 22 -148 -183 -133 -60
63.8853f0KL8%M4K2o0j5j4k8OM6J31L5n5j0L6l9q4k3J07M9j10j87L8J63mJ2mM1p7j0
$$ -60 -58 -20 -20 24 46 -14 -29 -43 -71 -65 -19 112 147 92 82 118 79 -5 -28 79 128 18 -169 -131 32 28 40 36 77 0 -10
63.6784a0p1R0P7j44j67qN2o8O5J32J50N3r5q7J75N4p8M3lj37M0L9j04O0MJ8K9n8k3
$$ -10 -81 9 86 -58 -225 -233 -181 -249 -184 -52 98 151 56 -31 144 198 120 163 160 23 63 102 -2 58 62 80 109 51 28
63.4847B8k5k9k3j01L3J1p5l4N3P5N3M9l8j67J5J58J02q2q6N4m7r0Q0J14j1Lr1K8n8
$$ 28 3 -26 -49 -150 -117 -106 -181 -215 -162 -87 -34 15 -23 -190 -175 -17 85 3 -83 -29 -76 -166 -86 28 17 20 -71 -43 -101
63.2911a01P4m3LP1j11j9J40M9o4Ok1kM7p9P7L6n8M2j39j08J53J32m9l5K5jJ5j3j02
$$ -101 -27 -70 -67 4 -107 -126 14 63 -1 5 -16 -18 29 -50 27 63 5 47 -92 -200 -47 85 36 1 26 25 40 27 -75
63.0975g5m5r1N3K5n4L7K8O4N3J19P9L4j31Nn4L9j3j58M6N6o4k7M2M0k4j55J0J11M8
$$ -75 -120 -211 -158 -133 -187 -150 -122 -58 -5 114 193 227 96 101 47 86 73 -85 -39 17 -47 -74 -32 8 -16 -171 -161 -50 -2
62.9039bj35o2j9k6J17Qk8J72M1r6m4J48k4N2J01KP7P1m5j30k6k1K5K9O4j28j27RL2
$$ -2 -137 -199 -218 -244 -127 -119 -147 25 66 -30 -74 74 50 102 203 205 282 353 308 178 152 131 156 185 249 121 -6 3 35
62.7103C5j5L6p1j97j14P1J68O5mK3m0P8J3m2q9n1K8P5N9M4j01p6J1l1j0k9O9m3j7Q4
$$ 35 20 56 -15 -212 -326 -255 -87 -22 -26 -3 -43 35 48 6 -83 -134 -106 -31 28 72 -29 -105 -94 -125 -135 -164 -95 -138 -155 -71
62.5100g1K24M7QJ22p4k29k3o2o1p4n2J06J55K8l1Q5j9k00r8L9k4j63J45J15k4JON5
$$ -71 153 200 208 330 256 27 4 -58 -119 -193 -245 -139 16 44 13 98 79 -121 -219 -180 -204 -367 -222 -107 -131 -130 -124 -69
62.3231f9Q8N9Q7n5k8K2p5lk3p7l4j26j5j6J06M4N2K1J80K2j33N2kjl0k0M7J24J22j53
$$ -69 19 78 165 110 82 104 29 26 3 -74 -108 -234 -249 -265 -159 -115 -63 -42 138 160 27 79 77 76 46 26 73 197 319 166
62.1228A66k73m6RJ5QN4l2jJ33j22j08J6m8m1J15J20J0k5m9o1r1M2N7P5L2R2NJ3J55
$$ 166 -107 -153 -144 -129 -121 -67 -99 -100 33 -89 -197 -181 -229 -270 -155 -35 -25 -50 -99 -160 -251 -209 -152 -77 -45 47 52 65 220
61.9292B20m1K1N6QqJL7j27j12j22J5j53l0L9O9m6QJ8l0j4N5M6P6Q3L6j9n6j04KQnn7
$$ 220 179 200 256 264 256 257 294 167 55 -67 -52 -205 -235 -196 -127 -173 -165 -147 -177 -191 -136 -90 -14 69 105 86 30 -74 -72 -64 -69 -126
61.7155a26p1N5M9m6j1K1R5P2j6o7j48j6%J34O7M4Kj6L1j2p8J1M1L1j4P9m8o5RK3m5
$$ -126 -197 -142 -93 -139 -150 -129 -34 38 22 -45 -193 -209 -209 -75 -8 36 38 22 53 41 -37 -26 15 46 32 111 63 -2 7 30 -15
61.5085a5J91l0l9n0L3Lk9M9L6n9n7l1j01p0j0J50Q2J5L7j28k8%kM7m3j44M8J77O4Q8
$$ -15 176 146 107 57 90 93 64 113 149 90 33 2 -99 -169 -179 -29 53 68 105 -23 -51 -51 -53 -6 -49 -193 -145 32 96 184
61.3083A84j0j09J3K5j76o7K1J10k6J30Q3q9j17k3K0K6K5k7K9k9j30L5Q4%o2p2j50p1
$$ 184 174 65 78 103 -73 -140 -119 -9 -35 95 178 89 -28 -51 -31 -5 20 -7 22 -7 -137 -102 -18 -18 -80 -152 -302 -373
61.1213c73O8M4P1M8R2l1q3J16J27L6o7M0O6q2k8p2k0m4j25l4m0R4Q6mJ02N0p6j19O7
$$ -373 -305 -261 -190 -142 -50 -81 -164 -48 79 115 48 88 154 72 44 -28 -48 -92 -217 -251 -291 -197 -111 -115 -13 37 -39 -158 -91
60.9277i1l4l6l5O1K7K2L9q6n9J4N9N7O2j30r1K5K3R6Q8J12J7j13j77l9LK05P2j1j13
$$ -91 -125 -161 -196 -135 -108 -86 -47 -133 -192 -178 -119 -62 0 -130 -221 -196 -173 -77 11 123 140 27 -150 -189 -186 19 91 80 -33
60.7341c3n8P4J28K2j44J8L3r9J15Jj25r8N8k3k6J41J02q5l8N6TR9M5k2j63j06j9ko3
$$ -33 -91 -17 111 133 -11 7 40 -59 56 57 -68 -166 -108 -131 -157 -16 86 1 -37 19 75 174 219 197 34 -72 -91 -93 -156
60.5405a56L7j5R4L4j07q5J05P9j03m2R0N2K4M2m3p5o6K2O8Q9m3k5Lm4MP8Q6j8o0j76
$$ -156 -119 -134 -40 -6 -113 -198 -93 -14 -117 -159 -69 -17 7 49 6 -69 -135 -113 -45 44 1 -24 -21 -65 -61 17 103 85 25 -151
60.3402a51j11P4J93J36rJ0j37j49m1j4K0K9P3J00Mq2L1k6q7oL0j0J11n6n3k5K6m0n
$$ -151 -262 -188 5 141 132 142 5 -144 -185 -199 -179 -150 -77 23 27 -55 -24 -50 -137 -143 -113 -123 -12 -68 -121 -146 -120 -160 -165
60.1466a65Jo1n8J62J82R5j45q8P8O9j57n9L3J58P1r0q4N6n4mJ8J4m1j50OJ69k2K9J23
$$ -165 -164 -225 -283 -121 61 156 11 -77 1 70 -87 -146 -113 45 116 26 -58 -2 -56 -60 -42 -28 -69 -219 -213 -44 -66 -37 86
59.9530H6n0J5o7j4oOJ0O1L9r7J8m9j33N7N2m5n7m8O1J79P9M%m3o3J3J08l1KL5k6j1
$$ 86 36 51 -16 -30 -36 -30 -20 41 80 -17 1 -48 -181 -124 -72 -117 -174 -222 -161 18 97 101 101 58 -5 8 116 85 87 122 96 85
59.7393H5L4O6M7j6k3m7r7n2M0K3l3n2N7J28J7q0o1k0k2K06Q0j50n5q1j50mJ58P0o6
$$ 85 119 185 232 216 193 146 49 -3 37 60 27 -25 32 160 177 97 36 16 -6 200 280 130 75 -6 -156 -160 -2 68 2
59.5457Bo1r8O4j1P5J2o1l6O1K6J0n7R1J09p3j17K7J5J72Q8p0j47p4O4J54p7j41N2o
$$ 2 -59 -157 -93 -104 -29 -17 -78 -114 -53 -27 -17 -74 17 126 53 -64 -37 -22 150 238 168 21 -53 11 165 88 -53 -1 -7
59.3521gMr2o5J16j0k3n2j2J12J3Jj97p4J07jQ9Q1j8q2m0L8m5N6j6N6kp2n4l8q6N1J27
$$ -7 -3 -95 -160 -44 -54 -77 -129 -141 -29 -16 -15 -212 -286 -179 -180 -91 -10 -28 -110 -150 -112 -157 -101 -117 -61 -63 -135 -189 -227 -313 -262 -135
59.1385a35M4k7J5p4J4O8L5q0n2N4J38Oj16lJ74K0o6O2J95j20o4M2q0n4O2jL2kPj74
$$ -135 -91 -118 -103 -177 -163 -95 -60 -140 -192 -138 0 6 -110 -113 61 81 15 77 272 152 88 130 50 -4 58 57 89 87 94 -80
58.9382h0L8k0Lm1j1Q6q7j3J52J15n8o6q6j8O2J68Mk7n1Q0O7j30l3j5j43p7j3J06o2
$$ -80 -42 -62 -59 -100 -111 -25 -112 -125 27 142 84 18 -68 -86 -24 144 148 121 70 150 217 87 54 39 -104 -181 -194 -88 -150
58.7445a50q2n5J14p2k0R5K6L4J34k4j78k0J22J84K24j22j34lN0o6j05jM4J05k7j21
$$ -150 -232 -287 -173 -245 -265 -170 -144 -110 24 0 -178 -198 -76 108 332 210 76 73 123 57 -48 -49 -5 100 73 -48
58.5710d8n1O7M1Q1n5Mj21M3Q0n5q5q0j01k1J47J62o8k6J35R9j02mq9q7L9P0J4J04P7
$$ -48 -99 -32 9 90 35 39 -82 -39 41 -14 -99 -179 -280 -301 -154 8 -60 -86 49 148 46 42 -47 -134 -95 -25 -11 93 170
58.3773A70Kk0KJ3J9k6j47p3J16M3P5k0j1J16j38o3M0Mpj61k5L9m8n0R1k9j1j8M2j1
$$ 170 172 152 154 167 186 160 13 -60 56 99 174 154 143 259 121 58 98 102 95 -66 -91 -52 -100 -150 -59 -88 -99 -117 -75 -86
58.1771h6PK4j2KJ5%j21J4Q4K1o0j8J7J08Q5n7L7J02j1j03P4J23K4m5j93j58J14J27
$$ -86 -79 -55 -67 -65 -50 -50 -171 -157 -73 -52 -112 -130 -113 -5 80 23 60 162 151 48 122 245 269 224 31 -127 -13 114
57.9901A14m8NM7Jo0m7j98j14J1L9M3N9J9N7k4m9k7M0M4J70QJ0lj02o4P4P2k0K1J02
$$ 114 66 71 118 119 59 12 -186 -300 -289 -250 -207 -148 -129 -72 -96 -145 -172 -132 -88 82 90 100 97 -5 -69 5 77 57 78 180
57.7898A80k6q9Jmr7M6Nl3R3Rrk8L3L5k2j19n9N2Q8N5q9o2k0l9L9l4m7L8K0J7p1Nj5
$$ 180 154 65 66 62 -35 11 16 -17 76 85 76 48 81 116 94 -25 -84 -32 56 111 22 -40 -60 -99 -60 -94 -141 -103 -83 -66 -137 -132 -147
57.5695a47O6O2J12q0j54P8J88l8k3J1l1M1RJ04j3p1L5m2K0N4l9pl0l2K0l3j16q2p7
$$ -147 -81 -19 93 13 -141 -63 125 87 64 75 44 85 94 198 185 114 149 107 127 181 142 135 105 73 93 60 -56 -138 -215
57.3759b15P0M6j61o7J5R8J08lL5%p0J9M3J35O1K7n2k5p7OJ03J05j15m5L4L9nl7j36
$$ -215 -145 -99 -260 -327 -312 -214 -106 -109 -74 -74 -144 -125 -82 53 114 141 89 64 -13 -7 96 201 86 41 75 114 109 72 -64
57.1823f4m5J00K12K4p8q8K9j30j65j8Q2j35o7N1M3K3mnR8j8j5J08R7n4m1RJ21J1j51
$$ -64 -109 -9 203 227 149 61 90 -40 -205 -223 -141 -276 -343 -292 -249 -226 -230 -235 -137 -155 -170 -62 35 -19 -60 -51 70 81 -70
56.9887g0K5J1Jn0J7m4po4l6NJ1p9k2J20J25L9M7P9j10j44m0Q3PN1o1n7P2J36o8K0Q1
$$ -70 -45 -34 -33 -83 -66 -110 -117 -181 -217 -212 -201 -280 -302 -182 -57 -18 29 108 -2 -146 -186 -103 -96 -45 -106 -163 -91 45 -23 -3 78
56.7817G8J5jj03M6J62o6r1KLn2Jj4o6J08N4Q4rj50k3Oo7R0r9j12K8K40P4N9j25j45
$$ 78 93 92 -11 35 197 131 40 42 45 -7 -6 -20 -86 22 76 160 151 1 -22 -16 -83 7 -92 -204 -176 64 138 197 72 -73
56.5814g3k8J0JJ0j83Lo6R0J93L2J0N5K0J28p7n0k9q0j23m3O9J30M6M5L0J8Pm6Qn4r7
$$ -73 -101 -91 -90 -80 -263 -260 -326 -236 -43 -11 -1 54 74 202 125 75 46 -34 -157 -200 -131 -1 45 90 120 138 145 99 107 53 -44
56.3744d4j9k7m1J22J9Kj05j48l0J07Q4j05n2J44L2kQO7mkR0jn8n5q1n3OP5j13M0N4
$$ -44 -63 -90 -131 -9 10 12 -93 -241 -271 -164 -80 -185 -237 -93 -61 -63 -55 12 8 6 96 95 37 -18 -99 -152 -146 -71 -184 -144 -90
56.1675i0KRj1m1L4L5J0n1r1J7n8N9J05l5J2j1M2O4p8J9L0J17j5j51K4N4R2Q3lj50p7
$$ -90 -88 -79 -90 -131 -97 -62 -52 -103 -194 -177 -235 -176 -71 -106 -94 -105 -63 1 -77 -58 -28 89 74 -77 -53 1 93 176 173 23 -54
55.9605e4kp7q8O8J7M4J23O1jo0p0N5n4k6J72J07n3n8j53j41kM1R0M3P9J15o2q0L5R2
$$ -54 -56 -133 -221 -153 -136 -92 31 92 91 31 -39 16 -38 -64 108 215 162 104 -49 -190 -192 -151 -61 -18 61 176 114 34 69 161
55.7602A61j29r7N4L9M4j06P8N3o1j02l7O8r7q7N8j07j34J39K06J05L0j0M4n3q2OQ4
$$ 161 32 -65 -11 28 72 -34 44 97 36 -66 -103 -35 -132 -219 -161 -268 -402 -263 -57 48 78 68 112 59 -23 -17 67
55.5800F7J17m1k9l7j0L0j5o2J1o3o0K4N0q6M5Q5o0p8N4P7Q3pj48j21L1o0J3JP7J07
$$ 67 184 143 114 77 67 97 82 20 31 -32 -92 -68 -18 -104 -59 26 -34 -112 -58 19 102 95 -53 -174 -143 -203 -190 -189 -112 -5
55.3797ej2N2J8n4m0Ok1r7j25L8P9Q7J40j0q8J2K8P0M5L5Ko4k3n1N8q6L2ll9pJ43Q8
$$ -5 -17 35 53 -1 -41 -35 -56 -153 -278 -240 -161 -74 66 56 -32 -20 8 78 123 158 160 96 73 22 80 -6 26 23 -16 -23 120 208
55.1660B08j6l1m2PJ9mo5j55j1R4q9l5j0n4O4%TK8J21M3J46k8j13q9PkM8M6N4o6j52
$$ 208 192 161 119 126 145 141 76 -79 -90 4 -85 -120 -130 -184 -120 -120 -120 -92 29 72 218 190 77 -12 -5 -7 41 87 141 75 -77
54.9591g7lP3O2m7l8O0%n9n6o6L9J47O0o3l5m1K1j2k3J0j4L3m5o9m4l0N3okJ53N8q2
$$ -77 -80 -7 55 8 -30 30 30 -29 -85 -151 -112 35 95 32 -3 -44 -23 -35 -58 -48 -62 -29 -74 -143 -187 -217 -164 -170 -172 -19 39 -43
54.7454d3j03j2M1k1p5K4J22O9P0k1k3n9m3J00q2m5nj1lm7N2J6R8J07m8K1O2L2m7j83
$$ -43 -146 -158 -117 -138 -213 -189 -67 2 72 51 28 -31 -74 26 -56 -101 -106 -117 -120 -167 -115 -99 -1 106 58 79 141 173 126 -57
54.5451e7MQ7K9k0J18k13q1N8k9o0j32O7O0rN2J14N9n7j08K2P7R9j0j08J35J38o6j50
$$ -57 -53 34 63 43 161 -52 -133 -75 -104 -164 -296 -229 -169 -178 -126 -12 47 -10 -118 -96 -19 80 70 -38 97 235 169 19
54.3582A9M4P9J1j08j26N9J12l8j10K5J12L3R9lo1n9j10L8L4k2J3M8j51k7R9n2j22n6
$$ 19 63 142 153 45 -81 -22 90 52 -58 -33 79 112 211 208 147 88 -22 16 50 28 41 89 -62 -89 10 -42 -164 -220
54.1713b20P0J14Q7J28n0j26k01Q9N1o2q8l4m0qN2J22J3J25K09OK6j22q2l3J16K5o0
$$ -220 -150 -36 51 179 129 3 -198 -109 -58 -120 -208 -242 -282 -290 -238 -116 -103 22 231 237 263 141 59 26 142 167 107
53.9910A07j26K3M9r7o0Q1J41k1MP0j8j00J19l6mK9j38j41J84M6n4K5p3m9k1qN4m8l5
$$ 107 -19 4 53 -44 -104 -23 118 97 101 171 153 53 172 136 132 161 23 -118 66 112 58 83 10 -39 -60 -68 -14 -62 -97
53.7974i7M8N7J1r6k7O6Kl1j9N3q4J01J40m5n6N1K1M1J04rj08j58q6L5R1J25K6j19q5
$$ -97 -49 8 19 -77 -104 -38 -36 -67 -86 -33 -117 -16 124 79 23 74 95 136 240 231 123 -35 -121 -86 5 130 156 37 -48
53.6038d8N7J56q3k9J38p4j26l6m6Q1J64O4p2p0n7k3Jk4P8l2jP1R4k1p9j3k7r8mm2R4
$$ -48 9 165 82 53 191 117 -9 -45 -91 -10 154 218 146 76 19 -4 -3 -27 51 19 18 89 183 162 83 70 43 -55 -59 -101 -7
53.3968gJ03K1m0J02J54m6j81L2j88n5o9j18j4J89Q4n9K3Nk7Np6o2N9M8k3K9M9k6J04
$$ -7 96 117 77 179 333 287 106 138 -50 -105 -174 -292 -306 -117 -33 -92 -69 -64 -91 -86 -162 -224 -165 -117 -140 -111 -62 -88 16
53.2032A6j1K7K9N6p7j46r2O4M6N6nL8P8J43Qo6n0J7J02Q2m7j36l3o5l1M3o5l8K8k7
$$ 16 5 32 61 117 40 -106 -198 -134 -88 -32 -37 1 79 222 230 164 114 131 233 315 268 132 99 34 3 46 -19 -57 -29 -56
53.0029e6O9J35k08k21nJ02R6ON4O5J00m2r7MJ7n5O1O8j39l5L1j2Q0omk6N8P0j1L9l3
$$ -56 13 148 -60 -281 -286 -184 -88 -82 -28 37 137 95 -2 2 19 -36 25 93 -46 -81 -50 -62 18 12 8 -18 40 110 99 138 105
52.7959A05j26j35l3j11P0J00Q0J20n9j04k0M8J5N6n6l7R8K01M9p7k0j37j5P2K8j20
$$ 105 -21 -156 -189 -300 -230 -130 -50 70 11 -93 -113 -65 -50 6 -50 -87 11 212 261 184 164 27 12 84 112 -8
52.6223hj18J19L9m2n2N6K6R3j66l3k7M1K24n4n9Tk6o6M7P9J32Q7p4j9Q9K4N4q6j23
$$ -8 -126 -7 32 -10 -62 -6 20 113 -53 -86 -113 -72 152 98 39 -20 -46 -112 -65 14 146 233 159 140 229 253 307 221 98
52.4287I8Q5R1j06j66m0p1J15M8P6n5j51K4O9M6O0mj09J7L1J56O6Rq8L8K0Ko6r6L4L2
$$ 98 183 274 168 2 -38 -109 6 54 130 75 -76 -52 17 63 123 119 10 27 58 214 280 289 201 239 259 261 195 99 133 165
52.2284A65p5R8j8J16j19k19Kk8NQ3k9r5j6J08N9J72R3m7j5R3q8j12m5k4L9K0TO0r8
$$ 165 90 188 170 286 167 -52 -50 -78 -73 10 -19 -114 -130 -22 37 209 302 255 240 333 245 133 88 64 103 123 143 203 105
52.0348A05j16j0LK2JO7J66L1%j64K4O6M3N5oJ11K1p7J8M6P0j3J65J35K32K26K20J92
$$ 105 -11 -21 -18 4 5 72 238 269 269 105 129 195 238 293 287 398 419 342 360 406 476 463 628 763 995 1221 1441 1633
51.8479A633L72Q68J884L700P906P555n279r472m662j875j065o36k63M6n5k45j69r2
$$ 1633 2005 2873 4757 8457 16363 23918 18639 9167 4505 2630 1565 929 666 712 657 412 243 151
51.7277A51j28Pj4P1m9j7K7R1j67n2m3k0N1L1M8O2o3J1K7m7TKMN1lP6m2MQ7Lj6k01l0
$$ 151 23 30 16 87 38 21 48 139 -28 -80 -123 -143 -92 -61 -13 49 -14 -3 24 -23 -70 -68 -64 -13 -16 60 18 22 109 112 96 -105 -135
51.5074a35L7J0j4l6qJ3k5O7K2N0P7n1j73p7K6Q2l2M0K5O6J43j02j04J27L1K6r2JM8
$$ -135 -98 -88 -102 -138 -146 -133 -158 -91 -69 -19 58 7 -166 -243 -217 -135 -167 -127 -102 -36 107 5 -99 28 59 85 -7 -6 42
51.3138D2L4Oj15q5Pm8m9M0P7L2jN7J09l9o3M7J1O1m8o9k0Q9P0k7n8o4j46j68n8k3J18
$$ 42 76 82 -33 -118 -111 -159 -208 -168 -91 -59 -60 -3 106 67 4 51 62 123 75 6 -14 75 145 118 60 -4 -150 -318 -376 -399 -281
51.1068b81l4N0J14J66J0j0j56k0N4KN3l8r8j34j5M0N1J12o3n3O7q0p1k4o6K2P1P3J13
$$ -281 -315 -265 -151 15 25 15 -141 -161 -107 -105 -52 -90 -188 -322 -337 -297 -246 -134 -197 -250 -183 -263 -334 -358 -424 -402 -331 -258 -145
50.9132a45N5J9R9L1PP7K6p7o0k5NK5j29j45L8j9PJ66J51K5j6r9L0k2J3o9ok5m0l8J2
$$ -145 -90 -71 28 59 66 143 169 92 32 7 12 37 -92 -237 -199 -218 -211 -45 106 131 115 16 46 24 37 -32 -38 -63 -103 -141 -129
50.7062a29k7LJ32K4j10j5QK0J50K1o9L2N7On7J05j06r9L5P3rj12o9%m5k2J2P7N5O1
$$ -129 -156 -153 -21 3 -107 -122 -114 -94 56 77 8 40 97 103 46 151 45 -54 -19 54 45 -67 -136 -136 -181 -203 -191 -114 -59 2
50.5059Bjm6m3J7qk0j3%J0M6R4J12J8J5TJl6j63j03O8kq0p0l4J10J14j2l4k6l1J0Q8
$$ 2 1 -45 -88 -71 -79 -99 -112 -112 -102 -56 38 150 168 183 198 199 163 0 -103 -35 -37 -117 -187 -221 -111 3 -9 -43 -69 -100 -90 -2
50.2923bN9j6j56N7P7L2o7Qm5k26K3J19J27k1j3n0k0P6J30n1j8L6p1j57K0J34l3K4J48
$$ -2 57 41 -115 -58 19 51 -16 -8 -53 -279 -256 -137 -10 -31 -44 -94 -114 -38 92 41 23 59 -12 -169 -149 -15 -48 -24 124
50.0987A24j17j00N4qk6q0o3Q7k4N4o8mON2J80Q4k2l3nJ65N0p4j19l3p1r6k01KLJ46
$$ 124 7 -93 -39 -47 -73 -153 -216 -129 -153 -99 -167 -171 -165 -113 67 151 129 96 91 256 306 232 113 80 9 -87 -288 -286 -283 -137
49.8984a37R5OLN2TQ1Q7l6q5n4K6p5o4J69L3q8Lk8l7j2nk0nL2l4k8O7J2L5K2j62N7J8
$$ -137 -42 -36 -33 19 71 152 239 203 118 64 90 15 -49 120 153 65 68 40 3 -9 -14 -34 -39 -7 -41 -69 -2 10 45 67 -95 -38 -20
49.6781b0j0K4K2j26J25L8k05mk4j18R4J73K41L9m4o4qr9Jj4j62N0R0j8o1L6J51J5q4
$$ -20 -30 -6 16 -110 15 53 -152 -156 -180 -298 -204 -31 210 249 205 141 133 34 35 21 -141 -91 -1 -19 -80 -44 107 122 38
49.4845C8j33oJ07j0q1J02Q3P2k5p0l5R8J8j07Oj04o1K5j5N2Q3L4J7K5l5p7j04n6M8
$$ 38 -95 -101 6 -4 -85 17 100 172 147 77 42 140 158 51 57 -47 -108 -83 -98 -46 37 71 88 113 78 1 -103 -159 -111
49.2909a11kJ41J08j4J62q4p3o4P3j45J8R5N8k6n8j04J18N2j0j5l6M0j26m1K7k9K0o
$$ -111 -113 28 136 122 284 200 127 63 136 -9 9 104 162 136 78 -26 92 144 134 119 83 123 -3 -44 -17 -46 -26 -32
49.1039c2KQR1Q4O1n5j35p9K2p7j27O2L9PK1J03O3Q2Tp4J5l5j27j6M9n6n7oJ54o7j4
$$ -32 -30 -22 69 153 214 159 24 -55 -33 -110 -237 -175 -136 -129 -108 -5 58 140 222 148 163 128 1 -15 34 -22 -79 -85 69 2 -12
48.8969a2j1K6P4o9QR0j5p6Q3Q6n5j17p1l0j09J40P9kP1J59L0p0l6N3k0n9o4r2J6N0
$$ -12 -23 3 77 8 16 106 91 15 98 184 129 12 -59 -89 -198 -58 21 19 90 249 279 209 173 226 206 147 83 -9 7 57
48.6967E7p3q9J0M0N5j5k0L8%L9r0j54J5n1J14J40O1j27J8O2j33nN4O5KJ7K4r8m3K7
$$ 57 -16 -105 -95 -55 0 -15 -35 3 3 42 -48 -202 -187 -238 -124 16 77 -50 -32 30 -103 -108 -54 11 13 30 54 -44 -87 -60
48.4964f0P1kj66j29j0P3O6K6j01j75j1K43J66jk2p5j42p3N3L5P2Q0K1m3Q3jJ08O0J45
$$ -60 11 9 -157 -286 -296 -223 -157 -131 -232 -407 -418 -175 -9 -10 -32 -107 -249 -322 -269 -234 -162 -82 -61 -104 -21 -22 86 146 291
48.3028B91J0j24j89Rm9j28M6qJ37J46P1j01o4l1n7j60r5J90J70M9K8j20k8P9j58j1
$$ 291 301 177 -12 -3 -52 -180 -134 -142 -5 141 212 111 47 16 -41 -201 -296 -106 64 113 141 21 -7 72 -86 -97
48.1292i7N6p9J13J17j8K0o9LKM0p3m3Q0M2m8Tq6J3j7k5L2J18L5O0qN5Lj10j03j34K5
$$ -97 -41 -120 -7 110 92 112 43 46 48 88 15 -28 52 94 46 -2 -88 -75 -92 -117 -85 33 68 128 120 175 178 68 -35 -169 -144
47.9222a44J24K2p1L8J39L2o3j19J7J05J39J38o8k37KJ55j58o6N7j19J24N0n8pPM0k4
$$ -144 -20 2 -69 -31 108 140 77 -42 -25 80 219 357 289 52 54 209 51 -15 42 -77 47 97 39 32 39 79 55
47.7419E5m2q5j48Jm8L6J23K8Q1k3j39j15j21P3K03L6Qk0K6K7p5q1l7J40J33L7Q7J5
$$ 55 13 -72 -220 -219 -267 -231 -108 -80 1 -22 -161 -276 -397 -324 -121 -85 -77 -97 -71 -44 -119 -200 -237 -97 36 73 160 175
47.5550A75j44jJ31Kj72j18r9J22L9j16J7J26J14n9j94j1L0l8P7Q1o8%m2n5L9J41L0
$$ 175 31 30 161 163 -9 -127 -226 -104 -65 -181 -164 -38 76 17 -177 -188 -158 -196 -119 -38 -106 -106 -148 -203 -164 -23 7
47.3747Gk01l2J00N3K4k8l1N3k5k2O0j48m5OK2NQ5q5j75N6K22J35J03M4j1p3J4l7j15
$$ 7 -194 -226 -126 -73 -49 -77 -108 -55 -80 -102 -42 -190 -235 -229 -207 -202 -117 -202 -377 -321 -99 36 139 183 172 99 113 76 -39
47.1811c9q5j5M2QP6O6Nk3L9j5K9j3j06oN6l4M2R6j06j29O4kj8jM8p5M7P3l9j5KLM3
$$ -39 -124 -139 -97 -89 -13 53 58 35 74 59 88 75 -31 -37 19 -15 27 123 17 -112 -48 -50 -68 -69 -21 -96 -49 24 -15 -30 -28 -25 18
46.9608A8m1k1m2k8j6lL5N3q2l8RL9l6o4P0J26J51N5j24k4k5pm0l5r5PP4J22o1j21l1
$$ 18 -23 -44 -86 -114 -130 -133 -98 -45 -127 -165 -156 -117 -153 -217 -147 -21 130 185 61 37 12 5 -35 -70 -165 -158 -84 38 -23 -144 -175
46.7538a75K4K5l3R8K6l7K0rR7mJ8J16j07p5j2JJ1n2j13K1J52nj9M3Jj27K0J11J08J8
$$ -175 -151 -126 -159 -61 -35 -72 -52 -61 36 32 50 166 59 -16 -28 -27 -16 -68 -181 -160 -8 -13 -32 11 12 -115 -95 16 124 142
46.5536A42l2r7n5m4M3O6J15N3o8j36pJ00R9P5m5k20j03M3R4Q1p7r4j1K7p6K1J3J07
$$ 142 110 13 -42 -86 -43 23 138 191 123 -13 -20 80 179 254 209 -11 -114 -71 23 104 27 -67 -78 -51 -127 -106 -93 14
46.3666A4k7j39k5K5m0q3j7J09R9L9L7rj02q6J20O5L6m2l0JkQ6oL7R3N8k1q3j14N0J16
$$ 14 -13 -152 -177 -152 -192 -275 -292 -183 -84 -45 -8 -17 -119 -205 -85 -20 16 -26 -56 -55 -57 29 23 60 153 211 190 107 -7 43 159
46.1596A59J03Ok4r5q9N5k6m7l4O4lo8jP9Kk4K7j2q2J3M4L4j6m7j18n4l1O5J1M2J23
$$ 159 262 268 244 149 60 115 89 42 8 72 69 1 0 79 81 57 84 72 -10 3 47 81 65 18 -100 -154 -185 -120 -109 -67 56
45.9527E6L7N8j47To8J65J31J1j17j58J6J27J23P7l5J5J0k8j15n8k1R3Q1M7j05m3L2
$$ 56 93 151 4 -143 -211 -46 85 96 -21 -179 -163 -36 87 164 129 144 154 126 11 -47 -68 25 106 153 48 5 37
45.7724C7jM2O3Ro5m1pk5J0k1O9k4j02J1q7l7m6P3L9k2O2k4q7J42N4j39M3R9L4Nj15
$$ 37 36 78 141 150 85 44 37 12 22 1 70 46 -56 -45 -132 -169 -215 -142 -103 -125 -63 -87 -174 -32 22 -117 -74 25 59 64 -51
45.5655e1j81k0L2o2L4K27L8j11k07n8J99L9O5N3m3N6n6M7LL5m8n3RM1J43J18N7l3j91
$$ -51 -232 -252 -220 -282 -248 -21 17 -94 -301 -359 -160 -121 -56 -3 -46 10 -46 1 4 39 -9 -62 -53 -12 131 249 306 273 82
45.3718H2j27NJ6kKJ3o7j33n6j05r3J11J74J48N9J16L6L0l5o8p1n5L3K6j2oj8k1o1K2
$$ 82 -45 -40 -24 -26 -24 -11 -78 -211 -267 -372 -465 -354 -180 -32 27 143 179 209 174 106 35 -20 13 39 27 21 3 -18 -79 -57
45.1716e7r4L7K9r2N9Q6J2q2j5RP4Q8n7q0L1L3K9o4j48k9P0k1j3P4J05l7M6K7m8o6R7
$$ -57 -151 -114 -85 -177 -118 -32 -20 -102 -117 -108 -34 54 -3 -83 -52 -19 10 -54 -202 -231 -161 -182 -195 -121 -16 -53 -7 20 -28 -94 3
44.9646Ck2p6RJ70Q1r9q6nJ06P0O5l8j62j34j2J58K1j07K5J18n6n1n7j2j6k3m6l2mO5
$$ 3 -19 -95 -86 84 165 66 -20 -25 81 151 216 178 16 -118 -130 28 49 -58 -33 85 29 -22 -79 -91 -107 -130 -176 -208 -212 -147
44.7643a47P6M9j68L5J66R9kj10p2j4TmJ0jQ7jl6p8Q2m5j12M7%j6J02M9n5J4j5K2P9
$$ -147 -71 -22 -190 -155 11 110 108 -2 -74 -88 -102 -106 -96 -97 -10 -11 -47 -125 -43 -88 -200 -153 -153 -169 -67 -18 -73 -59 -74 -52 27
44.5573B7J9m3L6LM1Q6p1p0%J4r0j96n0J50J56Qj59j23mJ88K22m3j20qq0RJ85L4J12
$$ 27 46 3 39 42 83 169 98 28 28 42 -48 -244 -294 -144 12 20 -139 -262 -266 -78 144 101 -19 -27 -107 -98 87 121 233
44.3637B33N6p8l8l5p8j41p2M3TM2%RR3nj14k0P1L9j9k1o4l4J37R5r4P1R4m3r4m6o3
$$ 233 289 211 173 138 60 -81 -153 -110 -67 -25 -25 -16 77 72 -42 -62 9 48 29 8 -56 -90 47 142 48 119 213 170 76 30 -33
44.1567c3r2j10O6J08O8k7N2j28K8P9L1p4%P8R9o4M7J17n5p5o1j80N0L7M5O7j33j47
$$ -33 -125 -235 -169 -61 7 -20 32 -96 -68 11 42 -32 -32 46 145 81 128 245 190 115 54 -126 -76 -39 6 73 -60 -207
43.9698b07Q0J6N0O7j23L1J07j13P7M9j57P7N3L7j19j4N8k2p0P8l6q8R6J41p0J27P8
$$ -207 -127 -111 -61 6 -117 -86 21 -92 -15 34 -123 -46 7 44 -75 -89 -31 -53 -123 -45 -81 -169 -73 68 -2 125 203
43.7895B03J0j32j62M8J01M2q3q8k9L6O0J35P5J6o4j26rk4K2q8jnL9Q7j00l1P1l6q1
$$ 203 213 81 -81 -33 68 110 27 -61 -90 -54 6 141 216 232 168 42 33 9 31 -57 -58 -63 -24 63 -37 -68 3 -33 -114
43.5959a14j6J51R4j43k08Q6K7K4j3Pj9Rm2m8o5K6M3J90R4Q5%m5m3l5o4o1k0n0k0J24
$$ -114 -130 21 115 -28 -236 -150 -123 -99 -112 -105 -124 -115 -157 -205 -270 -244 -201 -11 83 168 168 123 80 45 -19 -80 -100 -150 -170 -46
43.3956d6o2J6j4pO0K6k8LM3M5JqO0k0l1M0Jn1P9R6nj21o6m0J7L7n5P1L6p2O3M4N2o
$$ -46 -108 -92 -106 -113 -53 -27 -55 -52 -9 36 37 29 89 69 38 78 79 28 107 203 198 77 11 -29 -12 25 -30 41 77 5 68 112 164 158
43.1686A58O6LM5r5k40j7p0Lm5N0J26RTL50L6j75j53p3Rn4NP6O4P5J7m8j62P8J01N6
$$ 158 224 227 272 177 -63 -80 -150 -147 -192 -142 -16 -7 2 352 388 213 60 -13 -4 -58 -53 23 87 162 179 131 -31 47 148 204
42.9684B04j1n1j03j60L4l6Q3mj38j5K13p4p5j3L9r4m4N8M1q2P2J12J7J21m1OQ8j13
$$ 204 193 142 39 -121 -87 -123 -40 -44 -182 -197 16 -58 -133 -146 -107 -201 -245 -187 -146 -228 -156 -44 -27 94 53 59 147 34
42.7814C4j32o6o3Q0L9l2n6J08J01omP4j5j6o3n3l1J82J3Nj18l9o9M6lj6jM6L9JL7Q9
$$ 34 -98 -164 -227 -147 -108 -140 -196 -88 13 7 3 77 62 46 -17 -70 -101 81 94 99 -19 -58 -127 -81 -84 -100 -101 -55 -16 -15 22 111
42.5678A11J13O4l3j07j45O7J37j78j06J3J58J10l2j22M5j15j2R7pl7Pn3k2qN1P8K6
$$ 111 224 288 255 148 3 70 207 29 -77 -64 94 204 172 50 95 -20 -32 65 58 21 28 -25 -47 -55 -4 74 100
42.3875A00o2q7j5K8M7r8p1J4j62j6%M7R5N6J74N5q7o1M2o3j14L6R7O3K8j0j03n7k5
$$ 100 38 -49 -64 -36 11 -87 -158 -144 -306 -322 -322 -275 -180 -124 50 105 18 -43 -1 -64 -178 -142 -45 18 46 36 -67 -124 -149
42.1939a49L4R1N8JRJ4P1m8k69o5Q3J04L8Q4M4r8m6K6P3M2N4ql6Qj5j76j84n7J95J72
$$ -149 -115 -24 34 35 44 58 129 81 -188 -253 -170 -66 -28 56 100 2 -44 -18 55 97 151 143 107 115 100 -76 -260 -317 -122 50
41.9936E0l3o7Lq1M2J00Rr2j1J34q6p7j7J18Q5J14lj19j95j58K8K4JK04J69N1qp2m6
$$ 50 17 -50 -47 -128 -86 14 23 -69 -80 54 -32 -109 -126 -8 77 191 188 69 -126 -284 -256 -232 -231 -27 142 193 185 113 67
41.8000F7L4q6Mm8j44j51k0K54P6l4l5Q3J18j46j16r8kR6J62O0o1km2k9L4N8K5oj18
$$ 67 101 15 19 -29 -173 -324 -344 -90 -14 -48 -83 0 118 -28 -144 -242 -244 -148 14 74 13 11 -31 -60 -26 32 57 51 -67
41.6064f7l9J06J04r3%R7O8K4j95j5j2r3m4O2K7P9J51r4j37Q5j4n7P5J6P2Q1Nj61j25
$$ -67 -106 0 104 11 11 108 176 200 5 -10 -22 -115 -159 -97 -70 9 160 66 -71 14 0 -57 18 34 106 187 192 31 -94
41.4128i4o1L5R5j0J19j14k40J0J00J30R0P2l5j3K2rN0qj5K0M6j47pJp6j1P1J36k9K1
$$ -94 -155 -120 -25 -35 84 -30 -270 -260 -160 -30 60 132 97 84 106 97 147 139 124 144 190 43 36 37 -39 -50 21 157 128 149
41.2125A49M8m9q8j13q7N2J28J08k1K4k3o7Nn8k5N0L3n4o8L9k5j02r4NK4P2J31L7n1
$$ 149 197 148 60 -53 -140 -88 40 148 127 151 128 61 66 8 -17 33 66 12 -56 -17 -42 -144 -238 -233 -209 -137 -6 31 -20
41.0189b0q9O3R0K4q1J0P8Q9l1j69j24L6R7J1J22K1r4j12M7M2O0o9j2p6J8J23k7k0N6
$$ -20 -109 -46 44 68 -13 -3 75 164 133 -36 -160 -124 -27 -16 106 127 33 -79 -32 10 70 1 -11 -87 -69 54 27 7 63
40.8253F3q8o6Q2J22K4p8mM7N9J02m8r9M4N9p8l0LM9o2r3J30K1j73j0J11O2l0m5O3j
$$ 63 -25 -91 -9 113 137 59 55 102 161 263 215 116 160 219 141 111 114 163 101 8 138 159 -14 -24 87 149 119 74 137 136
40.6250A36k3o4J8P5k8J0r7n5P8No8l1mp9L3M4M7Lj3j04r1L0N2k9P9J55N1j13Q3l5p7
$$ 136 113 49 67 142 114 124 27 -28 50 55 -13 -44 -48 -127 -94 -50 -3 0 -13 -117 -208 -178 -126 -155 -76 79 130 17 100 65 -12
40.4180a2kl1L7OO7k1j9M8J6m3RJ23M0kj13j51n3j33m7K2L4M7J38M0l4j41j0L6R9O6
$$ -12 -14 -45 -8 -2 65 44 25 73 89 46 55 178 218 216 103 -48 -101 -234 -281 -259 -225 -178 -40 0 -34 -175 -185 -149 -50 16
40.2177A6J4L6J06j04j85L8R9LoM7K4o8R2J11L8O3r0j34L0m6r3N9J10ll6J5n1j16l7
$$ 16 30 66 172 68 -117 -79 20 23 17 64 88 20 112 223 261 324 234 100 130 84 -9 50 160 157 121 136 85 -31 -68
40.0241f8N6j0o3j18l3j1rQ3Q2o3j3K8o6l0M7L9N9L1M0R5J26l4n4kL5m5k7q1k3P6J52
$$ -68 -12 -22 -85 -203 -236 -247 -256 -173 -91 -154 -167 -139 -205 -235 -188 -149 -90 -59 -19 76 202 168 114 112 147 102 75 -6 -29 47 199
39.8171A99po1o3m7L9J8m3l6j70r7R9TP9jL3Q4j93o6O5j09K4R4nn2K3Qj9M9J32P5J8
$$ 199 192 131 68 21 60 78 35 -1 -171 -268 -169 -70 9 8 41 125 -68 -134 -69 -178 -154 -60 -65 -117 -94 -86 -105 -56 76 151 169
39.6102A69m8ro7omm2k3J3NJ23Mp8qj8Mm4l7k1m3Nj8JR7J60o3q2O3j48r8J23J00k6j4
$$ 169 121 112 45 39 35 -7 -30 -17 -12 111 115 37 29 11 15 -29 -66 -87 -130 -125 -143 -142 -45 115 52 -30 33 -115 -213 -90 10 -16 -30
39.3898c0k9j4Q4L9k9P4P9j2P5m3j50r6J2k2l6P8n8p9q6L4L0R3J24n6n1n7J30R6j14
$$ -30 -59 -73 11 50 21 95 174 162 237 194 44 -52 -40 -62 -98 -20 -78 -157 -243 -209 -179 -86 38 -18 -69 -126 4 100 -14
39.1962a4k6J1r6N2J07O7oj8j5q3m5n6j22P3k2j2J25K6K4L2j10l8J30L1l8M5lq9r8q3
$$ -14 -40 -29 -125 -73 34 101 95 77 62 -21 -66 -122 -244 -171 -193 -205 -80 -54 -30 2 -108 -146 -16 15 -23 22 19 -70 -168 -251
38.9959b51K9J14J54N6J0J1R8J7q7j54M1P3M5M8k2j99j2O3K0M9l9j18J36J19R0P2J4
$$ -251 -222 -108 46 102 112 123 221 238 151 -3 38 111 156 204 182 -17 -29 34 54 103 64 -54 82 201 291 363 377
38.8157C77n6j79l8k5O4j4p2j03P6N9J14n0q7N9m0n6J4Kpl7p7N5J56L1j04j00n4m2l4
$$ 377 321 142 104 79 143 129 57 -46 30 89 203 153 66 125 85 29 43 45 38 1 -76 -21 135 166 62 -38 -92 -134 -168
38.6221a68M7Q2k6j35L8Lm2O2Q0J4J38K7j10Ml1N7M4m9l1J4j27m7N7R2M0l2p6n2O5M1
$$ -168 -121 -39 -65 -200 -162 -159 -201 -139 -59 -45 93 120 10 14 -17 40 84 35 4 18 -109 -156 -99 -7 33 1 -75 -127 -62 -21
38.4218b1q8KK69kk13r5O0J73M7L0O3J0J01o7j04P4L0m1%j8j49l3o2N7J10p9m4J05m
$$ -21 -109 -107 162 160 -53 -148 -88 85 132 162 225 235 336 269 165 239 269 228 228 210 61 28 -34 23 133 54 10 115 111
38.2282A11J0o1q4KTO5N5l3Rk7J43N9j85n1K5k9J8J47K4l5M8K5K1j7j05o4N0qJ92l6
$$ 111 121 60 -24 -22 -20 45 100 67 76 49 192 251 66 15 40 11 29 176 200 165 213 238 259 242 137 73 123 115 307 271
38.0279B71j57j23m6Q8o6ML1j60k9J35L9o0J9J69o5k9N8P7lr5lk4J0j18N2J65n1j59
$$ 271 114 -9 -55 33 -33 -29 2 -158 -187 -52 -13 -73 -54 115 50 21 79 156 153 58 55 31 41 -77 -25 140 89 -70
37.8409g0O8O1mq0n5O0J53J50j56q7J4j39M3J53J68J03p6oj08q3J%J5k8j20m8R5l0l1
$$ -70 -2 59 55 -25 -80 -20 133 283 127 40 54 -85 -42 111 279 382 306 300 192 109 110 110 125 97 -23 -71 24 -6 -37
37.6473c7J4P0J17P3j2p7j65o1P1L1K2k4o8J25l3M0J25Q6j64q4O5j0J02Nj58j21p5l
$$ -37 -23 47 164 237 225 148 -17 -78 -7 24 46 22 -46 79 46 86 211 297 133 49 114 104 206 211 53 -68 -143 -146
37.4604a46J5O4J13J3j3m6O5L6l2N3o5q2Q2J39q6l2J8l4K3J2k2j33q6j7Q0M7ml6m3M5
$$ -146 -131 -67 46 59 46 0 65 101 69 122 57 -25 57 196 110 78 96 62 85 97 75 -58 -144 -161 -81 -34 -38 -74 -117 -72
37.2601g2R2l3q3o7n6l3K21J03o5o3n5M5R8j5m5j71J29J15m5j01k4J45M5ro3j2J45j0
$$ -72 20 -13 -96 -163 -219 -252 -31 72 7 -56 -111 -66 32 17 -28 -199 -70 45 0 -101 -125 20 65 56 -7 -19 126 116
37.0732A16P2K3r1j10p3k7J02M3n8o6N6J10K9j8K1n5p6j9J8R6K0j84j53j02J27J30P1
$$ 116 188 211 120 10 -63 -90 12 55 -3 -69 -13 97 126 108 129 74 -2 -21 -3 93 113 -71 -224 -326 -199 -69 2
36.8929BqM2Q0J4J2P1q6j25j46J3o4j5%K3L7K14K13Q6r0j30j6P3p7p6J28R5mj0o4q3
$$ 2 -6 36 116 130 142 213 127 2 -144 -131 -195 -210 -210 -187 -150 64 277 363 273 143 127 200 123 47 175 270 266 256 192 109
36.6926A09l0K2n0k4M8Q7mopm5rj36j1O9J12J33Q6R3j06j82j2P8r5j01j63P8R3j08P4
$$ 109 79 101 51 27 75 162 158 152 145 100 91 -45 -56 13 125 258 344 437 331 149 137 215 120 19 -144 -66 27 -81 -7
36.4990gR0K1M6j5p9j1L8j13K8J93M5q8r9R1L8j20j01j7J52K0j09o9R9K4L9M6n7Nl4
$$ -7 83 104 150 135 56 45 83 -30 -2 191 236 148 49 140 178 58 -43 -60 92 112 3 -66 33 57 96 142 85 90 56
36.3054E6o3q4j9M8K8J0J18J06J1Q7r0j45j07%J10P2n3L5M2j0P0O3J06q8m9O0O2L8j33
$$ 56 -7 -91 -110 -62 -34 -24 94 200 211 298 208 63 -44 -44 66 138 85 120 162 152 222 285 391 303 254 314 376 414 281
36.1118B81j99P9P4K2j4l4pJ88O2M2NO8J75K20K16N7n9N1K18K61L55O88J265K150M272
$$ 281 82 161 235 257 243 209 202 390 452 494 499 567 742 962 1178 1235 1176 1227 1445 1706 2061 2749 4014 6164 10436
35.9449A0436Q080P972n599j0059n223k531j305o93l04k01j78j67j12R9J44NL5r1p4
$$ 10436 18516 26488 20889 10830 5607 3076 1771 1078 774 573 395 228 116 215 359 364 399 308 234
35.8180B34q4j00l2qK6N4M4J0q1j52M4lP7M4q0j4k3j9O2J29p7k38j12Q5nM6J21rj07
$$ 234 150 50 18 10 36 90 134 144 63 -89 -45 -48 29 73 -7 -21 -44 -63 -1 128 51 -187 -299 -214 -219 -173 -52 -61 -168
35.6244a68j3PN3N0m8K9j6r7r2nO2K3Q9k5J12O5n6o4n3J3L3j22L3J04M1qj13J4M6J39
$$ -168 -181 -174 -121 -71 -119 -90 -106 -203 -295 -300 -238 -215 -126 -151 -39 26 -30 -94 -147 -134 -101 -223 -190 -86 -45 -53 -166 -152 -106 33
35.4241C3J12j5M1r7j25L0O2J21J9j13j40q9K9M9J1K5JJ1j06O0j2M0L7L4m0pn0J8L7
$$ 33 145 130 171 74 -51 -21 41 162 181 68 -72 -161 -132 -83 -72 -47 -46 -35 -141 -81 -93 -53 -16 18 -22 -29 -79 -61 -24
35.2305b4K2J25j6r1j48J3R9K6J4j88j76qL4J26P3j3K1o3r2Q8J70j04l1M4j01N3Q3K9
$$ -24 -2 123 107 16 -132 -119 -20 6 20 -168 -344 -352 -318 -192 -119 -132 -111 -174 -266 -178 -8 -112 -143 -99 -200 -147 -64 -35
35.0435c5k1j9j4ol2M0J7K6q5n2m4O6J4N8Q3N0j10p2R1K7L0o3j73o5RJ95J36q6O0J3
$$ -35 -56 -75 -89 -95 -127 -87 -70 -44 -129 -181 -225 -159 -145 -87 -4 46 -64 -136 -45 -18 12 -51 -224 -289 -280 -85 51 -35 25 38
34.8433C8kK9j30k08R3J62O7j58L2lK4M8J42K4M4M9m9j0OQk6nj25j27j6J9jn9J11pj09
$$ 38 36 65 -65 -273 -180 -18 49 -109 -77 -80 -56 -8 134 158 202 251 202 192 198 206 180 175 50 -77 -93 -74 -75 -134 -23 -30 -139
34.6363a39l9n1j4l3Q7lj31J32K22K0j30K0K16k2r7j83M3n0r6K6K3M4O9j8o1m2M8pr1
$$ -139 -178 -229 -243 -276 -189 -192 -323 -191 31 51 -79 -59 157 135 38 -145 -102 -152 -248 -222 -199 -155 -86 -104 -165 -207 -159 -166 -257
34.4427b57l0R6J05k9l2K7N5K8J06j01k14K8P1nO2J99J25r5j42Qoj18LK5p7j7m3K3J0
$$ -257 -287 -191 -86 -115 -147 -120 -65 -37 69 -32 -246 -218 -147 -152 -90 109 234 139 -3 5 -1 -119 -116 -91 -168 -185 -228 -205 -195
34.2491a95J12K3LK4L3j9p2o4QkL3N9o9M6O9K3j2Pj18j46%N6K6R1L3q1oN5qJ00l4j00
$$ -195 -83 -60 -57 -33 0 -19 -91 -155 -147 -149 -116 -57 -126 -80 -11 12 0 7 -111 -257 -257 -201 -175 -84 -51 -132 -138 -83 -91 9 -25 -125
34.0354a25m3P1N3k6n7L9J34M2N9j39j09J6Oop4k2N1J04JN7k1R9Q1m3k31q5N6P7q9j38
$$ -125 -168 -97 -44 -70 -127 -88 46 88 147 8 -101 -85 -79 -85 -159 -181 -130 -26 -25 32 11 110 191 148 -83 -168 -112 -35 -124 -262
33.8351b62p5K7J75K04j5L4R6j2o4K5j7O1p3l5O8j9m9l0k9o9M3R5J0L4n2L9M3j38o1
$$ -262 -337 -310 -135 69 54 88 184 172 108 133 116 177 104 69 137 118 69 39 10 -59 -16 79 89 123 71 110 153 15 -46
33.6415d6J9J04O4j8m3k3q3J37J16j68j48N9N2r2j04k7p4m1J22R9n1J12j6n0J04J12
$$ -46 -27 77 141 123 80 57 -26 111 227 59 -89 -30 22 -70 -174 -201 -275 -316 -194 -95 -146 -34 -50 -100 4 116
33.4679A16N5Q7j29n1Nn1j16Rp1j06k0R3R6nl4%K08J34j75k05K7Qj09j2J24R5j00k1
$$ 116 171 258 129 78 83 32 -84 -75 -146 -252 -272 -179 -83 -88 -122 -122 86 220 45 -160 -133 -125 -234 -246 -122 -27 -127 -148
33.2810a48R4J06o5o2J5Q0L4j04j17o0m5o4PN6J07N8P4R9pn7r2K2L4l8j72N1P4%k2p1
$$ -148 -54 52 -13 -75 -60 20 54 -50 -167 -227 -272 -336 -329 -273 -166 -108 -34 65 58 1 -91 -69 -35 -73 -245 -194 -120 -120 -142 -213
33.0807b13J16K3m9N8O3mk6J4j34j1R8J35l8n7J07m1q8j1R4J03Pn0jM8qQ9qq0k20n4
$$ -213 -97 -74 -123 -65 -2 -6 -32 -18 -152 -163 -65 70 32 -25 82 41 -47 -58 36 139 146 96 95 143 135 224 216 136 -84 -138
32.8804a38Q3j3j13M6R9O7J9oj59q6J6J34O7J9Q5P2j26j43l9Q0M6l1j4M5l2p9j25j39
$$ -138 -55 -68 -181 -135 -36 31 50 44 -115 -201 -185 -51 16 35 120 192 66 -77 -116 -36 10 -21 -35 10 -22 -101 -226 -365
32.6935c65j1J42J19j1J9J07p5j25l1O6k4j3L6j3n8k0J7J28P0J06j9L0o6l4P2m8j12
$$ -365 -376 -234 -115 -126 -107 0 -75 -200 -231 -165 -189 -202 -166 -179 -237 -257 -240 -112 -42 64 45 75 9 -25 47 -1 -113
32.5132a13o8P0J4lJ26m5j79m2K4rK6q9L6Q4j2J11L4M3O8q6J68L4j57m0pj85j02PJ46
$$ -113 -181 -111 -97 -100 26 -19 -198 -240 -216 -225 -199 -288 -252 -168 -180 -69 -35 8 76 -10 158 192 35 -5 -12 -197 -299 -292 -146
32.3196a46J33O2n9j5lN0M0l5m6j09L7j2j02K3k5K7%K1J11l5K2L9l5J05P6oj58m4P7
$$ -146 -13 49 -10 -25 -28 22 62 27 -19 -128 -91 -103 -205 -182 -207 -180 -180 -159 -48 -83 -61 -22 -57 48 124 118 -40 -84 -7
32.1260gj31o3K4lJ2L9J31K7j41j00j2J55l1k5J9l8J4k9O1J05L7L6j07j2k6r0RJ36P8
$$ -7 -138 -201 -177 -180 -168 -129 2 29 -112 -212 -224 -69 -100 -125 -106 -144 -130 -159 -98 7 44 80 -27 -39 -65 -155 -146 -10 68
31.9324F8rm7J00J42l5j46k29m1N5N1J03J9j20J20M0q3prkj6N3m6J7J25O4j14n3m1P3
$$ 68 59 12 112 254 219 73 -156 -197 -142 -91 12 31 -89 31 71 -12 -19 -28 -30 -46 7 -39 -22 103 167 53 0 -41 32
31.7388C2q8qR2N6j2k4M1l4P2r8j25o2J7R3K9m7L1N4J11Q7p8j63j31Q3o7j29R5M9m8
$$ 32 -56 -64 28 84 72 48 89 55 127 29 -96 -158 -141 -48 -19 -66 -35 19 130 217 139 -24 -155 -72 -139 -268 -173 -124 -172
31.5451a72J15O0m6J3p3j23j2J69J00P1k7j30K7q6j0J20QJ33J05MM4m3j09j3%k1o6j46
$$ -172 -57 3 -43 -30 -103 -226 -238 -69 31 102 75 -55 -28 -114 -124 -4 4 137 242 246 290 247 138 125 125 104 38 -108
31.3582a08r5J83J75n3j6l4J6K1jN1Nr3j02Q4J62j22j51j44P9J11O4k5k8j4K5J1l3n3
$$ -108 -203 -20 155 102 86 52 68 89 88 139 144 51 -51 33 195 73 -78 -222 -143 -32 32 7 -21 -35 -10 1 -32 -85
31.1713h5q7j3n2P9M3n8p4K1O6k4M2Q9q1m9L1O0P2J4l8NK6L5UK2n5J7M0K9J71j7k8l7
$$ -85 -172 -185 -237 -158 -115 -173 -247 -226 -160 -184 -142 -53 -134 -183 -152 -92 -20 -6 -44 -39 -13 22 57 92 114 59 76 116 145 316 299 271 234
30.9510B34j33p6l6J38J96k3j74j52n9Q0r1j16P6M1n7o5RJ48P0N8k6o2O4q2R4Rk3J9
$$ 234 101 25 -11 127 323 300 126 -26 -85 -5 -96 -212 -136 -95 -152 -217 -208 -60 10 68 42 -20 44 -38 56 65 42 61
30.7640F1j9J4m2LO8L5lj19M2P3O0j14j36k3k2P7l3m4Q8L1r4k6J1No8o6J26K24l0q7
$$ 61 42 56 14 17 85 120 117 -2 40 113 173 59 -77 -100 -122 -45 -78 -122 -34 -3 -97 -123 -112 -107 -175 -241 -115 109 79 -8
30.5637hm5j53pl6J09K2j4J73M9O7K6J8k3j1o8L9k4n3M4K4j08r2L8K9p2J31k6J6J4m8
$$ -8 -53 -206 -213 -249 -140 -118 -132 41 90 157 183 201 178 167 99 138 114 61 105 129 21 -71 -33 -4 -76 55 29 45 59 11
30.3634A1n5m3N8N4J70P5n1k22j52J15p0J18K9p4R2J4R7L7R3m1l0j02k02o4j00O0J06
$$ 11 -44 -87 -29 25 195 270 219 -3 -155 -40 -110 8 37 -37 55 69 166 203 296 255 225 123 -79 -143 -243 -183 -77
30.1832g7J18j4j07mO7R5Q0j46k9P2jj3o9j2j4j1P5k3j44jP5o2j8O2P2k0j19m5P0J3
$$ -77 41 27 -80 -84 -17 78 158 12 -17 55 54 41 -28 -40 -54 -65 10 -13 -157 -158 -83 -145 -163 -101 -29 -49 -168 -213 -143 -130
29.9829a30pj5J90K09J3l6K5j01R6k7m8L4Rl7m6r2N8p9j50r0M4k2Q0J19j7r3j5k5L9
$$ -130 -137 -152 38 247 260 224 249 148 244 217 169 203 212 175 129 37 95 16 -134 -224 -180 -202 -122 -3 -20 -113 -128 -153 -114
29.7893a14j2o7R1J16J04J23O2p9k8J00j57j18q2N6J18L6j4J79o4q5K4L0J5l1m7ol6
$$ -114 -126 -193 -102 14 118 241 303 224 196 296 139 21 -61 -5 113 149 135 314 250 165 189 219 234 203 156 150 114
29.6090A14o0j45n1P4K7J1k4Tj35P8K7k5J28l2O2M1p3k3Pp0kL4TL8l7N5o9n8m3J2M5
$$ 114 54 -91 -142 -68 -41 -30 -54 -78 -213 -135 -108 -133 -5 -37 25 66 -7 -30 -23 -93 -95 -61 -27 11 -26 29 -40 -98 -141 -129 -84
29.4020h4P7M4o2k25k0J59K09j22m7m9Q3m6r2P4M8K3Pk8M0n9L1p0n7M5K7j20p6K2K13
$$ -84 -7 37 -25 -250 -270 -111 98 -24 -71 -120 -37 -83 -175 -101 -53 -30 -23 -51 -11 -70 -39 -109 -166 -121 -94 -214 -290 -268 -55
29.2084e5l9n2j08J02r5J0M7P9J26K9l3k0q1K3J28K1q2j3j5J44K26m8p3p7rj21k8N5
$$ -55 -94 -146 -254 -152 -247 -237 -190 -111 15 44 11 -9 -90 -67 61 82 0 -13 -28 116 342 294 221 144 135 14 -14 41
29.0215D1n9j18j32K0P9M3J5K9p4j3m9RK6P4j4%N7K1J4j7p5o7J00R6Jq0j67n8J56J18
$$ 41 -18 -136 -268 -248 -169 -126 -111 -82 -156 -169 -218 -209 -183 -109 -123 -123 -66 -45 -31 -48 -123 -190 -90 6 7 -73 -240 -298 -142 -24
28.8212b4j0r7l6J5%P4k1m3J04J67R0R9j8j13r1m0j0oN1kj28j4o9r6N9l8j44l0J86N9
$$ -24 -34 -131 -167 -152 -152 -78 -99 -142 -38 129 219 318 300 187 96 56 46 40 91 89 -39 -53 -122 -218 -159 -197 -341 -371 -185 -126
28.6209a26q6M6M5R4on8M6m4l1J13M9R8l8k04j31N8m7p6JJ47J59o7j20L0k8K4N1rO5
$$ -126 -212 -166 -121 -27 -33 -91 -45 -89 -120 -7 42 140 102 -102 -233 -175 -222 -298 -297 -150 9 -58 -178 -148 -176 -152 -101 -110 -45
28.4273d5L1m6J2o9o4J09J14N8P1L9q3p3P9j46p4Q8J04Q3O1j21ONk8r8k58p6J45Q6L1
$$ -45 -14 -60 -48 -117 -181 -72 42 100 171 210 127 54 133 -13 -87 1 105 188 249 128 134 139 111 13 -245 -321 -176 -90 -59
28.2337e9l9LN5r8j28l8no2q2lJ08Q8N7J74KM3J64K7j14q7J5Q3N7J32J4j66n9J8rm4
$$ -59 -98 -95 -40 -138 -266 -304 -309 -371 -453 -456 -348 -260 -203 -29 -27 16 180 207 93 6 21 104 161 293 307 141 82 100 91 47
28.0334D7p9L0Q0j6j13N6TLJ2p5n0J38L8NTJ10j13j58j83J9N1j8K4R0o1j08Q7j6P7O4
$$ 47 -32 -2 78 62 -51 5 61 64 76 1 -49 89 127 132 137 247 134 -24 -207 -188 -137 -155 -131 -41 -102 -210 -123 -139 -62 2
27.8331BQq7j36j4qM7Q2Q6j4j1o4J17L6j08r5J31P0J3J5mk3Q1%j4j75j23O4J5J77L4
$$ 2 10 -77 -213 -227 -235 -188 -106 -20 -34 -45 -109 8 44 -64 -159 -28 42 55 70 66 43 124 124 110 -65 -188 -124 -109 68 102
27.6328A02j16k3M6m4rL9M6p8L0r1q3J9K8P5L3j3j38J46J64j04p5q1L8po9j5kL4J55
$$ 102 -14 -37 9 -35 -44 -5 41 -37 -7 -98 -181 -162 -134 -59 -26 -39 -177 -31 133 29 -46 -127 -89 -96 -165 -180 -182 -148 7
27.4392GO2pM2L6j8j10JO7j03l0K3k2L1j1j07l5J12L1n4Q7M1N3n6L7m2M3p2%k6l4J35
$$ 7 69 62 104 140 122 12 13 80 -23 -53 -30 -52 -21 -32 -139 -174 -62 -31 -85 2 43 96 40 77 35 78 6 6 -20 -54 81
27.2322H1N4k9n6j02j18R5K81j9j96R2M3n2l8p8j25r2Q7N3k0K9jN0J39J08N1l6o2j40
$$ 81 135 106 50 -52 -170 -75 206 187 -9 83 126 74 36 -42 -167 -259 -172 -119 -139 -110 -111 -61 78 186 237 201 139 -1
27.0453aj22R8K37j7j76k0p0l0M0L9rJ15j6j57K9J38J9n5q8n2M1L4m5l2J2P8O2lP1j57
$$ -1 -123 -25 212 195 19 -1 -71 -101 -61 -22 -31 84 68 -89 -60 78 97 42 -46 -98 -57 -23 -68 -100 -88 -10 52 49 120 -37
26.8450c7k16J7J4Q8O3R2jK7j7j19n5QJ7L9p0%N7k8k1J24J41NJJ9P4Po0k4J7m5j43q6
$$ -37 -253 -236 -222 -134 -71 21 20 47 30 -89 -144 -136 -119 -80 -150 -150 -93 -121 -142 -18 123 128 129 148 222 229 169 145 162 117 -26 -112
26.6314a12n3Q5J00ojJ8M2k0p0l2O0J04l2N2J0j49o5L0J61P4r6j74o4P2M9p1q2n9J11
$$ -112 -165 -80 20 14 13 31 73 53 -17 -49 11 115 83 135 145 -4 -69 -39 122 196 100 -74 -138 -66 -17 -88 -170 -229 -118
26.4377a18K51Mj00qQK3J4l5m3j28lM3p3R4J03L8o8j55j39K6J74J55J26P4j53j63m7
$$ -118 133 137 37 29 37 60 74 39 -4 -132 -135 -92 -165 -71 32 70 2 -153 -292 -266 -92 63 189 263 110 -53 -100
26.2575a00m2lj8Lm2J03k6j92j6K29M0j65J9J55kj2j4P7O4pp0j39M0J12l9p2L0J8no5
$$ -100 -142 -145 -163 -160 -202 -99 -125 -317 -333 -104 -64 -229 -210 -55 -57 -69 -83 -6 58 51 -19 -158 -118 -6 -45 -117 -87 -69 -74 -139
26.0572a39K7N1r9l3Nj00m8J08K54M6p8NM7N5O1o7K2M3m6J38r1j56L8J04j7j00q7N9
$$ -139 -112 -61 -160 -193 -188 -288 -336 -228 26 72 -6 -1 46 101 162 95 117 160 114 252 161 5 43 147 130 30 -57 2
25.8703BJ6pk2l7J53P5p4o6r6p4j4Tr7N5M3J45J14J9j66N8J13k2mp7o9r6J28L5r5N6
$$ 2 18 11 -11 -48 105 180 106 40 -56 -130 -144 -158 -255 -200 -157 -12 102 121 -45 13 126 104 100 23 -46 -142 -14 21 -74 -18
25.6700a8J8m4P0K7Q6m7M6r4n4l9m5M4O9pKP1LQ5l0q7J2P4k0r2n2O3j2j74P3R0LR7M2
$$ -18 0 -44 26 53 139 92 138 44 -10 -49 -94 -50 19 12 14 85 88 173 143 56 68 142 122 30 -22 41 29 -145 -72 18 21 118 160
25.4496A60nJ95j2j8m7o1j07o7j3j05j01m4O9J31j21J9N3M7J05J0k80j11M9J31Q4L5
$$ 160 155 350 338 320 273 212 105 38 25 -80 -181 -225 -156 -25 -146 -127 -74 -27 78 88 -192 -303 -254 -123 -39 -4
25.2761dP0N9l9J1P7M3j00k8J9j6O4j7r9p4K2r7l1O5J10Q9M2k1n1j09p9j36R0J34J59
$$ -4 66 125 86 97 174 217 117 89 108 92 156 139 40 -34 -12 -109 -140 -75 35 124 166 145 94 -15 -94 -230 -140 -6 153
25.0824A53K2J7M0m4j54j36Pj9Q0O6j37j39N7R0J61k3j16j73q4J8L4J22J06M0j65l2
$$ 153 175 192 232 188 34 -102 -95 -114 -34 32 -105 -244 -187 -97 64 41 -75 -248 -332 -314 -280 -158 -52 -12 -177 -209
24.9089b09J13N7O5M6k8q8p3J2J36O1m9j49k8J4N2L2K2M2M9J01j34j10n8l0j52P1M4
$$ -209 -96 -39 26 72 44 -44 -117 -105 31 92 43 -106 -134 -120 -68 -36 -14 28 77 178 44 -66 -124 -154 -306 -235 -191
24.7286a91n0k0J40J34QJ36J18o7j68j07L4N3L6j7p6j04QQ5j32OJ00O0n0J02M4j22j45
$$ -191 -241 -261 -121 13 21 157 275 208 40 -67 -33 20 56 39 -37 -141 -133 -48 -180 -174 -74 -14 -64 38 82 -40 -185
24.5483a85j16J21J33J47j7o0lK4m4l1J6j4J2J9j43n4K8O3p6n5J06J04Q6k4j3j15l1
$$ -185 -301 -180 -47 100 83 23 20 44 0 -31 -15 -29 -17 2 -141 -195 -167 -104 -180 -235 -129 -25 61 37 24 -91 -122
24.3681a22j5P2j0j11p5R4J88P1j62q5p8N2L9J13L3l6N4PK0j9j03m5Q5M7M8p9J5Q9P9
$$ -122 -137 -65 -75 -186 -261 -167 21 92 -70 -155 -233 -181 -142 -29 4 -32 22 29 49 30 -73 -118 -33 14 62 -17 -2 87 166
24.1745A66j39m6O1%j89q3L9l8o2K2P2K6j23L5J42k9J7J40O7K6j50p8P1Tq6jJ58O0J
$$ 166 27 -19 42 42 -147 -230 -191 -229 -291 -269 -197 -171 -294 -259 -117 -146 -129 11 78 104 -46 -124 -53 18 -68 -69 89 149 150
23.9809A50L5k5o9L4J01J9l7q0j35J5QN6j8O7K6K2Mj19P1j3O6l1Nj51K6J38j05l1jn2
$$ 150 185 160 91 125 226 245 208 128 -7 8 16 72 54 121 147 169 173 54 125 112 178 147 152 1 27 165 60 29 28 -24
23.7806b4o5j07m5J14J8M5Q6Kr8Q4p8j05OJ82J23k5Qp5j89k5R9M0n4qP4%rJ12rj65q9
$$ -24 -89 -196 -241 -127 -109 -64 22 24 -74 10 -68 -173 -167 15 138 113 121 46 -143 -168 -69 -29 -83 -91 -17 -17 -26 86 77 -88 -177
23.5736a77k2J30Q5l6L3o3n1L6r1jO4J52k9q5l5j4q6j13TJ58J60J04O4R%r2j95m6O4
$$ -177 -199 -69 16 -20 13 -50 -101 -65 -156 -157 -93 59 30 -55 -90 -104 -190 -303 -416 -258 -98 6 70 79 79 -13 -208 -254 -190
23.3800a90J0M1K4l6r7J64J69l8q6n8J17M9M5r6r5On2J64N2K8K5q7k0LKq7jM9j2j7j8
$$ -190 -180 -139 -115 -151 -248 -84 85 47 -39 -97 20 69 114 18 -77 -71 -123 41 93 121 146 59 39 42 44 -43 -44 5 -7 -24 -42
23.1730d2q3m2rj6L4Q7L6kM9q6k4m8N1Q5Q2l4p5j18N5J36O9k0J03L9J1j50j56J20J03
$$ -42 -125 -167 -176 -192 -158 -71 -35 -37 12 -74 -98 -146 -95 -10 72 38 -37 -155 -100 36 105 85 188 227 238 88 -68 52 155
22.9794A55Pj06m2J1M7P6j10j85j24J2Q3J42r0j5j25J3R2O5Q3Q5J14M7p4TK36L52k48
$$ 155 162 56 14 25 72 148 38 -147 -271 -259 -176 -34 -124 -139 -264 -251 -159 -94 -11 74 188 235 161 87 323 675 427
22.7991D27k30M0q4j6l0n1q7j60R6Jp4l2M9K1J39O4k41j37o8J3L44J10r8j15k7O6J11
$$ 427 197 237 153 137 107 56 -31 -191 -95 -94 -168 -200 -151 -130 9 73 -168 -305 -373 -360 -16 94 -4 -119 -146 -80 31
22.6189C1j11l6rq0J04Q4j0l9J02M7k5j8Q2pn9k4lL1o4r1oQN9J7O9j4j8o3J15nJ2k8
$$ 31 -80 -116 -125 -205 -101 -17 -27 -66 36 83 58 40 122 115 56 32 29 60 -4 -95 -101 -93 -34 -17 52 38 20 -43 72 67 79 51
22.4052E1j42m4P7M4J62J80Nj88n1l1k9J17r5pN6q0p6p4oL6om1R1O6J96P7q2q3p9j36
$$ 51 -91 -135 -58 -14 148 328 333 145 94 63 34 151 56 49 105 25 -51 -125 -131 -95 -101 -142 -51 15 211 288 206 123 44 -92
22.2049i2n6J08N1rr2o3L0O0Q7K6j10j55J7k1M5K6R4O6p2lj8Q0r7p3Q2l8j38K8J41P0
$$ -92 -148 -40 11 2 -90 -153 -123 -63 24 50 -60 -215 -198 -219 -174 -148 -54 12 -60 -63 -81 -1 -98 -171 -89 -127 -265 -237 -96 -26
22.0047b6J09oo8k04j54J12O4j0l6M0J16N7j10j12K9J43J91O4kr6l8j89k7J14Klj10
$$ -26 83 77 9 -195 -349 -237 -173 -183 -219 -179 -63 -6 -116 -228 -199 -56 135 199 197 101 63 -126 -153 -39 -37 -40 -150
21.8244a50P1K4M5L7J16Mk5l4k8m2Q6o4j30k3o1JJ17o3Q3n6M7L6q8K0J19R5j5n9L2q6
$$ -150 -79 -55 -10 27 143 147 122 88 60 18 104 40 -90 -113 -174 -173 -56 -119 -36 -92 -45 -9 -97 -77 42 137 122 63 95 9
21.6241Ij60p9J22J08j3n7p2J43J11j44oN1Q8pL5k0j35m1Q8l6J0J14M9q6k31j34R6J57
$$ 9 -151 -230 -108 0 -13 -70 -142 1 112 -32 -38 13 101 94 129 109 -26 -67 21 -15 -5 109 158 72 -159 -293 -197 -40
21.4372d0n0J0K17M7j7m2lK4%mK5p3j41M5%QK1k7pJ05J03j13m8L3j44q6O6qQ1J72k1
$$ -40 -90 -80 137 184 167 125 122 146 146 142 167 94 -47 -2 -2 6 27 0 -7 98 201 88 40 73 -71 -157 -91 -99 -18 154 133
21.2302A33j54j4k2j62pJ31O4l3RO9ll1LJ6M4k1KJ6l1r1Ml1j11m3J42J05P9J0r1j0O
$$ 133 -21 -35 -57 -219 -226 -95 -31 -64 -55 14 11 -20 -17 -1 43 22 24 40 9 -82 -78 -109 -220 -263 -121 -16 63 73 -18 -28 -22
21.0232b2n2j19m8n7j1j18J32O6N0Q5L5P2m4r8L0P9J71L6j26nO7J1j12K7l5NK3J01p5
$$ -22 -74 -193 -241 -298 -309 -427 -295 -229 -179 -94 -59 13 -31 -129 -99 -20 151 187 61 56 123 134 22 49 14 19 42 143 68
20.8296F8j68J33J12J2n4r4j37j10%M2K5n5N3QQ5m4k2M3q6N4Tk0JJ52N0j93k19j2J00
$$ 68 -100 33 145 157 103 9 -128 -238 -238 -196 -171 -226 -173 -165 -80 -124 -146 -103 -189 -135 -81 -101 -100 52 102 -91 -310 -322 -222
20.6360b22J06Q6l0L1j8m3l9L2R6l8J8m8J15m3j31k4J21O8l0k0mj85j66Jj4N7J69J73
$$ -222 -116 -30 -60 -29 -47 -90 -129 -97 -1 -39 -21 -69 46 3 -128 -152 -31 37 7 -13 -17 -202 -368 -367 -381 -324 -155 18
20.4491A8j6N7o3o1J8R4q4L0N7n2j8l6j39K3J99K0O4k1qp8P3R8j25j37rN0n8L3J57M8
$$ 18 2 59 -4 -65 -47 47 -37 -7 50 -2 -20 -56 -195 -172 27 47 111 90 82 4 77 175 50 -87 -96 -46 -104 -71 86 134
20.2488A34o0q7lJ5J07J1R0P3j36p2P6o6lq4N2k5k33n4J4J70J32J6l3j2k2k5l6N0Nj09
$$ 134 74 -13 -16 -1 106 117 207 280 144 72 148 82 79 -5 47 22 -211 -265 -251 -81 51 67 34 22 0 -25 -61 -11 -6 -115
20.0485a15J41J55M2n7k23j40J2L6m3N0kn5pj0N6O0O4O5L0O7m0TJ15N2Qq9R1l7k9n3
$$ -115 26 181 223 166 -57 -197 -185 -149 -192 -142 -144 -199 -206 -216 -160 -100 -36 29 59 126 86 46 161 213 221 132 223 186 157 104
19.8482A04p6K1j72P2J74%j82n9K2OL3Kr1J8J9J6j5k0J7ON4J57L3j91QJ7K3l7j01n2
$$ 104 28 49 -123 -51 123 123 -59 -118 -96 -90 -57 -55 -146 -128 -109 -93 -108 -128 -111 -105 -51 106 139 -52 -44 -27 -4 -41 -142 -194
19.6479a94K0J6K8P1P4l8p3O3n8MK56Q9p1q2j4J53qk15q8k1m9k3L2nK7k4n6j2O0O8M1
$$ -194 -174 -158 -130 -59 15 -23 -96 -33 -91 -87 169 258 187 105 91 244 236 21 -67 -88 -137 -160 -128 -133 -106 -130 -186 -198 -138 -70 -29
19.4409b9qK4K6R9N6L5m9j34j22LK2l3m4J7J07J40M1r6M0lj09l5M6j4k8k5oN2ML0K1
$$ -29 -37 -13 13 112 168 203 154 20 -102 -99 -77 -110 -154 -137 -30 110 151 55 95 92 -17 -52 -6 -20 -48 -73 -79 -27 -23 7 28
19.2340B8j6m1j3KK4j9m5j25N3K19K8OK2l2j53m7J43M5M1J02M4r2k5n8j01Mj24j85j7
$$ 28 12 -29 -42 -40 -16 -35 -80 -205 -152 67 95 101 123 91 -62 -109 34 79 120 222 266 174 149 91 -10 -6 -130 -315 -332
19.0404c32J36M8r0K8J31M5N1m4q2N2P2o0j33L5k3jL6pO5J5k07P2K28L2M0o2rnj6j02
$$ -332 -196 -148 -238 -210 -79 -34 17 -27 -109 -57 15 -45 -178 -143 -166 -167 -131 -138 -73 -58 -265 -193 35 67 107 45 36 31 15 -87
18.8401h7r8p8o0N8oK04K24J21j97j58p4Jk5Q6l6l4J47n4j29J8M4P4J9l3j16KM8k8o1
$$ -87 -185 -263 -323 -265 -271 -67 157 278 81 -77 -151 -150 -175 -89 -125 -159 -12 -66 -195 -177 -133 -59 -40 -73 -189 -187 -139 -167 -228
18.6465b28LJ27L7K4k0n8J8m6j5O3Q1q0j37J2l5K08J44O5m0p6M5N5lj04j01R5K21o8
$$ -228 -225 -98 -61 -37 -57 -115 -97 -143 -158 -95 -14 -94 -231 -219 -254 -46 98 163 123 47 92 147 144 40 -61 34 255 187
18.4595A87j24n4Mj9j5M0j01Q8J33J4m1M3%m4j08n8o9k0M4N9k0M6K6L9l9J0P5K1Q8k3
$$ 187 63 9 13 -6 -21 19 -82 6 139 153 112 155 155 111 3 -55 -124 -144 -100 -41 -61 -15 11 50 11 21 96 117 205 182
18.2592A82j00l0R7j10n6n9q5K5K8M3K8o9J04R1R9j09o4Q3%l5q1k1o9M3RJ14m2M4O6
$$ 182 82 52 149 39 -17 -76 -161 -136 -108 -65 -37 -106 -2 89 188 79 15 98 98 63 -18 -39 -108 -65 -56 58 16 60 126
18.0656A26O8J17q4j79j14QR2J26L1k52j22K4n0p3J54Q6R8N1r5j28Q4N5n7o1Q5M9o7
$$ 126 194 311 227 48 -66 -58 34 160 191 -61 -183 -159 -209 -282 -128 -42 56 107 12 -116 -32 23 -34 -95 -10 39 -28
17.8854b8r6O0m9k7K3K0L9mN4l8O7j61k0R1M0J5m9r4R5J10j9o5j25N7K1%L3j24N7K7
$$ -28 -124 -64 -113 -140 -117 -97 -58 -62 -8 -46 21 -140 -160 -69 -29 -14 -63 -157 -62 48 29 -36 -161 -104 -83 -83 -50 -174 -117 -90
17.6851i0j20O0O6N8M0j54j41J16On0RP3P7N1JMn1Q5J1j10m5l8K1J42M5J3k7j08j20
$$ -90 -210 -150 -84 -26 14 -140 -281 -165 -159 -209 -200 -127 -50 1 2 6 -45 40 51 -59 -104 -142 -121 21 66 79 52 -56 -176
17.4915a76K8j08n6P9J22Mo0j5J68K9K5K1Q0j06j22P2J1k1K5q8J34J92p2j17ol8j40
$$ -176 -148 -256 -312 -233 -111 -107 -167 -182 -14 15 40 61 141 35 -87 -15 -4 -25 0 -88 46 238 166 49 43 5 -135
17.3112a35k3N3L9O2P3l6l0L1Jn6j17r2l5O1J63M0JQ9J37N9lp2J7o0l5j19j49j4M8P0
$$ -135 -158 -105 -66 -4 69 33 3 34 35 -21 -138 -230 -265 -204 -41 -1 0 89 226 285 282 210 227 167 132 13 -136 -150 -102 -32
17.1109c2l0O7L1l8j29n6J03j19Q0J42pp4n9P2O0n6K5J03RN2j4O3J3N7j1l2k3j06j32
$$ -32 -62 5 36 -2 -131 -187 -84 -203 -123 19 12 -62 -121 -49 11 -45 -20 83 92 144 130 193 206 263 252 220 197 91 -41
16.9173d1J6K3L6J13m5j6J3Oo4o2L0pq9L4R7p0l9j18K4J14Q0L7j16N1L6j49n2J20Q5
$$ -41 -25 -2 34 147 102 86 99 105 41 -21 9 2 -87 -53 44 -26 -65 -183 -159 -45 35 72 -44 7 43 -106 -158 -38 47
16.7237D7O9j3k4n9NK1Jj12K7K9O8j3j01j27J2J49k7J3N2Q9p0j52Q2Jj07j02n7J66J10
$$ 47 116 103 79 20 25 46 47 -65 -38 -9 59 46 -55 -182 -170 -21 -48 -35 17 106 36 -116 -34 -33 -140 -242 -299 -133 -23
16.5301b3J90p3j96k1j5J0l4K3Q4o8p1lJ52L2N2K6j9n9k2L5p8k3J17j8j27p5P2J52J22
$$ -23 167 94 -102 -123 -138 -128 -162 -139 -55 -123 -194 -197 -45 -13 39 65 46 -13 -35 0 -78 -101 16 -2 -129 -204 -132 20 142
16.3364A42M2j24o5p6p2k5J28k8r8P2N1l4M1p2j43J00K53K3p6rR6qk6KJ6L2j04r8j07
$$ 142 184 60 -5 -81 -153 -178 -50 -78 -176 -104 -53 -87 -46 -118 -261 -161 92 115 39 30 126 118 92 94 110 142 38 -60 -167
16.1428a67k4L6krN4P7K1oR5J2q8p0JK6R4Jl7RO3L9L3L8J27r6j37n1rJ54J43j97k02
$$ -167 -191 -155 -157 -166 -112 -35 -14 -20 75 87 -1 -71 -70 -44 50 51 14 23 86 125 158 196 323 227 90 39 30 184 327 130 -72
15.9359g2Q8K9k2k3N6Q8R4r6J1l8j0j44l2Rm2J9J1N8J01L7K6Tj59r6m9n4Q8j9j25LP3
$$ -72 16 45 23 0 56 144 238 142 153 115 105 -39 -71 -62 -104 -85 -74 -16 85 122 148 174 15 -81 -130 -184 -96 -115 -240 -237 -164
15.7289a64R5J01R9Nq9j7n9LR8K6l6j47q6p3L2L6JkJ57j7j42oJ3j0k0J7L1Mj07P0J4
$$ -164 -69 32 131 136 47 30 -29 -26 72 98 62 -85 -171 -244 -212 -176 -175 -177 -20 -37 -179 -185 -172 -182 -202 -185 -154 -150 -257 -187 -173
15.5219a73j9L9l9P6mj5j3L1J01p4j40J59N3OR2Kqm3n9n5M0J38P2q8J0p4j60p3J15J39
$$ -173 -192 -153 -192 -116 -120 -135 -148 -117 -16 -90 -230 -71 -18 -12 80 82 74 31 -28 -83 -43 95 167 79 89 15 -145 -218 -103 36
15.3216C6J03k3j60p1L5O4j4K2N1K9q7j80j26O1J16J6J50N0j8L0K5Q3p0p4o0R2J23K1
$$ 36 139 116 -44 -115 -80 -16 -30 -8 43 72 -15 -195 -321 -260 -144 -128 22 72 54 84 109 192 122 48 -12 80 203 224
15.1347B24o1n1l0l1KJk3J7n7O9J62oj15j23r9MJ15pq8L0n3lm4l7J00J11n4j59J17l3
$$ 224 163 112 82 51 53 54 31 48 -9 60 222 216 101 -22 -121 -117 -2 -9 -97 -67 -120 -123 -167 -204 -104 7 -47 -206 -89 -122
14.9344a22J3k3N1j9k30L2J83L7n1j28k4J10J61O4L1J16J9N7j87j32j8J6O2R7J02j12
$$ -122 -109 -132 -81 -100 -330 -298 -115 -78 -129 -257 -281 -171 -10 54 85 201 220 277 90 -42 -60 -44 18 115 217 105
14.7608A05j70pO0kM3J31p8p7n9j00K6l5M3%o4j8O5o9Q6M0P0J52k3q7r2N7Pj56J20J03
$$ 105 -65 -72 -12 -14 29 160 82 5 -54 -154 -128 -163 -120 -120 -184 -202 -137 -206 -120 -80 -10 142 119 32 -60 -3 4 -152 -32 71
14.5605G1o3l8JJ22pj04r3L2J67O4j00q0Q6P5l7r6k4k9l1OO8km7J9Ll8n4Jn0M0o3L8
$$ 71 8 -30 -29 93 86 -18 -111 -79 88 152 52 -28 58 133 96 0 -24 -53 -84 -78 -10 -12 -59 -40 -37 -75 -129 -128 -178 -138 -201 -163
14.3469a63J89J19k7j45K1j1k5O5M1J01L5l9l5q5M6M3L3l8n1n2l8l0jO1M5O8qrj04O9
$$ -163 26 145 118 -27 -6 -17 -42 23 64 165 200 161 126 41 87 130 163 125 74 22 -16 -46 -47 14 59 127 119 110 6 75
14.1466G5M6j61j77L9l7r2K7RP3J8q2Lon1j03P2J23J26J01n7k4O2L4J2qk3l8p4J50J75
$$ 75 121 -40 -217 -178 -215 -307 -280 -271 -198 -180 -262 -259 -265 -316 -419 -347 -224 -98 3 -54 -78 -16 18 30 22 -1 -39 -113 37 212
13.9463B12Q4k8m3j04q1J3r4M1P4j37l8J16k4J01m9K3M7k3N0Mj19p8K6O3Q8m1n1p0j6
$$ 212 296 268 225 121 40 53 -41 0 74 -63 -101 15 -9 92 43 66 113 90 140 144 25 -53 -27 36 124 83 32 -38 -54
13.7527e4l0j09m9J05k3j19O7J24k4L8J14jj32j03L9Q4N4R7ok2nP8P3j42n8n2K0j0j05
$$ -54 -84 -193 -242 -137 -160 -279 -212 -88 -112 -74 40 39 -93 -196 -157 -73 -19 78 72 50 45 123 196 54 -4 -56 -36 -46 -151
13.5591a51q2N9O1m3J00O5O6P0m3J8N0Jj5q4j93o8P6M8j30k10J84K15J70K4k32l0L2
$$ -151 -233 -174 -113 -156 -56 9 75 145 102 120 170 171 156 72 -121 -189 -113 -65 -195 -405 -221 -6 164 188 -44 -74 -42
13.3788d2R4L5N4r3k9J60j28j57j03KJ33j29r1J64N5l0Q5l3o8m9Q7K19P3j56L8o8O5
$$ -42 52 87 141 48 19 179 51 -106 -209 -207 -74 -203 -294 -130 -75 -105 -20 -53 -121 -170 -83 136 209 53 91 23 88
13.1986H8J41K7p1j42k8k7J2J08N4M6Ql5j24mP7J12Q0n7m8j31M0q1m5j1j03l6K7N8J7
$$ 88 229 256 185 43 15 -12 0 108 162 208 216 181 57 53 130 242 322 265 217 86 126 45 0 -11 -114 -150 -123 -65 -48
13.0050d8J9N0k9J70P4p0N5J0p4j96j63n6o4p2M3J20M1P5P6j18Q9J9o6J44r4j45n2L6
$$ -48 -29 21 -8 162 236 166 221 231 157 -39 -202 -258 -322 -394 -351 -231 -190 -115 -39 -157 -68 -49 -115 29 -65 -210 -262 -226
12.8180b26Q8pj73k8N1M8Q4J1P1L9L6m2J2P4l0n9Q1%m6L7J28pQ3M4n7j61j35J3R9N7
$$ -226 -138 -145 -318 -346 -295 -247 -163 -152 -81 -42 -6 -48 -36 38 8 -51 30 30 -16 21 149 142 225 269 212 51 -84 -71 28 85
12.6177H5N0j07k6p0M0k2kJ8R8Kjm6p7qM7M5K2k5K2q7m2M4J37Mm1Tq3j38k3J45J07L1
$$ 85 135 28 2 -68 -28 -50 -52 -34 64 66 65 19 -58 -66 -19 26 48 23 45 -42 -84 -40 97 101 60 19 -64 -202 -225 -80 27 58
12.4041E8Jj70m5pm3M8J70j6q3j6M6m2J0M3O2m7p5pp0p7j03J17J29L5K6M2K6j18n4Q1
$$ 58 59 -111 -156 -163 -206 -158 12 -4 -87 -103 -57 -99 -89 -46 16 -31 -106 -113 -183 -260 -363 -246 -117 -82 -56 -14 12 -106 -160 -79
12.2038g9j2nR6N6M3k9j1p6n5k7oJ16P5o5L6q4n9jP2qK2NjO4omR1l0o0j2K0p0M5J1m6
$$ -79 -91 -96 0 56 99 70 59 -17 -72 -99 -105 11 86 21 57 -27 -86 -87 -15 -23 -1 4 3 67 61 57 148 118 58 46 66 -4 41 52 6
11.9701FJ04m3p4j8J9nj35q6K9J35K39Pr7r0J15J7ml7k5n5J12l0N9o1K5M6J39o9l7q3
$$ 6 110 67 -7 -25 -6 -11 -146 -232 -203 -68 171 178 81 -9 106 123 119 82 57 2 114 84 143 82 107 153 292 223 186 103
11.7698A03mj01m8J07Nn0Pm8kQ2J30m8j4j9j85m7P3M9k3j36J0J15J59R4j12m3rn3O2
$$ 103 99 -2 -50 57 62 12 19 -29 -31 51 181 133 119 100 -85 -132 -59 -10 -33 -169 -159 -44 115 209 97 54 45 -8 54
11.5762E4j13j05O1J1j4O8n5L3j4n4R3J03Nj44M8k1r9P3M7J4j94n2N7J15o4K2J28J0
$$ 54 -59 -164 -103 -92 -106 -38 -93 -60 -74 -128 -35 68 73 -71 -23 -44 -143 -70 -23 -9 -203 -255 -198 -83 -147 -125 3 13
11.3893A3o0J73O1j4j70j93N6M6j7R9O5k5k4j14J7N8O8nr0j52o5m1J42J77KJ7O8L4k5
$$ 13 -47 126 187 173 3 -190 -134 -88 -105 -6 59 34 10 -104 -87 -29 39 34 -56 -208 -273 -314 -172 5 7 24 92 126 101
11.1957A01j39N1K36N0j06j72j41k1m2O2J27K5L4K1P9R9Mj24r6o9J2L9j05J7J63J50
$$ 101 -38 13 249 299 193 21 -120 -141 -183 -121 6 31 65 86 165 264 268 144 48 -21 -9 30 -75 -58 105 255
11.0221B55K17l9k56k19m4j0%J62J41M3n2q1o1n9m1j2mqK5L2Pn3p3Q8Q7O7J28R2j14
$$ 255 472 433 177 -42 -86 -96 -96 66 207 250 198 117 56 -3 -44 -56 -60 -68 -43 -11 -4 -57 -130 -42 45 112 240 332 218
10.8285B18j73j41o0j11l1J09R8M4P5l4J12J28m4q7k4K4K5qK0Pp4j4m0p7O4m7j14L1
$$ 218 45 -96 -156 -267 -298 -189 -91 -47 28 -6 106 234 190 103 79 103 128 120 140 147 73 59 19 -58 6 -41 -155 -124
10.6415a24O4N9l0j17J1Q3j6L1K1K9J9j12j57N5o4J8J72L0N2O0J23M0j73p6q7l1Q4k3
$$ -124 -60 -1 -31 -148 -137 -54 -70 -39 -18 11 30 -82 -239 -184 -248 -230 -58 -28 24 84 207 247 74 -2 -89 -120 -36 -59
10.4546e9j3p8M6k3Q9J77Q5j6k33o6J11m6QK3J44jOq0j29R2k5N0l4o5J8N0j1O5l8j12
$$ -59 -72 -150 -104 -127 -38 139 224 208 -25 -91 20 -26 -18 5 149 148 154 74 -55 37 12 62 28 -37 -19 31 20 85 47 -65
10.2543f5o0j30J12J88jr7P4l0o4P4R7r3mJ49l8j65j25L3R5P7O6k5q6j46q5N4P9j7J42
$$ -65 -125 -255 -143 45 44 -53 21 -9 -73 1 98 5 1 150 112 -53 -178 -145 -50 27 93 68 -18 -164 -249 -195 -116 -133 9
10.0607IP6nR2J1p0M1pj57o0J0Q5r2J11J51O7p3n3k3J17j7p6j35j04L4m2J7J3n5o2K6
$$ 9 85 80 172 183 113 154 147 -10 -70 -60 25 -67 44 195 262 189 136 113 230 213 137 2 -102 -68 -110 -93 -80 -135 -197 -171
9.8604a71o9M7On9J06P3n0q1o2M0M2j2J47K08M0r4j31j24l8m7J43J10p6j8P5O5q3m5
$$ -171 -240 -193 -187 -246 -140 -67 -117 -198 -260 -220 -178 -190 -43 165 205 111 -20 -144 -182 -229 -86 24 -52 -70 5 70 -13 -58
9.6735e8m4O2J08K4j21j09J6M3J14j31j21j9O9J17J73Q9j32j38k4J19K1l9N8L9K8m8
$$ -58 -102 -40 68 92 -29 -138 -122 -79 35 -96 -217 -236 -167 -50 123 212 80 -58 -82 37 58 19 77 116 144 96
9.4999I6k16JJ46O8o2j43r2j5J3M0J30J64J05j01P3N1k07j49MQQ4j52j14L7m5J17M2
$$ 96 -120 -119 27 95 33 -110 -202 -217 -204 -164 -34 130 235 134 207 258 51 -98 -94 -86 -2 -154 -268 -231 -276 -159 -117
9.3196a17j11L4Q4J46k5j07nN6k2K7K8r5J02R9j3j26R5O1j6N5J0j35k8Q0j22j04P7N1
$$ -117 -228 -194 -110 36 11 -96 -101 -45 -67 -40 -12 -107 -5 94 81 -45 50 111 95 150 160 25 -3 77 -45 -149 -72 -21
9.1327b1jm7qJ7N8k2j9M1M3oJ45J20q6j24mj7l6%K5L8O1j5p2M8k7l7j34j22P8R8r9N8
$$ -21 -22 -69 -77 -60 -2 -24 -43 -2 41 35 180 300 214 90 86 69 33 33 58 96 157 142 70 118 91 54 -80 -202 -124 -26 -125 -67
8.9190f7J09q8j13K5Q3j7o3J2k1l9K13P1j03q5n9O0J67l7J2K2j07J16o3j45K2j3l7l0
$$ -67 42 -46 -159 -134 -51 -68 -131 -119 -140 -179 34 105 2 -83 -142 -82 85 48 60 82 -25 91 28 -117 -95 -108 -145 -175
8.7321a75q0%P8Rl2l0J05J23QJ0o9K8k0Nl5j33K9J48J13jp8j62pO8m4m3n3n1q2J27K07
$$ -175 -255 -255 -177 -168 -200 -230 -125 -2 6 16 -53 -25 -45 -40 -75 -208 -179 -31 82 81 3 -159 -166 -98 -142 -185 -238 -289 -371 -244 -37
8.5251c7J43qM6l4K5Q1n2k81p1l9P4M7j93n1J23Q0Q1Q5pLr6Q0j81j13J65l2mP3O0L5
$$ -37 106 98 144 110 135 216 164 -117 -188 -227 -153 -106 -299 -350 -227 -147 -66 19 12 15 -81 -1 -182 -295 -130 -162 -166 -93 -33 2
8.3248Bp4K6J80M8q7O8J5j78l4M8l9k6L3M4k1L2mn8j47J03J14L5o3n1l2j0N1J3O3l8
$$ 2 -72 -46 134 182 95 163 178 0 -34 14 -25 -51 -18 26 5 37 33 -25 -172 -69 45 80 17 -34 -66 -76 -25 -12 51 13
8.1245A3k5J38L6n3m8O1n8o7lj4M9Q5n2j03J6QJ24J5j57O7J52q2k3Lj19pL6j29M5J12
$$ 13 -12 126 162 109 61 122 64 -3 -6 -20 29 114 62 -41 -25 -17 107 122 -35 32 184 102 79 82 -37 -44 -8 -137 -92 20
7.9243B0l3n0J02mp3J6J0Pm7k2J3o9j5J58O2l0m4KL3J4k0O2K0j6r6j05k4O6j3O0n6j71
$$ 20 -13 -63 39 35 -38 -22 -12 -5 -52 -74 -61 -130 -145 13 75 45 1 3 36 50 30 92 112 96 0 -105 -129 -63 -76 -16 -72 -243
7.7106b43K6J35l8p2l1QJ0K9M6K0J21k8l0po3J75l4m9K3l5n5Pj90m2J11J10J38N1J2
$$ -243 -217 -82 -120 -192 -223 -215 -205 -176 -130 -110 11 -17 -47 -54 -117 58 24 -25 -2 -37 -92 -85 -275 -317 -206 -96 42 93 105
7.5170A05o0N2m3j54K4J11L2oL5Q0o5n3L9j09k1l7j2j4J0Q2J80R2j00k12J8P7k1j18
$$ 105 45 97 54 -100 -76 35 67 61 96 176 111 58 97 -12 -33 -70 -82 -96 -86 -4 176 268 168 -44 -26 51 30 -88
7.3301h8N5K0j49J3ql7L5J15Om4J84Ok2l9r4k8q3O1J26L5p5q7J12J4j8k3JM2K7n3j74
$$ -88 -33 -13 -162 -149 -157 -194 -159 -44 -38 -82 102 108 86 47 -47 -75 -158 -97 29 64 -11 -98 14 28 10 -13 -12 30 57 4 -170
7.1231a70J28R9P4O4l2P5j43k1Tj44j89Q0J21j0o1N0P5P0K9j7P3J6m2J1N9k9L7O8l5
$$ -170 -42 57 131 195 163 238 95 74 53 -91 -280 -200 -79 -89 -150 -100 -25 45 74 57 130 146 104 115 174 145 182 250 215
6.9295B15j66j59J00K29j18j01J00M6m5J21j09j78q8j05Q0j0K7n9l9J74M9M0Nn9j27
$$ 215 49 -110 -10 219 101 0 100 146 101 222 113 -65 -153 -258 -178 -188 -161 -220 -259 -85 -36 4 9 -50 -177
6.7626a77l8J9K5r5J9J90J65j1j66j5L8M1L4p6Mo8l2O8Q4J32R5n8j7j9Qm1r6k6N4R6
$$ -177 -215 -196 -171 -266 -247 -57 108 97 -69 -84 -46 -5 29 -47 -43 -111 -143 -75 9 141 236 178 161 142 150 109 13 -13 41 137
6.5623A37K0m8m6M1J03j8j36l3K6L3j7nl4m9M4J32M6p8nj1j05M6lOL1n8o4p4k2J22m2
$$ 137 157 109 63 104 207 189 53 20 46 79 62 57 23 -26 18 150 196 118 113 102 -3 43 40 46 77 19 -45 -119 -141 -19 -61
6.3553f1M7k6qJ0l4P1O2j49m1K6l0lj4J6lM3RM8J11q3J21J20o2l2R3j86q5J0R8n4l6
$$ -61 -14 -40 -48 -38 -72 -1 61 -88 -129 -103 -133 -136 -150 -134 -137 -94 -85 -37 74 -9 112 232 170 138 231 45 -40 -30 68 14 -22
6.1484b2j2J42q6j46o3L1R6N2M2M4pj7q2l5R5m4j9J50R3l6j72j46M3j3j9J14R1J62N6
$$ -22 -34 108 22 -124 -187 -156 -60 -8 34 78 71 54 -28 -63 32 -12 -31 119 212 176 4 -142 -99 -112 -131 -17 74 236 292
5.9547B92o2p8n4K7M1l4j52L6j0TP0k5M3J9K0J21j75j14R4J44n7j41Nj8J2Q4m5q2j4
$$ 292 230 152 98 125 166 132 -20 16 6 -4 66 41 84 103 123 244 69 -45 49 193 136 -5 0 -18 -6 78 33 -49 -63
5.7611f3L7n2j4N6j37l7M6R5Tnj15n5l9l7K6J45J02M1M4m9m3pQ4n6on6o0J5Q9O4j23
$$ -63 -26 -78 -92 -36 -173 -210 -164 -69 26 21 -94 -149 -188 -225 -199 -54 48 89 133 84 41 34 118 62 56 0 -60 -45 44 108 -15
5.5542a5ro2j4J8K28J13j62j29qP8J6j0q3j49K4J10J51L1n2j7J5l9k4q8L4K4q7J9J38
$$ -15 -24 -86 -100 -82 146 259 97 -32 -40 38 54 44 -39 -188 -164 -54 97 128 76 59 74 35 11 -77 -43 -19 -106 -87 51
5.3605E1L5l6j37l3o5n1L3r2L8TM3L3P6N1M8J06m7J3J4L7L3l3o0q9J6J9J19K3l8j4k1
$$ 51 86 50 -87 -120 -185 -236 -203 -295 -257 -219 -176 -143 -67 -16 32 138 91 104 118 155 188 155 95 6 22 41 160 183 145 131 110
5.1536A10OL8Tj35l8n5NP6j55k8J14m0n0j2L1M5qM8P6L6njL9r7M5K3r5q7R6K0N6p7q5
$$ 110 116 154 192 57 19 -36 -31 45 -110 -138 -24 -64 -114 -126 -95 -50 -58 -10 66 102 97 96 135 38 83 106 11 -76 20 40 96 19 -66
4.9333f6J45k9j36q4o4J26J27L0o3k0R5N0m7j57J06R9j13j04k1l7j9Q8J45P2p4Lm9N8
$$ -66 79 50 -86 -170 -234 -108 19 49 -14 -34 61 111 64 -93 13 112 -1 -105 -126 -163 -182 -94 51 123 49 52 3 61
4.7463F1J00M9n2o0mj86k18M4J01l3qJ28N3m1O6J32Lj34nj28q9J07J56J11N7k4k8j10
$$ 61 161 210 158 98 94 -92 -310 -266 -165 -198 -206 -78 -25 -66 0 132 135 1 -4 -132 -221 -114 42 153 210 186 158 48
4.5594D8l6j0j85J8N8p7K4j9K1P5l6J2J14j2J5oN5l9k5M4J5l4K6J23P0m2l5Qm7M6j25
$$ 48 12 2 -183 -165 -107 -184 -160 -179 -158 -83 -119 -107 7 -5 10 4 59 20 -5 39 54 20 46 169 239 197 162 170 123 169 44
4.3524D4k20L5L0J0j2j8J23Q2j7P9j40N9J57k4l5n3O5K2N4l3q1j10N3L3L0M2n3l3jK1
$$ 44 -176 -141 -111 -101 -113 -131 -8 74 57 136 -4 55 212 188 153 100 165 187 241 208 127 17 70 103 133 175 122 89 88 109
4.1521A09q8JJ5j57k12k7J05L3MM9J10m3J9J5q6j5J88j68j52R2Pj67J7J23j6n9l3N3
$$ 109 21 22 37 -120 -332 -359 -254 -221 -217 -168 -58 -101 -82 -67 -153 -168 20 -148 -300 -208 -201 -368 -351 -228 -244 -303 -336 -283
3.9652b83P4K0K8K32P2Lj66r6Q7P6q8l4R2P2j07M1J37k11RP3n2l3Tl1J0J27JJ51No9
$$ -283 -209 -189 -161 71 143 146 -20 -116 -29 47 -41 -75 17 89 -18 23 160 -51 -42 31 -21 -54 -87 -118 -108 19 20 171 176 107
3.7649A07N0M0k5q3l9l8J25O1k1q5j32n1J37k2r0J20O7m8m6m0J3P2J07m7j26k8Tmk6
$$ 107 157 197 172 89 50 12 137 198 177 92 -40 -91 46 24 -66 54 121 73 27 -13 0 72 179 132 6 -22 -50 -54 -80
3.5713h0k4J8L7J76m6k5J09j49l7R5n3J9P4p3j26Q3K0m2M4Oj6MJ23j17L0pL3P5l8l9
$$ -80 -104 -86 -49 127 81 56 165 16 -21 74 21 40 114 41 -85 -2 18 -24 20 26 10 14 137 20 50 43 76 151 113 74
3.3710G4K3m7j05RJ6jj5r0J23Q7K0nj8K9N4o1j36L8J6q6Q3j7m1N4RJ12l0q1l0j0j09
$$ 74 97 50 -55 -46 -30 -31 -46 -136 -13 74 94 89 71 100 154 93 -43 -5 11 -75 8 -9 -50 4 13 125 95 14 -16 -26 -135
3.1640a35J8J17J2kq0m8j0J5l6Q3MK4J11J06j13j59K1J6Nmk8j06J05R5M5Q0p6j03n1
$$ -135 -117 0 12 10 -70 -118 -128 -113 -149 -66 -62 -38 73 179 66 -93 -72 -56 -51 -55 -83 -189 -84 11 56 136 60 -43 -94
2.9704i4K0p2M9R7j0J3J11J9m0J53m2j91j03N7jr2j9N2Q2M8oJ0p4n7R7l2rQ5M9l7j5
$$ -94 -74 -146 -97 0 -10 3 114 133 93 246 204 13 -90 -33 -34 -126 -145 -93 -11 37 31 41 -33 -90 7 -25 -34 51 100 63 48
2.7634D8J32J24MK1j10j09M8K2l6o1l9l7K1J3TJ47Q9n1j47q3J1j55k02p4K35J46K3j0
$$ 48 180 304 308 329 219 110 158 180 144 83 44 7 28 41 54 201 290 239 92 9 20 -135 -337 -411 -176 -30 -7 -17
2.5765a7L3j31m1p2j0o8l5L0J76Q2%k4k8K2k2j31Q6o5r3K4J14J8K5J96L7j9M9j68o5
$$ -17 16 -115 -156 -228 -238 -306 -341 -311 -135 -53 -53 -77 -105 -83 -105 -236 -150 -215 -308 -284 -170 -152 -127 69 106 87 136 -32 -97
2.3829i7Q3P0Tl4J75Jk11K4O4j3j67o1m1R6J06o2qJ42J8j65j20O2kJ0p8q6j6KK1o5J42
$$ -97 -14 56 126 92 267 268 57 81 145 132 -35 -96 -137 -41 65 3 -5 137 155 -10 -130 -68 -70 -60 -138 -224 -240 -238 -217 -282 -140
2.1759a40J74oL1j04q1r3k0J53k0R6L3RJ5j27p2JQ9K0K8K3J9L0J36K7kQk3j34j62l3
$$ -140 34 28 59 -45 -126 -219 -239 -86 -106 -10 23 32 47 -80 -152 -151 -62 -42 -14 9 28 58 194 221 219 227 204 70 -92 -125
1.9756a25O4L4M1l2L2Tk6J12o0o1l7O7n5m6Tk2p4Q8J15J8n5N1J0j2oJ3j29m2N2J51l2
$$ -125 -61 -27 14 -18 14 46 20 132 72 11 -26 41 -14 -60 -106 -128 -202 -114 1 19 -36 15 25 13 7 20 -109 -151 -99 52 20
1.7687B0j09k8L6O2m3K6R0Q9l6j1N6j54r8k7J03J49J04q6r0j8P3R5k1m2n1n9q1L6L5
$$ 20 -89 -117 -81 -19 -62 -36 54 143 107 96 152 -2 -100 -127 -24 125 229 143 53 35 108 203 182 140 89 30 -51 -15 20
1.5751B0j72L4J54J25j53r3Q3J35o1o3l3n1P6M0L8j11n6j20M2J37J46m7j25m6O8O6k0
$$ 20 -152 -118 36 161 8 -85 -2 133 72 9 -24 -75 1 41 79 -32 -88 -208 -166 -29 117 70 -55 -101 -33 33 13
1.3948A3N9qo5R7K5M8J53n3o4r6Tn8m6R1k8J4M3p6j3o4J3L5N1Q2N9kr3mr3o5O0N8m2
$$ 13 72 64 -1 96 121 169 322 269 205 109 13 -45 -91 0 -28 -14 29 -47 -60 -124 -111 -76 -25 57 116 114 21 17 -76 -141 -81 -23 -65
1.1745f5j0J89J07n0m9o3m8j11p0J24O5L7J42r2l3QL6j5j20m4K6j4Q9k3p3Kj42M4J8
$$ -65 -75 114 221 171 122 59 11 -100 -170 -46 19 56 198 106 73 81 117 102 -18 -62 -36 -50 39 16 -57 -55 -197 -153 -135
0.9809a35O5K1%P1oO9k2l6L6j1k4p1n0m1m6K1kO4m6q8O3N6J2N7Q3k3p0j15l9K08J25
$$ -135 -70 -49 -49 22 16 85 63 27 63 52 28 -43 -93 -134 -180 -159 -161 -97 -143 -231 -168 -112 -100 -43 40 17 -53 -168 -207 1 126
0.7739A26L2N2Kk5j77K8L9J05j56j90KQ1l5jj0L2J08j8j38j00P7M6j7J18K34rj73j57
$$ 126 158 210 212 187 10 38 77 182 26 -164 -162 -81 -116 -117 -127 -95 13 -5 -143 -243 -166 -120 -137 -19 215 206 33 -124
0.5870a24l1l4m6k1P6J43Llk5k6mR1j0j25J60N4J24j3n7MR4L2nj27n5L5j00j20oL8J80
$$ -124 -155 -189 -235 -256 -180 -37 -34 -37 -62 -88 -92 -1 -11 -136 24 78 202 189 132 136 230 262 257 130 75 110 10 -110 -116 -78 102
0.3800A02k0j1p6Lj7j34m8K07J25M8LKlo4j33j30L2J63J67j57j44j89k6J6J01J11J05
$$ 102 82 71 -5 -2 -19 -153 -201 6 131 179 182 184 181 117 -16 -146 -114 49 216 59 -85 -274 -300 -284 -183 -72 33
0.1997C3O0n9p1N9j17lL0R5M6N6q8r6oJ45n3j01o6O7K00K7m7K3l7J13m2j53M5k52J3
$$ 33 93 34 -37 22 -95 -98 -68 27 73 129 41 -55 -61 84 31 -70 -136 -69 131 158 111 134 97 210 168 15 60 -192 -179
0.0061a79J79J0J7jrk1l7L7j14j30K4Q7J04P8l2k3j89r1k1L9O9J71Q6J53J3j57m4oM6
$$ -179 0 10 27 26 17 -4 -41 -4 -118 -248 -224 -137 -33 45 13 -10 -199 -290 -311 -272 -203 -32 54 207 220 63 19 13 59
-0.1875E9R9pj38M0l5l1j24l9jOJ77J32j34n3j8Q2J62j3r9J02n4q8Mj30k8J01l9k8J52
$$ 59 158 151 13 53 18 -13 -137 -176 -177 -171 6 138 4 -49 -67 15 177 164 65 167 113 25 29 -101 -129 -28 -67 -95 57
-0.3811E7N3O3j22j00N8N4j49j08l3R5J16J48K3k54j66k3O3Q0R7k5K4J12oj27k1k8O0
$$ 57 110 173 51 -49 9 63 -86 -194 -227 -132 -16 132 155 -99 -265 -288 -225 -145 -48 -73 -49 63 57 -70 -91 -119 -59
-0.5614e9J15o0q5mJ7m0%J90R4Rj54r1l8N7M4Q5o1n4k0p5n3J34j4p9K3MJ8p0n5M3J32
$$ -59 56 -4 -89 -93 -76 -116 -116 74 168 177 23 -68 -106 -49 -5 80 19 -35 -55 -130 -183 -49 -63 -142 -119 -115 -97 -167 -222 -179 -47
-0.7683d7M7P8l6j21n9r9J35J25q4l5P6Q0n3r5q0O3N3O2J03K10Rj01l7j43n1m2JR1N4
$$ -47 0 78 42 -79 -138 -237 -102 23 -61 -96 -20 60 7 -88 -168 -105 -52 10 113 323 332 231 194 51 0 -42 -41 50 104
-0.9619A04o6lp0j7j15J22J77l9n0J4L2rl1p9o7o9m0l5J7J02J81r5kM4J13J60k44j37
$$ 104 38 35 -35 -52 -167 -45 132 93 43 57 89 80 49 -30 -97 -166 -206 -241 -224 -122 59 -36 -38 6 119 279 35 -102
-1.1489a02kJ06k3Q2J4j08N9j2o2o5J68J71L7jj37j2J85k0j67J3L2m2q9l6L0Qj60j3
$$ -102 -104 2 -21 61 75 -33 26 14 -48 -113 55 226 263 262 125 113 298 278 111 124 156 114 25 -11 19 27 -133 -146
-1.3358a46j1J15L0o7P6M5o6lP7K8K4K5n8q3j57J4J55P6J0p0J5O3j50n9j6P5J62K7p9
$$ -146 -157 -42 -12 -79 -3 42 -24 -27 50 78 102 127 69 -14 -171 -157 -2 74 84 14 29 92 -58 -117 -133 -58 104 131 52
-1.5294E2j12J3L4k2Lk9J14J01j09j18j7nJ91M6j02n6J02j87j71k2K7N5m5j6J82J22
$$ 52 -60 -47 -13 -35 -32 -61 53 154 45 -73 -90 -95 96 142 40 -16 86 -101 -272 -294 -267 -212 -257 -273 -91 31
-1.7030C1m5j16l7L6P6l7l1n4R9O8N4R5J1j10j74j1nJ1k9J7No4J62l5J2q7p1L7M9Q0
$$ 31 -14 -130 -167 -131 -55 -92 -123 -177 -78 -10 44 139 150 40 -134 -145 -150 -139 -168 -151 -146 -210 -48 -83 -71 -158 -229 -192 -143 -63
-1.9033f3N2m0r5j6KJ12J54J12j26p2J6J48j78TQ9P2P1J70on8j37m6jJ5q1j2LJ38j75
$$ -63 -11 -51 -146 -162 -160 -48 106 218 92 20 36 184 6 -172 -83 -11 60 230 224 166 29 -17 -18 -3 -84 -96 -93 45 -130
-2.0969a30k7K85N7j6j3j02j28pJ0j9Q8j01J3M1M9K6o5l3q6m1N3Mp5L6M8J3j28q1n4
$$ -130 -157 128 185 169 156 54 -74 -81 -71 -90 -2 -103 -90 -49 0 26 -39 -72 -158 -199 -146 -142 -217 -181 -133 -120 -248 -329 -383
-2.2905c83Q6K24J36j2j54N7J56m3j17n8RO7Q2L9k2r2M5k5q7L7P7P4N2j4J25rp2L2r7
$$ -383 -297 -73 63 51 -103 -46 110 67 -50 -108 -99 -32 50 89 67 -25 20 -5 -92 -55 22 96 148 134 259 250 178 210 113
-2.4842A13j40o7m8M0J89r6p9J48Rj72K9R3nm3L5%N1r2r0q3lQ3MJ40M5j15k3J28R2k4
$$ 113 -27 -94 -142 -102 87 -9 -88 60 69 -103 -74 19 14 -29 6 6 57 -35 -125 -208 -211 -128 -124 16 61 -54 -77 51 143 119
-2.6844A19jk2j21kk7R1j3j00J25Q0m2Q4J29Rk62j02N6Ql7r3pn8O2LK1O1J0N6J49k7
$$ 119 118 96 -25 -27 -54 37 24 -76 49 129 87 171 300 309 47 -55 1 9 -28 -121 -128 -186 -124 -121 -100 -39 -29 27 176 149
-2.8847A49o7J20q0j46J3M8j9r9l0L0J3J21J15J04N0j65r4j23J3Q0mj11J4k8r2m4j8
$$ 149 82 202 122 -24 -11 37 18 -81 -111 -81 -68 53 168 272 322 157 63 -60 -47 33 29 -82 -68 -96 -188 -232 -250
-3.0650b50R0J04K9k5k2L2J30R9P2J0l02k32j8K08R2J14Q9q8j01p0o2j7J34J32O7k6
$$ -250 -160 -56 -27 -52 -74 -42 88 187 259 269 -33 -265 -283 -75 17 131 220 132 31 -39 -101 -118 16 148 215 189
-3.2386A89l9N3k1J1j35j66N4N8L0QJ0J9j74j06O0P0%n2n3j0J45J90j83n8J86l7j16
$$ 189 150 203 182 193 58 -108 -54 4 34 42 52 71 -103 -209 -149 -79 -79 -131 -184 -194 -49 141 -42 -100 86 49 -67
-3.4188f7J19K61j22j26N2O8p7j04l5L9J4j01J0N0L0j32jL7N8J8M2P4L8q0P4q4m2KJ70
$$ -67 52 313 191 65 117 185 108 4 -31 8 22 -79 -69 -19 11 -121 -122 -85 -27 -9 33 107 145 65 139 55 13 15 185
-3.6125A85n9j08K9mm0q5q4oJ05m4q0J54m6m8J63Okj01n2J06N4Nk6L4j11r0j27j6J05
$$ 185 126 18 47 43 3 -82 -166 -172 -67 -111 -191 -37 -83 -131 32 38 36 -65 -117 -11 43 48 22 56 -55 -145 -272 -288 -183
-3.8061a83J02J03p7j02j26L9P7J1J31J82q9j35p7m8J03R8rj34J10J34N9l7p0m6N4j6
$$ -183 -81 22 -55 -157 -283 -244 -167 -156 -25 157 68 -67 -144 -192 -89 9 0 -134 -24 110 169 132 62 16 70 54
-3.9797E4r7O3q0Q0R5p2J20N2l9q4jP3k7o9j32o4j1N0LJ1j05J46O0j8J04Q3k9l0lp7
$$ 54 -43 20 -60 20 115 43 163 215 176 92 91 164 137 68 -64 -128 -139 -89 -86 -75 -180 -34 26 8 112 195 166 136 133 56
-4.1799E6j22K6J6L3J8j6Tj4N7Q4m7k6Q9n1o0Q0J54n3j98j18k6P2n0p4j4J8j5LO5p4
$$ 56 -66 -40 -24 9 27 11 -5 -19 38 122 75 49 138 87 27 107 261 208 10 -108 -134 -62 -112 -186 -200 -182 -197 -194 -129 -203
-4.3802b03qQ5Q0LJ27M9K4n8j39K6K1j49o7M1kL1TQ4Q7M7N3P7k1j09j33j91j9J27N9
$$ -203 -211 -126 -46 -43 84 133 157 99 -40 -14 7 -142 -209 -168 -170 -139 -108 -24 63 110 163 240 219 110 -23 -214 -233 -106 -47
-4.5738d7J0M7K9N4l9j30j02K6TJ6J53k4j3O4K8K6qo8j3k8r2k9J1P1j14l5Rj1q1r6R4
$$ -47 -37 10 39 93 54 -76 -178 -152 -126 -110 43 19 6 70 98 124 116 48 35 7 -85 -114 -103 -32 -146 -181 -172 -183 -264 -360 -266
-4.7808b66P5P4K46jn6k5np6N0j0LJ19K9j5O9n9p3J06J10j4j24j06n1K1L5M8m2K1p0
$$ -266 -191 -117 129 128 72 47 42 -34 16 6 9 128 157 142 211 152 79 185 295 281 157 51 0 21 56 104 62 83 13
-4.9744A3l9j0p4rl0m7l6M0P9k1J26Q6rN5l8q5L1J86j46j24j6l8L7o9p6M8J31J45J11
$$ 13 -26 -36 -110 -119 -149 -196 -232 -192 -113 -134 -8 78 69 124 86 1 32 218 72 -52 -68 -106 -69 -138 -214 -166 -35 110 221
-5.1680B21l1j04r3k6N7n2j38L0K17J60m6j38j04oM1J6k9K9J24K0j13o2KO4j67n9J00
$$ 221 190 86 -7 -33 24 -28 -166 -136 81 241 195 57 -47 -53 -12 4 -25 4 128 148 35 -27 -25 39 -128 -187 -87
-5.3483h7O9L1OJ68M5m1MKn8R1J35n8k17M9j1p7K8j34M2Q8L0M7m1K1m8M3o4r7l6M1K4
$$ -87 -18 13 19 187 232 191 195 197 139 230 365 307 90 139 128 51 79 -55 -13 75 105 152 111 132 84 127 63 -34 -70 -29 -5
-5.5553ek1%r1K8J17k8j90n8J4J90J41j4l1q8n5R8J2j8J1K8J4m9k5r6N4J15Q2j01k15
$$ -5 -26 -26 -117 -89 28 0 -190 -248 -234 -44 97 83 52 -36 -91 7 19 1 12 40 54 5 -20 -116 -62 53 135 34 -181
-5.7489a81R9J40n7J7ml7L5O0M2K2o7j05L6j8j22j29M5J05O5%r5j4J29L6K5N8J19K9
$$ -181 -82 58 1 18 14 -23 12 72 114 136 69 -36 0 -18 -140 -269 -224 -119 -54 -54 -149 -163 -34 2 27 85 204 233
-5.9358B33k10k27k3J04K8R8J71R9n7r0k64l7J13K2K3l1Lm1n1P4M9m4R5k0Jo5p9O1J40
$$ 233 23 -204 -227 -123 -95 3 174 273 216 126 -138 -175 -62 -40 -17 -48 -45 -86 -137 -63 -14 -58 37 17 18 -47 -126 -65 75
-6.1294G5j6m6l3o7J3m9P4J6o1M4N1O1N2M4k0j73Q1J14np7j49k6J4j6O9J23K8o9j35
$$ 75 59 13 -20 -87 -74 -123 -49 -33 -94 -50 1 62 114 158 138 -35 46 160 155 78 -71 -97 -83 -99 -30 93 121 52 -83
-6.3230h3JK1P1K00J7j66j0N2j22Po4J00j7L6k5j22R6j2P3k2l8q7r6j68J3P6R2Q3j8
$$ -83 -82 -61 10 210 227 61 51 103 -19 -12 -76 24 7 43 18 -104 -8 -20 53 31 -7 -94 -190 -358 -345 -269 -177 -94 -112
-6.5167a12j1j8L2J1j38kJ16K6L9J00TO1p1q1K5N2j9j02J5L3o6M9P3K1l0j13Rn9m9r
$$ -112 -123 -141 -109 -98 -236 -238 -122 -96 -57 43 143 204 133 52 77 129 110 8 23 56 -10 39 112 133 103 -10 -1 -60 -109 -118
-6.7170a18J1J4n0J9j17NK23k2j15N7M1K5J8ML9J85m3p9k3m2k3LN0j42k9J13j02j26
$$ -118 -107 -93 -143 -124 -241 -236 -13 -35 -150 -93 -52 -27 -9 -5 34 219 176 97 74 32 9 12 62 -80 -109 4 -98 -224
-6.9039b24O8J05O9J08N4k2j7p3k2l2J0J84Q3M3j47j07K7N6K29L1j15j24L9l0j54p8
$$ -224 -156 -51 18 126 180 158 141 68 46 14 24 208 291 334 187 80 107 163 392 423 308 184 223 193 39 -39
-7.0775c9RK1N0P5N7l1o9N3j10j25p9j30J14J06Q4K4lOO4Q4m6r3O3P8L0l3km0j14m4
$$ -39 -30 -9 41 116 173 142 73 126 16 -109 -188 -318 -204 -98 -14 10 7 13 77 161 115 22 85 163 193 160 158 118 4 -40
-7.2778d0l2J56K2j09R7J31r7n8j39KM4JrK7K3LQ0L9k8m4o8o3M9k5n1J2j9K4l6J63J11
$$ -40 -72 84 106 -3 94 225 128 70 -69 -67 -23 -22 -31 -4 19 22 102 141 113 69 1 -62 -13 -38 -89 -77 -96 -72 -108 55 166
-7.4847A66L3q5n1L6k0l7q8P3J29J3k1l8m6k7J23j0m8p2n0n8K4j21j48K37J13J3r1p
$$ 166 199 114 63 99 79 42 -46 27 156 169 148 110 64 37 160 150 102 30 -20 -78 -54 -175 -323 -86 27 40 -51 -58
-7.6717e8mJ53J64J4J9O0l5r0Pk19j65P3J6M2O8o3j3J41N2L8j8j47J4j0J40k5j76o7
$$ -58 -62 91 255 269 288 348 313 223 230 11 -154 -81 -65 -23 45 -18 -31 110 162 200 182 35 49 39 179 154 -22 -89
-7.8586h9l9K1K6J76J05J07J08j7j59n2j2J5J9j15j45o6m4jl0J14K26k0r2j01P3O6k8
$$ -89 -128 -107 -81 95 200 307 415 398 239 187 175 190 209 94 -51 -117 -161 -162 -192 -78 148 128 36 -65 8 74 46
-8.0389D6n7mL2L7o1l5q5N8L1N4o5j68k1jNk3k4n4o8N9K08L2%Q1j35j21n9J09J49K8
$$ 46 -11 -15 17 54 -7 -42 -127 -69 -38 16 -49 -217 -238 -239 -234 -257 -281 -335 -403 -344 -136 -104 -104 -23 -158 -279 -338 -229 -80 -52
-8.2392e2m3j7q0J40J35N6oo6m4j7P4TL6q3q2l2jR9n9J24m8p7q3r8R1Q7j18j21J35R8
$$ -52 -95 -112 -192 -52 83 139 133 67 23 6 80 154 190 107 25 -7 -8 91 32 156 108 31 -52 -150 -59 28 -90 -211 -76 22
-8.4394B2j52n3N1K27J8J4J2P6q7rn8j6J69k4p2Q0p1r5k8j7O8L8k4N9J41j17j56o3K
$$ 22 -130 -183 -132 95 113 127 139 215 128 119 61 45 214 190 118 198 127 32 4 -13 55 93 69 128 269 152 -4 -67 -65
-8.6331f5p1m5J02L0R9N8l4j3j63j28M8P4Q2M0jj15n6K8N0P1J4%P5j51o6k0M2J23O9
$$ -65 -136 -181 -79 -49 50 108 74 61 -102 -230 -182 -108 -26 14 13 -102 -158 -130 -80 -9 5 5 80 -71 -137 -157 -115 8 77
-8.8267G7J4r3l5J05N3n8k43k13P7J41J35J13M8M2pq3K7Q0r3j23Pl1m1K0K16J01j55
$$ 77 91 -2 -37 68 121 63 -180 -393 -316 -175 -40 73 121 163 156 73 100 180 87 -36 -29 -60 -101 -81 135 236 81
-9.0069H1j97r4m8k7J37l9J08J64p6j27LJ87j08k06l8M1O8TR5J86Nl1j28k11J2N6j9
$$ 81 -116 -210 -258 -285 -148 -187 -79 85 9 -118 -115 72 -36 -242 -280 -239 -171 -103 -8 178 183 152 24 -187 -175 -119 -138
-9.1872a38L6R7P7jN9n0j75j02K7N4j12K2R8MQ5M1m2J2lk2j2n5L8j1rL0pK0n1o3L8J6
$$ -138 -102 -5 72 71 130 80 -95 -197 -170 -116 -228 -206 -108 -104 -19 22 -20 -8 -11 -33 -45 -100 -62 -73 -82 -52 -59 -39 -90 -153 -115 -99
-9.4008i9l7M2Q1j58j36N4Q1M1N8o9O3n2p8J10J95l6J1M2K1QTl1n9p8j7N9N3l1j09j26
$$ -99 -136 -94 -13 -171 -307 -253 -172 -131 -73 -142 -79 -131 -209 -99 96 60 71 113 134 142 150 119 60 -18 -35 24 77 46 -63 -189
-9.6011a89o1J41r0o7J68N4O0j67r1m1n4M3J16Q1J45L2m9K6J6n6j08N9R3Q3m8k33j72
$$ -189 -250 -109 -199 -266 -98 -44 16 -151 -242 -283 -337 -294 -178 -97 48 80 31 57 73 17 -91 -32 61 144 96 -137 -309
-9.7814c09JJ28oK5K0k1R1mJ22P9O7p1q9lm7q6l3oq8J4l3J66K19L9l9p2j31j8O6L9q0
$$ -309 -308 -180 -186 -161 -141 -162 -71 -75 47 126 193 122 33 30 -17 -103 -136 -142 -230 -216 -249 -83 136 175 136 64 -67 -85 -19 20 -60
-9.9884f0j22K1J02N8Q9n3o8q4q6M9k2J98J74K2j61j05l6J38J30k8j43j3L9j13l5P5
$$ -60 -182 -161 -59 -1 88 35 -33 -117 -203 -154 -176 22 196 218 57 -48 -84 54 184 156 13 0 39 -74 -109 -34
-10.1619c4m7l8K25O4L8oj19k66M0J48O5p5j24J13Tj48k64l3J07R3o6q4J3K23K33J6
$$ -34 -81 -119 106 170 208 202 83 -183 -143 5 70 -5 -129 -16 97 -51 -315 -348 -241 -148 -214 -298 -285 -62 171 187
-10.3355A87m9j07j57j10J64K8l7p2k4O0J57J38%j88j96J24n8q1p7m7K22L8rO9Q1Q3
$$ 187 138 31 -126 -236 -72 -44 -81 -153 -177 -117 40 178 178 -10 -206 -82 -140 -221 -298 -345 -123 -85 -94 -25 56 139
-10.5091A39O2m4Tlok2j42r5qN0l5K2N0R5J40q4l1P9J22q6k00l7l6j2k0R8N1L1l4j6
$$ 139 201 157 113 110 104 82 -60 -155 -163 -113 -148 -126 -76 19 159 75 44 123 245 159 -41 -78 -114 -126 -146 -48 3 34 0 -16
-10.7094a6N3m5l1K3L2J1ok6j5jq9n9K22M4r1PO7jM1L1j05k16l0K5O5o9Q5K6q7
$$ -16 37 -8 -39 -16 16 27 21 -5 -20 -21 -110 -169 53 97 6 13 80 79 120 151 46 -170 -200 -175 -110 -179 -94 -68 -155
##END= 
