##TITLE= TK 1
##JCAMP-DX= 4.24 
##DATA TYPE= INFRARED SPECTRUM
##$ASDF FORM= DIFDUP
##ORIGIN= PERKIN-ELMER 1600 FT-IR
##OWNER= 
##DATE= 04/02/03
##TIME= 12:10:37.00
##SPECTROMETER/DATA SYSTEM= PERKIN-ELMER 1600 FT-IR
##INSTRUMENT PARAMETERS= 16 scans
##DATA PROCESSING= 
##XUNITS= 1/CM
##YUNITS= TRANSMITTANCE
##XFACTOR= 1.0
##YFACTOR= 0.00001
##FIRSTX= 4400.0
##LASTX= 450.0
##NPOINTS= 3951
##FIRSTY= 68.81983
##MAXY= 85.35478
##MINY= 0.14274
##XYDATA= (X++(Y..Y))
4400.0F8820M8L2J4l1l3k2j9M1J7mL8NRL8l9jL5n8k9N9k1l7L9rm4k6n1M1pl7O3J1n0
$$ 68820 68868 68900 68914 68883 68850 68828 68809 68850 68867 68863 68901 68906 68915 68953 68914 68913 68948 68890 68861 68920 68899 68862 68901 68892 68848 68822 68771 68812 68805 68768 68831 68842 68792
4367.0F8792KQ0L6N4KJ14J57j45L7j1k3J2kM7J2l5P4P9m2JK2K8L5k8lO3L5k3K0l1K3
$$ 68792 68794 68874 68910 68964 68966 69080 69237 69092 69129 69118 69095 69107 69105 69152 69164 69129 69203 69282 69240 69241 69263 69291 69326 69298 69295 69358 69393 69370 69390 69359 69382
4336.0F9382J10k9k4pqjM9j5j6n9J2j4j3j7lOk1J4o0j3P0k1k6O6M7J7LnK3O2J8J5Q4
$$ 69382 69492 69463 69439 69432 69424 69423 69472 69457 69441 69382 69394 69380 69367 69350 69347 69353 69332 69346 69286 69273 69343 69322 69296 69362 69409 69426 69429 69424 69447 69509 69527 69542 69626
4303.0F9626l2K9mj6M5Q5l2k7K9N7k6oM1k5LNj9j0K4J3oL4Rm3O5m2L7o9k8J6j7L0l6
$$ 69626 69594 69623 69619 69603 69648 69733 69701 69674 69703 69760 69734 69728 69769 69744 69747 69752 69733 69723 69747 69760 69754 69788 69797 69754 69819 69777 69814 69745 69717 69733 69716 69746 69710
4270.0F9710j5L9%J4Qk5N4J5%N4m3K2P0K4K1L4N3p9L5J5J3P5j1J0m6qO8j9NM5K5j1m3
$$ 69710 69695 69734 69734 69748 69756 69731 69785 69800 69800 69854 69811 69833 69903 69927 69948 69982 70035 69956 69991 70006 70019 70094 70083 70093 70047 70039 70107 70088 70093 70138 70163 70152 70109
4237.0G0109j8O0k0J2j0k4K2N6o7l4J4K5j3J0lo2M9N0m8k0O7J5p6M2L8l5J2jMJ3L6o
$$ 70109 70091 70151 70131 70143 70133 70109 70131 70187 70120 70086 70100 70125 70112 70122 70119 70057 70106 70156 70108 70088 70155 70170 70094 70136 70174 70139 70151 70150 70154 70167 70203 70197
4205.0G0197RlN1jTj8R1QJ4L4Mm9O2K7l1R1J7m8j7L9pL4Nk3kMj4o4MO7L8n3O6Q6k7n7
$$ 70197 70206 70203 70254 70253 70252 70234 70325 70333 70347 70381 70385 70336 70398 70425 70394 70485 70502 70454 70437 70476 70469 70503 70508 70485 70483 70487 70473 70409 70413 70480 70518 70465 70531 70617 70590 70533
4169.0G0533j0K1rQn7l7q4j44j27r8l9n9k8K9M7M2M4O2P5jM4J19L5K2N3P3RM1Q1N3j3
$$ 70533 70523 70544 70535 70543 70486 70449 70365 70221 70094 69996 69957 69898 69870 69899 69946 69988 70032 70094 70169 70168 70212 70331 70366 70388 70441 70514 70523 70564 70645 70698 70685
4138.0G0685LM9K8LK0L7L3ML7J0k2LL1K4K1Omn3jM8lmM1%M4n5o0P0NJ2L3l7j7O6pJ3
$$ 70685 70688 70737 70765 70768 70788 70825 70858 70862 70899 70909 70887 70890 70921 70945 70966 70972 70968 70915 70914 70962 70959 70955 70996 70996 71040 70985 70925 70995 71000 71012 71045 71008 70991 71057 71050 71063
4102.0G1063kk9J3Q1j4n9M4M1M6k9rRL4o%L5M0KO1MJ7J4J0J1K0J3lPL5j3k9j2J6Pl9
$$ 71063 71061 71032 71045 71126 71112 71053 71097 71138 71184 71155 71146 71155 71189 71183 71183 71218 71258 71260 71321 71325 71342 71356 71366 71377 71397 71410 71407 71414 71449 71436 71407 71395 71411 71418 71379
4067.0G1379N7jnj9o2m9L2k1L1M7jJjM6J7m4k2K3L8mj3J7J1j5J6L0Rj0J6l1L4KN3M3
$$ 71379 71436 71435 71430 71411 71349 71300 71332 71311 71342 71389 71388 71389 71388 71434 71451 71407 71385 71408 71446 71442 71429 71446 71457 71442 71458 71488 71497 71487 71503 71472 71506 71508 71561 71604
4033.0G1604rM0l2j3M5M9K7P5m0k3O8qk9j0NK9%OlQOl1m1JL0ol5J2ON5l9Oj3J2J0L0
$$ 71604 71595 71635 71603 71590 71635 71684 71711 71786 71746 71723 71791 71783 71754 71744 71749 71778 71778 71784 71781 71789 71795 71764 71723 71724 71754 71748 71713 71725 71731 71786 71747 71753 71740 71752 71762 71792
3997.0G1792OJn7k7lK6qn3%l1K4k5M7J7n2rM2P4L9k6m6P4RpQj5k6M4L0L3m4k1K5n8k9
$$ 71792 71798 71799 71742 71715 71712 71738 71730 71677 71677 71646 71670 71645 71692 71709 71657 71648 71690 71764 71803 71777 71731 71805 71814 71807 71815 71800 71774 71818 71848 71881 71837 71816 71841 71783 71754
3962.0G1754J4n8m8m7p1q0m3q1n0%jO6M1Q0J25Q8J01L0k7o3l5J0l5p3j56k08j77k77
$$ 71754 71768 71710 71662 71615 71544 71464 71421 71340 71290 71290 71289 71355 71396 71476 71601 71689 71790 71820 71793 71730 71695 71705 71670 71597 71441 71233 71056 70779
3934.0G0779l56m00l61k43j45m6J61TK24K82L45L24L12J80J25J55J37J25J35J02J0P2
$$ 70779 70423 70023 69662 69419 69274 69228 69389 69550 69774 70056 70401 70725 71037 71217 71342 71497 71634 71759 71894 71996 72006 72078
3912.0G2078j2j8pl0m5m8j5q1Q2Q4K43Q5J47R4J62J17l6m3j83j37o0m8J08J33j5j91
$$ 72078 72066 72048 72041 72011 71966 71918 71903 71822 71904 71988 72231 72316 72463 72557 72719 72836 72800 72757 72574 72437 72377 72329 72437 72570 72555 72364
3886.0G2364j36J33K55J30r1j39L4J89K03K1k08j37RP0J1r5q1J14L49J55j64k18M3K14
$$ 72364 72228 72361 72616 72746 72655 72516 72550 72739 72942 72963 72755 72618 72627 72697 72708 72613 72532 72646 72995 73150 72986 72768 72811 73025
3862.0G3025P4j12l9P6qj63l77l59j00L78P76N82J94j07J3j24j62j64j58j36m7n0l0
$$ 73025 73099 72987 72948 73024 73016 72853 72476 72117 72017 72395 73171 73753 73947 73840 73853 73729 73567 73403 73245 73109 73062 73012 72982
3839.0G2982o4J74K72K46J75L8n4j4om3K6l7j64o8R6l9j89k33N9L99L67l0k69j09K77
$$ 72982 72918 73092 73364 73610 73785 73823 73769 73755 73749 73706 73732 73695 73531 73463 73559 73520 73331 73098 73157 73556 73923 73893 73624 73515 73792
3814.0G3792L40Nj04k23p7j25k67j25J46L40P2l01k48K28M34K49k3k39l3K08P8j24p1
$$ 73792 74132 74137 74033 73810 73733 73608 73341 73216 73362 73702 73774 73473 73225 73453 73887 74136 74113 73874 73841 74049 74127 74003 73932
3791.0G3932m9k4j9k6ol9mNJ24M8n7k6L0J41Tj8o8n4L8r2j64k6J47J76N3n0k5J49J27
$$ 73932 73883 73859 73840 73814 73808 73769 73765 73770 73894 73942 73885 73859 73889 74030 74171 74153 74085 74031 74069 73977 73813 73787 73934 74110 74163 74113 74088 74237 74364
3762.0G4364l4k08j07M2J19J07J8l4j68j99n6J20L06K36K75J53p9l57nO32L33j34k96
$$ 74364 74330 74122 74015 74057 74176 74283 74301 74267 74099 73900 73844 73964 74270 74506 74781 74934 74855 74498 74493 75125 75458 75324 75028
3739.0G5028j36k9j56k02J04P0P7N6J11J81m3j89k39o0Rp0m2p4Q3J06n4k6k1kq2k60
$$ 75028 74892 74863 74707 74505 74609 74679 74756 74812 74923 75104 75061 74872 74633 74573 74582 74512 74470 74396 74479 74585 74531 74505 74484 74482 74400 74140
3713.0G4140j37K0J77K71J91L8O7P0j21j61r6j32nJ29K9m4p1Rj1p8j38j21j07j4J41
$$ 74140 74003 74023 74200 74471 74662 74700 74767 74837 74716 74555 74459 74327 74322 74451 74480 74436 74365 74374 74363 74285 74147 74026 73919 73905 74046
3688.0G4046J11K91J67K6j86j08n0j79k23j18j29k82j42K30N38M37j10l37j37K75K21
$$ 74046 74157 74448 74615 74641 74455 74347 74297 74118 73895 73777 73648 73366 73224 73454 73992 74429 74319 73982 73845 74120 74341
3667.0G4341p7k06r8j22j48r9j13j29j62k06j88l7J84J68j8l04k76N4N7K53K03Rj5j09
$$ 74341 74264 74058 73960 73838 73690 73591 73478 73349 73187 72981 72793 72756 72940 73108 73090 72786 72510 72564 72621 72874 73077 73086 73071 72962
3643.0G2962j43k48j98j57j80j75j22j24j39j21p9l8j84l17k11L11L80J04j80k56j63
$$ 72962 72819 72571 72373 72216 72036 71861 71739 71615 71476 71355 71276 71238 71054 70737 70526 70837 71217 71321 71141 70885 70722
3622.0G0722j96l67l18j66L4qoj21k17j75r8o4k16k58r9L3r2k02j73j75k74j46k18j63
$$ 70722 70526 70159 69841 69675 69709 69701 69695 69574 69357 69182 69084 69020 68804 68546 68447 68480 68388 68186 68013 67838 67564 67418 67200 67037
3598.0F7037j67j81j52j21j17j00j23k15k37k07j93m6Q2q6j56j00j84k60j89k11j83
$$ 67037 66870 66689 66537 66416 66299 66199 66076 65861 65624 65417 65224 65178 65260 65174 65018 64918 64734 64474 64285 64074 63891
3577.0F3891j52j33j55j51j07j69r6j75k34j52p1QK9k9j01j16j42j61j49j22j12j69
$$ 63891 63739 63606 63451 63300 63193 63024 62928 62753 62519 62367 62296 62304 62333 62304 62203 62087 61945 61784 61635 61513 61401 61232
3555.0F1232j26j03j31q3o7n6j02j29n0n3p1p4p9j20r8j26r5r4r2j36j15r6q0p6o5q3
$$ 61232 61106 61003 60872 60789 60722 60666 60564 60435 60385 60332 60261 60187 60108 59988 59890 59764 59669 59575 59483 59347 59232 59136 59056 58980 58915 58832
3529.0E8832j30n9q7n1k4j03j32p8j05j32j04p1p2r1o8q5j40r9j23q2l7p3o8j05q2j5
$$ 58832 58702 58643 58556 58505 58481 58378 58246 58168 58063 57931 57827 57756 57684 57593 57525 57440 57300 57201 57078 56996 56959 56886 56818 56713 56631 56616
3503.0E6616k7o5r6r5p5q3j26p6o7r1j12p7o5p7o4l8r2q3p6Tq1p9l9o6r3q7l4q6j16
$$ 56616 56589 56524 56428 56333 56258 56175 56049 55973 55906 55815 55703 55626 55561 55484 55420 55382 55290 55207 55131 55055 54974 54895 54856 54790 54697 54610 54576 54490 54374
3474.0E4374o9p9r6k3J9j05n8l3r0j12q4m6o9l9m3p2n4l3o7m6k4m1m0l2m0n0k2k3j8
$$ 54374 54305 54226 54130 54107 54126 54021 53963 53930 53840 53728 53644 53598 53529 53490 53447 53375 53321 53288 53221 53175 53151 53110 53070 53038 52998 52948 52926 52903 52885
3445.0E2885Kj9O%j4JK9k9K8j8K2LK9L7J0PMK8L9N7M6M8N8L9O2Q0P5P4O5O2N1TO5O9
$$ 52885 52887 52868 52874 52874 52860 52861 52890 52861 52889 52871 52893 52896 52925 52962 52972 52979 52983 53011 53050 53107 53153 53201 53259 53298 53360 53440 53515 53589 53654 53716 53767 53818 53883 53952
3411.0E3952Q8R7R4L7O4J33R9O4P8J13R8N7P3J17J28Q7R4R6K8P5J03R2J09J10R9Q9J45
$$ 53952 54040 54137 54231 54268 54332 54465 54564 54628 54706 54819 54917 54974 55047 55164 55292 55379 55473 55569 55597 55672 55775 55867 55976 56086 56185 56274 56419
3384.0E6419J00R3J36J15R2R3J25J29J04J40J57J12P9Q7J05R9J08J00N3P7O2OJ7k4m3
$$ 56419 56519 56612 56748 56863 56955 57048 57173 57302 57406 57546 57703 57815 57894 57981 58086 58185 58293 58393 58446 58523 58585 58591 58608 58584 58541
3359.0E8541k1L0R5J34K01K74K94K99K93K45K93K53K35K59K26J54J81J86K05J92J11
$$ 58541 58520 58550 58645 58779 58980 59254 59548 59847 60140 60385 60678 60931 61166 61425 61651 61805 61986 62172 62377 62569 62680
3338.0F2680J50J67J30J41J09J19J44J48R5J15R1J02J11R0P9N7Q1L9K4rk4Tl6o3p3q1
$$ 62680 62830 62997 63127 63268 63377 63496 63640 63788 63883 63998 64089 64191 64302 64392 64471 64528 64609 64648 64672 64663 64639 64615 64579 64516 64443 64362
3312.0F4362l9l4Qk3j5o7n9o8j71p7r4r2j16q3m6j19j21j27j00q2j16j31n3j08j57p5
$$ 64362 64323 64289 64297 64274 64259 64192 64133 64065 63894 63817 63723 63631 63515 63432 63386 63267 63146 63019 62919 62837 62721 62590 62537 62429 62272 62197
3286.0F2197o9j07j18j10j00j44j91k12k37k22k83l76l72m04m87n41o50p17p88q68j009
$$ 62197 62128 62021 61903 61793 61693 61549 61358 61146 60909 60687 60404 60028 59656 59252 58765 58224 57574 56857 56069 55201 54192
3265.0E4192j193j281j393j621j874k004k182k451k689k899l059l273l384l398l264
$$ 54192 52999 51718 50325 48704 46830 44826 42644 40193 37504 34605 31546 28273 24889 21491 18227
3250.0A8227l027k625k147j626j009l37K84R72J611K226K752L106L314L440L442L337
$$ 18227 15200 12575 10428 8802 7793 7456 7740 8712 10323 12549 15301 18407 21721 25161 28603 31940
3234.0C1940L144K895K659K370K082J851J678J453J302J203J119J001R04Q35TP50O52
$$ 31940 35084 37979 40638 43008 45090 46941 48619 50072 51374 52577 53696 54697 55601 56436 57271 58021 58673
3217.0E8673O59O58O05N87N68N11N06M63M57M28L68L59L64L45K81L07L02K27K15K13
$$ 58673 59332 59990 60595 61182 61750 62261 62767 63230 63687 64115 64483 64842 65206 65551 65832 66139 66441 66668 66883 67096
3197.0F7096K62K09J71J64J27J33J14J04L8N3R2J09R2J27J35J85J45J05J27J02P8R8
$$ 67096 67358 67567 67738 67902 68029 68162 68276 68380 68418 68471 68563 68672 68764 68891 69026 69211 69356 69461 69588 69690 69768 69866
3175.0F9866R4O1Q5J09R7O1R0J08R8J13TJ08J03J21O0O1J07J10O0M3Q4Q0O0%Rqpj9m2
$$ 69866 69960 70021 70106 70215 70312 70373 70463 70571 70669 70782 70895 71003 71106 71227 71287 71348 71455 71565 71625 71668 71752 71832 71892 71892 71901 71893 71886 71867 71825
3146.0G1825j36j82k08l29m98p06j136j474j538j057j91N41R48J070R11P27N01L25K27
$$ 71825 71689 71507 71299 70970 70472 69766 68630 67156 65618 64561 64370 64911 65859 66929 67840 68567 69068 69393 69620
3127.0F9620J59J43M1l0j72l40n72j015j660k480l552m635n092m332k524l34J442K603
$$ 69620 69779 69922 69963 69933 69761 69421 68849 67834 66174 63694 60142 55507 50415 46083 43559 43225 44667 47270
3109.0D7270K963K858K590K170J780J384J159J103J057R85R39R11Q44P33O13N23M80
$$ 47270 50233 53091 55681 57851 59631 61015 62174 63277 64334 65319 66258 67169 68013 68746 69359 69882 70362
3092.0G0362M29L75K38J75K20J43J17K7j53j42j27j28k5J26K07K60L00K85K25J20O1
$$ 70362 70791 71166 71404 71579 71799 71942 72059 72086 71933 71791 71664 71536 71511 71637 71844 72104 72404 72689 72914 73034 73095
3071.0G3095l4j6J2J3P4K9l7o6k3K5M9J16Q6J21L7J04M8K4TK1ok5k6l6k8m4p3n9j42
$$ 73095 73061 73045 73057 73070 73144 73173 73136 73070 73047 73072 73121 73237 73323 73444 73481 73585 73633 73657 73681 73702 73696 73671 73645 73609 73581 73537 73464 73405 73263
3042.0G3263k55l15m50n93p48r13r94j067j011o91k77J37M42O75P26P86O92N62M38L28
$$ 73263 73008 72693 72243 71650 70902 69989 68995 67928 66917 66226 65949 66086 66528 67203 67929 68715 69407 69969 70407 70735
3022.0G0735K39J33Pj2l2r7j01j00k13k32k36l44m64n30o36q49j013j206j310j399j278
$$ 70735 70974 71107 71114 71102 71070 70973 70872 70772 70559 70327 70091 69747 69283 68753 68117 67268 66255 65049 63739 62340 61062
3001.0F1062r46m67J07O23R38J145J263J287J170J034R23Q45P84O65N90N14M48L86L33
$$ 61062 60116 59649 59756 60379 61317 62462 63725 65012 66182 67216 68139 68984 69768 70433 71023 71537 71985 72371 72704
2982.0G2704K66J84J51R7N0L5m0p2j39j25j89k44k79l66l93n26o83q68j078j256j383
$$ 72704 72970 73154 73305 73402 73452 73487 73447 73375 73236 73111 72922 72678 72399 72033 71640 71114 70431 69563 68485 67229 65846
2961.0F5846j363j200r89q58j018j526k189k724k765j980n50R50K144K703K802K643
$$ 65846 64483 63283 62294 61436 60418 58892 56703 53979 51214 49234 48684 49634 51778 54481 57283 59926
2945.0E9926K312J872J531J241J048Q25O08M59L57K63J95J14K7o6j30l09m89o72r46
$$ 59926 62238 64110 65641 66882 67930 68755 69363 69822 70179 70442 70637 70751 70778 70712 70582 70273 69784 69112 68166
2926.0F8166j190j135p50j81M14P48Q63Q36P58O47O03N84N49M64M26L77L15K31J99J38
$$ 68166 66976 65841 65091 64910 65324 66072 66935 67771 68529 69176 69779 70363 70912 71376 71802 72179 72494 72725 72924 73062
2906.0G3062R6N7m0n3r6To6K4N3J80J45K18J95J82J44Q1J04R4M7J3J7Qk8OTJ7M1R8J26
$$ 73062 73158 73215 73175 73122 73026 72930 72864 72888 72941 73121 73266 73484 73679 73861 74005 74086 74190 74284 74331 74344 74361 74369 74341 74347 74353 74370 74411 74509 74635
2877.0G4635J71J61TJ28J26Q3Q9P8N1M7P3O5M9M2P5L1m3j4p0o7n6r9j24j23j57j56j10
$$ 74635 74806 74967 75128 75256 75382 75465 75554 75632 75683 75730 75803 75868 75917 75959 76034 76065 76022 76008 75938 75871 75815 75716 75592 75469 75312 75156 75046
2850.0G5046j26j18j54j36j46j60j64k11k07j69rJ29K15L62M14L66K98K87K37J76J80
$$ 75046 74920 74802 74648 74512 74366 74206 74042 73831 73624 73455 73446 73575 73790 74152 74566 74932 75230 75517 75754 75930 76110
2829.0G6110J65J64J84K11K18J53J51J55J33J21O6R0N1K8L9L8J5L4JoJ1Kj0j8o1n6o2
$$ 76110 76275 76439 76623 76834 77052 77205 77356 77511 77644 77765 77831 77921 77972 78000 78039 78077 78092 78126 78127 78121 78132 78134 78124 78106 78045 77989 77927
2802.0G7927j10o9Tj08q2p7l9k3RJ8P8N5J07J28Q5Q7J07J16J01L6J2J8lm5k4nK9mL3
$$ 77927 77817 77748 77679 77571 77489 77412 77373 77350 77359 77377 77455 77510 77617 77745 77830 77917 78024 78140 78241 78277 78289 78307 78304 78259 78235 78230 78259 78255 78288
2773.0G8288M9P0O8J2L4J3l0m8n5J2m2l1J5T%J5o2r9j59k28k15k10k01j21q4m3m7j7
$$ 78288 78337 78407 78475 78487 78521 78534 78504 78456 78401 78413 78371 78340 78355 78370 78370 78385 78323 78224 78065 77837 77622 77412 77211 77090 77006 76963 76916 76899
2745.0G6899M1O0O6J21J35J60J95J97J66J52J48J26J13J29J13Q6P6N2M5L3K4M5Lj4Q
$$ 76899 76940 77000 77066 77187 77322 77482 77677 77874 78040 78192 78340 78466 78579 78708 78821 78907 78983 79035 79080 79113 79137 79182 79185 79171 79179
2720.0G9179j1j2j4o7n9m9q6p1m4n9n5q7n5j07q5o3rj8J5J6n3m5o9q3q6l4rJ3N4R4J26
$$ 79179 79168 79156 79142 79075 79016 78967 78881 78810 78766 78707 78652 78565 78510 78403 78318 78255 78246 78228 78243 78259 78206 78161 78092 78009 77923 77889 77880 77893 77947 78041 78167
2689.0G8167J65J73J48J05J85J45N4M7L3L8j2j8J8K3M5M6Q7O0P6O9L9L0K1%m5j4rl0
$$ 78167 78332 78505 78653 78758 78943 79088 79142 79189 79222 79260 79248 79230 79248 79271 79316 79362 79449 79509 79585 79654 79693 79723 79744 79744 79699 79685 79676 79646
2661.0G9646m4m3m0l9m1j7k2J3N4J21J54J11J61J07O6O2K3L2L5L6Km3k2l0k2%j3k1j0
$$ 79646 79602 79559 79519 79480 79439 79422 79400 79413 79467 79588 79742 79853 80014 80121 80187 80249 80272 80304 80339 80375 80377 80334 80312 80282 80260 80260 80247 80226 80216
2632.0H0216j5j7k9m8J2k8o9n8j4l7Om0l7J2lj7m7j9L8L0L2M4L8L2L5J3K2J5pl9ok4
$$ 80216 80201 80184 80155 80107 80119 80091 80022 79964 79950 79913 79919 79879 79842 79854 79851 79834 79787 79768 79806 79836 79868 79912 79950 79982 80017 80030 80052 80067 80060 80021 80015 79991
2600.0G9991o9o2r4j11j32j37j28j61j87j68j52j15n9o5k9MN5O5N2Q6R5J19J22J33J48
$$ 79991 79922 79860 79766 79655 79523 79386 79258 79097 78910 78742 78590 78475 78416 78351 78322 78326 78381 78446 78498 78584 78679 78798 78920 79053 79201
2575.0G9201J38J20J19J06J21P4J14O9O2L9L4K2J3QN0N8P0P5N6M7M2J3KL4Qm0k8m4p1
$$ 79201 79339 79459 79578 79684 79805 79879 79993 80062 80124 80163 80197 80219 80232 80240 80290 80348 80418 80493 80549 80596 80638 80651 80653 80687 80695 80655 80627 80583 80512
2546.0H0512j12j09j22j53j98j70j66j09o4M8Q2TJ39J49J62J70J13J12J05Q6P8O1N0
$$ 80512 80400 80291 80169 80016 79818 79648 79482 79373 79309 79357 79439 79521 79660 79809 79971 80141 80254 80366 80471 80557 80635 80696 80746
2523.0H0746K9P3K1KJ9Kk1j3pj4Lm0l1j8J9N9N4O7O4O0N9P1N3L8K6J2N6N5L6QPlj0j9
$$ 80746 80775 80848 80869 80871 80890 80892 80871 80858 80851 80837 80840 80800 80769 80751 80770 80829 80883 80950 81014 81074 81133 81204 81257 81295 81321 81333 81389 81444 81480 81488 81495 81492 81482 81463
2489.0H1463J1j7l7k9n7m5m3k2k8k3jl4j9%rLPK4j9j3rm7n3p5p8p0m0rnN8RKJ2TqpK1
$$ 81463 81474 81457 81420 81391 81334 81289 81246 81224 81196 81173 81172 81138 81119 81119 81110 81113 81120 81144 81125 81112 81103 81056 81003 80928 80850 80780 80740 80731 80726 80784 80793 80795 80807 80819 80811 80804 80825
2452.0H0825N6P6O7M2O3Q0O2M6kTJ7m0l6p%L7L9P7M7O0N4L7L4K9L7L1LL3N6K2L5J3l7
$$ 80825 80881 80957 81024 81066 81129 81209 81271 81317 81315 81313 81330 81290 81254 81247 81247 81284 81323 81400 81447 81507 81561 81598 81632 81661 81698 81729 81732 81765 81821 81843 81878 81891 81854
2419.0H1854J3J1l2j3Nl3KJ6MJ0l1m9l6l8n9r3j20r7r4p0j3K0lO7Q8P6O3N2M1L0K4q
$$ 81854 81867 81878 81846 81833 81838 81805 81807 81823 81827 81837 81806 81757 81721 81683 81624 81531 81411 81314 81220 81150 81137 81157 81154 81221 81309 81385 81448 81500 81541 81571 81595 81587
2387.0H1587LPj7L8L6N6N7O4N9J05J21P9Q7J11O6R3J24O4R6J41J54K30J91J36J16J31
$$ 81587 81590 81597 81580 81618 81654 81710 81767 81831 81890 81995 82116 82195 82282 82393 82459 82552 82676 82740 82836 82977 83131 83361 83552 83688 83804 83935
2361.0H3935J68K36J92M3Q5N0j0j50j22l48k80m10l48k37j01J01K12L15L20K40K04J06
$$ 83935 84103 84339 84531 84574 84659 84709 84699 84549 84427 84079 83799 83389 83041 82804 82703 82804 83016 83331 83651 83891 84095 84201
2339.0H4201P8R3RJ0l9l7J4K8n7J0o2n6o3n4p9m3q3p1n0j0l3Qo9l9k4k8r9o0p8or9m7
$$ 84201 84279 84372 84381 84391 84352 84315 84329 84357 84300 84310 84248 84192 84129 84075 83996 83953 83870 83799 83749 83739 83706 83714 83645 83606 83582 83554 83455 83395 83317 83311 83212 83165
2307.0H3165q9l8r4o6l3q4m0r5j3o9k9q6o4o6p7p2p7m1j0K5N1N9O3N6N0L2jkPM5KL5
$$ 83165 83076 83038 82944 82878 82845 82761 82721 82626 82613 82544 82515 82429 82365 82299 82222 82150 82073 82032 82022 82047 82098 82157 82220 82276 82326 82358 82357 82355 82362 82407 82409 82444
2275.0H2444lJ8mJJ5RJ0L5L4M4k0Jj6k7m5l3l2l4j4k9m5k0l9Tl5l1k8l6n6p3n4j00j17
$$ 82444 82441 82459 82455 82456 82471 82480 82490 82525 82559 82603 82583 82584 82568 82541 82496 82463 82431 82397 82383 82354 82309 82289 82250 82211 82176 82145 82117 82081 82025 81952 81898 81798 81681
2242.0H1681q7q3m6J7M0O3J03P2O1O4O5L1J5M4L4J2M7N8TM5N9M6M3Q2P9O2M5L8L0K3
$$ 81681 81594 81511 81465 81482 81522 81585 81688 81760 81821 81885 81950 81981 81996 82040 82074 82086 82133 82191 82249 82294 82353 82399 82442 82524 82603 82665 82710 82748 82778 82801
2212.0H2801K9j6TK8k0l3k7m2l7j4k1mJ2J4K3K9J0k3m7l3l1l7l5NK8L0O4N7K1Q5K9L
$$ 82801 82830 82814 82798 82826 82806 82773 82746 82704 82667 82653 82632 82628 82640 82654 82677 82706 82716 82693 82646 82613 82582 82545 82510 82515 82543 82573 82637 82694 82715 82800 82829 82832
2180.0H2832M4lol3m7k8j5k9J3M5M0K4J6M7j6LL5N2M4K9O1L7J3J8lj9m5k0j5k6l4k6
$$ 82832 82876 82873 82867 82834 82787 82759 82744 82715 82728 82773 82813 82837 82853 82900 82884 82887 82922 82974 83018 83047 83108 83145 83158 83176 83173 83154 83109 83089 83074 83048 83014 82988
2148.0H2988j3Rj3l1m2l9l5n4l4o6p0l6J0j0m9p4r5j37j61k00k08k49k91l04m61o98
$$ 82988 82975 82984 82971 82940 82898 82859 82824 82770 82736 82670 82600 82564 82574 82564 82515 82441 82346 82209 82048 81848 81640 81391 81100 80796 80335 79637
2122.0G9637j040j651k214k164j181K12J312J705J689J452J159Q88O72M78L41K33J77
$$ 79637 78597 76946 74732 72568 71387 71599 72911 74616 76305 77757 78916 79804 80476 80954 81295 81528 81705
2105.0H1705J30J08Q9R5N3K6K9J4K7M2N4L3Q1Q5P7N3L6j2O8K0KK5L0km3n0k9o3n0l7
$$ 81705 81835 81943 82032 82127 82180 82206 82235 82249 82276 82318 82372 82405 82486 82571 82648 82701 82737 82725 82793 82813 82815 82840 82870 82868 82825 82775 82746 82683 82633 82596
2075.0H2596k5k0jo5l5k5j09j25j70j93j55r6j18p2kJ24J54J78K10K25J52J48J14J07
$$ 82596 82571 82551 82550 82485 82450 82425 82316 82191 82021 81828 81673 81577 81459 81387 81385 81509 81663 81841 82051 82276 82428 82576 82690 82797
2051.0H2797N4Q3Q5P5M4N6N7O8L0K2K7j4pnj3n2l8l7o0r0q7j39j02j11j03r9o4m5J2
$$ 82797 82851 82934 83019 83094 83138 83194 83251 83319 83349 83371 83398 83384 83377 83372 83359 83307 83269 83232 83172 83082 82995 82856 82754 82643 82540 82441 82377 82332 82344
2022.0H2344O3P4N6P5O4P5J05P6Q7O3R3P0P8N7P8O4P7K7M0N2M3K6L4j1L3L9O1M2J5j3
$$ 82344 82407 82481 82537 82612 82676 82751 82856 82932 83019 83082 83175 83245 83323 83380 83458 83522 83599 83626 83666 83718 83761 83787 83821 83810 83843 83882 83943 83985 84000 83987
1992.0H3987R0J11K5lJ5MPJ9j9kTOl3qj1k1J4jj7J8OJ3J5J0l4N9O8J8j3nk3k5m0JO0
$$ 83987 84077 84188 84213 84210 84225 84229 84236 84255 84236 84234 84232 84238 84205 84197 84186 84165 84179 84178 84161 84179 84185 84198 84213 84223 84189 84248 84316 84334 84321 84316 84293 84268 84228 84229 84289
1957.0H4289pm1j05r0r7l8k6k0n4q2j11q7j04j15j1K17J21R5J00N4O7M8O2P1O1M8Po
$$ 84289 84282 84241 84136 84046 83949 83911 83885 83865 83811 83729 83618 83531 83427 83312 83301 83518 83639 83734 83834 83888 83955 84003 84065 84136 84197 84245 84252 84246
1929.0H4246m4n2k2o2n2p3Q3J38M3l6k23Q1K12p1%q2j00k8pM8P5L5Tl7q9r0j20j24j86
$$ 84246 84202 84150 84128 84066 84014 83941 84024 84162 84205 84169 83946 84027 84239 84168 84168 84086 83986 83958 83951 83999 84074 84109 84144 84107 84018 83928 83808 83684 83498
1900.0H3498k05k31k42k54k71l08l65p08j003j218m68Q49J318J187Q92N21L99K79K14
$$ 83498 83293 83062 82820 82566 82295 81987 81622 80914 79911 78693 78225 79074 80392 81579 82471 82992 83391 83670 83884
1881.0H3884K06J55J16J02O9%K2rJ4k0q8j90K62K48J23K6r9j25o3j1O2N2K4L2J2%MK2
$$ 83884 84090 84245 84361 84463 84532 84532 84554 84545 84559 84539 84451 84261 84523 84771 84894 84920 84821 84696 84633 84622 84684 84736 84760 84792 84804 84804 84808 84830
1853.0H4830nJ0K4L2l7L3O5k37m42O80L97Nn1k55k08q0k6J5o0q6p0j85l60J37L52P1
$$ 84830 84825 84835 84859 84891 84854 84887 84952 84715 84273 84953 85350 85355 85304 85049 84841 84761 84735 84750 84690 84604 84534 84349 83989 84126 84478 84549
1827.0H4549j32l33J19J38%l3j20j04m4n9K8o6p7j80k23m46n98p31j075j107n51P0O01
$$ 84549 84417 84084 84203 84341 84341 84308 84188 84084 84040 83981 84009 83943 83866 83686 83463 83017 82419 81688 80613 79506 78955 79025 79626
1804.0G9626O29N56N99L65L35M81J72OO3K2m23k1N79K80K44j76j98j71j83O4K39j13
$$ 79626 80255 80811 81410 81775 82110 82591 82763 82769 82832 82854 82431 82410 82989 83269 83513 83337 83139 82968 82785 82849 83088 82975
1782.0H2975j57j56J07m6p2k56k36j69p08m17L50J72k80q58o36o19p27k68J57K78R45
$$ 82975 82818 82662 82769 82723 82651 82395 82159 81990 81282 80865 81215 81387 81107 80249 79613 78994 78267 77999 78156 78434 79379
1761.0G9379J179K34J85l33o0J87q3k66n89p90K21j40l52k56n36m60n92o26l82m32r10
$$ 79379 80558 80792 80977 80644 80584 80771 80688 80422 79833 79043 79264 79124 78772 78516 77980 77520 76928 76302 75920 75488 74578
1740.0G4578k52m1l56m73j055j155P93N98j61r78r18q78q05q86r96j058r50r74j131
$$ 74578 74326 74285 73929 73456 72401 71246 72039 72637 72476 71498 70580 69702 68897 68011 67015 65957 65007 64033 62902
1721.0F2902j357j824k227j979j521k274k547k709k765k809k663k591k198k374k232
$$ 62902 61545 59721 57494 55515 53994 51720 49173 46464 43699 40890 38227 35636 33438 31064 28832
1706.0B8832k367k334k621k548k826l508l889k575k179j541j377n18k15q8l3k6j9k5
$$ 28832 26465 24131 21510 18962 16136 12628 8739 6164 3985 2444 1067 549 334 246 213 187 168 143
1688.0A43J16K44O60J943L514L488L098K947L348L220L332K744L187M774L438K602K545
$$ 143 259 503 1163 3106 6620 10108 13206 16153 19501 22721 26053 28797 31984 36758 40196 42798 45343
1671.0D5343J965J807K602J790J206R83O64L81R93J155Q37P48O15M64M39o1n45j004
$$ 45343 47308 49115 51717 53507 54713 55696 56360 56741 57734 58889 59726 60474 61089 61553 61992 61931 61386 60382
1653.0F0382J154R35j136j779k053q92L96J870J608O69N52L38M03L84P7Om98m92P22
$$ 60382 61536 62471 61335 59556 57503 56611 57007 58877 60485 61154 61706 62044 62447 62831 62908 62914 62416 61924 62646
1634.0F2646k76r27j117j076o04n80J8J47m0m85n01j02q29j873l226m844o319r534o232
$$ 62646 62370 61443 60326 59250 58646 58066 58084 58231 58191 57706 57205 57103 56274 54401 51175 46331 40012 30478 24246
1615.0B4246j663K456N040O028N758N257M486L464K730J971J402J136J037R60P97N53
$$ 24246 22583 25039 30079 36107 41865 47122 51608 55072 57802 59773 61175 62311 63348 64308 65105 65658
1599.0F5658J98n6k97l67j82K83O09P86P94P08O59N37L95K20l6l26o76r97j676k573
$$ 65658 65856 65800 65503 65136 64954 65237 65846 66632 67426 68134 68793 69330 69725 69945 69909 69583 68907 67910 66234 63661
1579.0F3661m502n702p111l914J392M438N018M512L061L383L211J543P45j58mL83N31
$$ 63661 59159 53457 46346 42432 43824 48262 53280 57792 60853 64236 67447 68990 69735 69577 69573 69956 70487
1562.0G0487K83l26J270K082K666J025m61n66L75K06o6o45k65r9p9k33j94Q62N33j77
$$ 70487 70770 70444 71714 73796 76462 77487 77026 76460 76835 77041 76975 76330 76065 75966 75887 75654 75460 76322 76855 76678
1542.0G6678O78k57J40J082M13k73n08q48N8Q70K66j41o70p34n36p65r88o16j418j874
$$ 76678 77356 77099 77239 78321 78734 78461 77953 77105 77163 78033 78299 78158 77488 76754 76218 75453 74465 73849 72431 70557
1522.0G0557k933l806n965p336q636n144j51M293N284O256O247M552L517K496J362K120
$$ 70557 67624 63818 57853 50517 41881 36737 36586 40879 46163 52419 58666 63218 66735 69231 70593 72713
1506.0G2713K371J123k57o71m50q4k04M01K15k61N27l82j123k190l690o190q015n510
$$ 72713 75084 76207 75950 75279 74829 74745 74541 74942 75157 74896 75423 75041 73918 71728 68038 61848 53833 48323
1488.0D8323M89M308M370K863J839J156J278J289J047P39N20P32J559P36L89M79P99
$$ 48323 48812 53120 57490 60353 62192 63348 64626 65915 66962 67701 68221 68953 70512 71248 71637 72116 72915
1471.0G2915L37m84o81p78p21j236p03q22j558k114k646k876l048k861k143n83p39p29
$$ 72915 73252 72768 72087 71309 70588 69352 68649 67827 66269 64155 61509 58633 55585 52724 50581 49998 49259 48530
1453.0D8530j341j266p19J8J29N3m14o29l53j53n19j549l151m620n608n514o174m266
$$ 48530 47189 45923 45204 45222 45351 45404 44990 44361 44008 43855 43336 41787 38636 34016 28408 22894 16720 12454
1435.0A2454k393q82K89k15o69O17L894P001Q783Q424P220O330M688L464J821J946K674
$$ 12454 10061 9179 9468 9253 8584 9201 13095 20096 28879 37303 44523 50853 55541 59005 60826 62772 65446
1418.0F5446J376P53J62J66J02Q8K8j80n28q68j449k121l124m040m716m979m233k449
$$ 65446 66822 67575 67737 67903 68005 68093 68121 67941 67413 66545 65096 62975 59851 55811 51095 46116 41883 39434
1400.0C9434j81K338L584M057L858M138L690K275J473R11O63J42P6J18l58m12J27M80
$$ 39434 39253 41591 45175 49232 53090 57228 60918 63193 64666 65577 66240 66382 66458 66576 66218 65806 65933 66413
1382.0F6413M78J08j52n04p36j135j490j637j378r18m77Q7L52K48o31k638m951m262
$$ 66413 66891 66999 66847 66343 65607 64472 62982 61345 59967 59049 58572 58659 59011 59259 58628 55990 51039 46777
1364.0D6777Q5L634L414K538J313L08o20j421k198k848l523m209m866n404n855n940
$$ 46777 46862 50496 53910 56448 57761 58069 57449 56028 53830 50982 47459 43250 38384 32980 27125 21185
1348.0B1185n533m490l093j603r2J523L009M308M773M200K912J837J099N15J33j79n25
$$ 21185 15652 11162 8069 6466 6374 7897 10906 15214 19987 24187 27099 28936 30035 30550 30683 30504 29979
1331.0B9979j019j616k259k838l375l769l876l563k919k085j282o61l37j47l7M3J63
$$ 29979 28960 27344 25085 22247 18872 15103 11227 7664 4745 2660 1378 717 380 233 196 239 402
1314.0D02M48R88J739K559L247L627L707L640L653L660L630L509L344L025K680K318
$$ 402 850 1838 3577 6136 9383 13010 16717 20357 24010 27670 31300 34809 38153 41178 43858 46176
1298.0D6176K024J905J852J748J633J409J101P47L09k16q88j931l456n604q162j0166
$$ 46176 48200 50105 51957 53705 55338 56747 57848 58595 58904 58688 57800 55869 52413 46809 38647 28481
1282.0B8481r573n826j473R84J798K670L958M929N213M865M465L864L183K354J276l27
$$ 28481 18908 13082 11609 12593 14391 17061 21019 25948 31161 36026 40491 44355 47538 49892 51168 50841
1266.0E0841k772o051r299j0222p230j274M684P526P110N418L927L065K668K337K152
$$ 50841 48069 42018 32719 22497 15267 13993 18677 26203 33313 38731 42658 45723 48391 50728 52880
1251.0E2880K188K266K238K041J754J513J328J195J076R60Q67P53O37N47N18M50L59
$$ 52880 55068 57334 59572 61613 63367 64880 66208 67403 68479 69439 70306 71059 71696 72243 72761 73211 73570
1234.0G3570K81K61J99J12K1r9j36j76Tj60k08k59l38m48n94p66r95j259j589j915k299
$$ 73570 73851 74112 74311 74423 74444 74345 74209 74033 73857 73697 73489 73230 72892 72444 71850 71084 70089 68830 67241 65326 63027
1213.0F3027k725l348m133n006o012o994p654p668o811n147l224j630n61K20R42J805
$$ 63027 60302 56954 52821 47815 41803 34809 27155 19487 12676 7529 4305 2675 2114 2334 3276 5081
1197.0E081K493K684K488K888M145N023M871M064L096K137J096k12j829l293k713N17
$$ 5081 7574 10258 12746 15634 19779 24802 29673 33737 36833 38970 40066 39854 38025 34732 32019 32536
1181.0C2536L861N037M745M256L755L168K569J997J556J270J154J012Q16O46N27M43
$$ 32536 36397 41434 46179 50435 54190 57358 59927 61924 63480 64750 65904 66916 67732 68378 68905 69348
1165.0F9348L79L98L25K65K19K03K00J35P9K6k3j2K0J26J11K3j03m37r71j876l825p758
$$ 69348 69727 70125 70450 70715 70934 71137 71337 71472 71551 71577 71554 71542 71562 71688 71799 71822 71719 71282 70311 68435 64610 56852
1143.0E6852j3536j4476q517j056N607Q854Q949P490N729M291L334K545J835J318J095
$$ 56852 43316 28840 20323 19267 24874 33728 42677 50167 55896 60187 63521 66066 67901 69219 70314
1128.0G0314Q29O15M45L26K39K17K36J58J70J56J42J24Q4K4pj20k75m50p10j184j792
$$ 70314 71143 71758 72203 72529 72768 72985 73221 73379 73549 73705 73847 73971 74055 74079 74072 73952 73677 73227 72517 71333 69541
1107.0F9541k842m464p225j1062j4076j2241n227K668Q590J0912R836P092L704m24m994
$$ 69541 66699 62235 55010 43948 29872 17631 12404 15072 23662 34574 44410 51502 55206 54782 49788
1092.0D9788p066l901J297M176M621M058L378K811K338J934J660J429J183R63P99O92
$$ 49788 42722 38821 40118 44294 48915 52973 56351 59162 61500 63434 65094 66523 67706 68669 69468 70160
1076.0G0160O79N75N53N97N66N38M98L84L12L00K84K34K27J85J84J42J52R8Q7K3p4j68
$$ 70160 70839 71414 71967 72564 73130 73668 74166 74550 74862 75162 75446 75680 75907 76092 76276 76418 76570 76668 76755 76778 76704 76536
1054.0G6536j80m29p34j385k489m245m349m62L477L758K673J855J237Q15N88M17K47
$$ 76536 76356 75927 75193 73808 71319 67074 62725 62263 65740 69498 72171 74026 75263 76078 76666 77083 77330
1037.0G7330J75J87J22Q1L4L6J2l2k6n3o9m2L9J13J17J67J70J29J12N5L7J4K7R1R9N6
$$ 77330 77505 77692 77814 77895 77929 77965 77977 77945 77919 77866 77797 77755 77794 77907 78024 78191 78361 78490 78602 78657 78694 78708 78735 78826 78925 78981
1011.0G8981P1Q7P4J32Q7%Q7M2m0J20L8Mk6q6n1j11j38k42k60k77k73k29k79k61j80
$$ 78981 79052 79139 79213 79345 79432 79432 79519 79561 79521 79641 79679 79683 79657 79571 79520 79409 79271 79029 78769 78492 78219 77990 77711 77450 77270
986.0G7270k11k06k64m15o54r94j555k383l721n431o816n897j878K906N511N529M623
$$ 77270 77059 76853 76589 76174 75520 74526 72971 70588 66867 61436 54620 48723 46845 49751 55262 60791 65414
969.0F5414L534K648J949J395J024P75P37O78N51M00K94K68J74J12j1j70n17j019o35
$$ 65414 68948 71596 73545 74940 75964 76739 77476 78154 78705 79105 79399 79667 79841 79953 79942 79772 79255 78236 77601
950.0G7601L58j51n15J67M87J00m53j036j893l196m718o083n995l301J005M398N512
$$ 77601 77959 77808 77293 77460 77947 78047 77594 76558 74665 71469 66751 60668 54673 51372 52377 56775 62287
933.0F2287M791L521K377J332M40m93p00K76J205J239Q95N45M10L22K34J51J50K2J0
$$ 62287 67078 70599 72976 74308 74748 74255 73555 73831 75036 76275 77170 77715 78125 78447 78681 78832 78982 79004 79014
914.0G9014r1o0k38k69m88q74j472k832o446j2545j2357M32J1117J1060P144L927J986
$$ 79014 78923 78863 78625 78356 77868 76994 75522 72690 66244 53699 41342 41774 52891 63951 71095 75022 77008
897.0G7008J156R98Q85O12L88L16J55J50Q1P8P6m0p1q6j33k75n10q04j460k468l291
$$ 77008 78164 79162 80047 80659 81047 81363 81518 81668 81749 81827 81903 81863 81792 81706 81573 81298 80788 79984 78524 76056 72765
876.0G2765l427k047M51K510L255K898K115J402R01N85L61L17K37K48J64L5p2J47J9
$$ 72765 69338 67291 67742 70252 73507 76405 78520 79922 80823 81408 81769 82086 82323 82571 82735 82770 82698 82845 82864
857.0H2864m6K3N1M4O8l2K9P7j7J25Oj4O9k3j9K9k31oj99J53K82n60K88P0m87j71k20
$$ 82864 82818 82841 82892 82936 83004 82972 83001 83078 83061 83186 83192 83178 83247 83224 83205 83234 83003 82997 82798 82951 83233 82673 82961 83031 82544 82373 82153
830.0H2153l59o59j199k416m252m347j507k74L56K975L936K824J594J112P38N33L91
$$ 82153 81794 81135 79936 77520 73268 68921 67414 67140 67496 70471 74407 77231 78825 79937 80675 81208 81599
813.0H1599L04K03R4J15P3L4L2l5r2p3j3l7p0j00j05r6j32j68j23j97j01j59Tj00k13
$$ 81599 81903 82106 82200 82315 82388 82422 82454 82419 82327 82254 82241 82204 82134 82034 81929 81833 81701 81533 81410 81213 81112 80953 80794 80694 80481
788.0H0481j60k09l12l82m67o01o94q98j370k050l145n198r399j5152j5327o481N808
$$ 80481 80321 80112 79800 79418 78951 78350 77656 76758 75388 73338 70193 64995 55596 40444 25117 18636 24444
771.0B4444J3418J1883O374K062J24j539l721o199q896j0465q656m127l07J184J202
$$ 24444 37862 49745 56119 58181 58305 56766 53045 46846 37950 27485 18829 14702 14395 15579 16781
756.0A6781R5k706m963m450j825J306N422Q829J0070R746Q383O733N193L743K739K036
$$ 16781 16876 14170 9207 4757 2932 4238 9660 18489 28559 38305 46688 53421 58614 62357 65096 67132
740.0F7132J625J236P52M86K81Ok41m61o60j027j360j757k395l096l969m694m706l472
$$ 67132 68757 69993 70745 71231 71512 71518 71277 70816 70156 69129 67769 66012 63617 60521 56552 51858 47152 43680
722.0D3680j633k62j4o01j333j704j658j291p37k14J83M84O66L80J7m57j138j647k138
$$ 43680 42047 41785 41771 41170 39837 38133 36475 35184 34447 34233 34416 34900 35566 35946 35963 35506 34368 32721 30583
703.0C0583k279k179j803j079k56L91J261J814K388K716K862K881K869K794K520K378
$$ 30583 28304 26125 24322 23243 22987 23378 24639 26453 28841 31557 34419 37300 40169 42963 45483 47861
687.0D7861K157J908J733J622J450J189J155J186R95R32R38Q90O07N18O59K97j1M22
$$ 47861 50018 51926 53659 55281 56731 57920 59075 60261 61256 62188 63126 64016 64623 65141 65800 66097 66086 66508
669.0F6508J478L1k848k972k583k696j579Q98K739L416K920K161J694J264R86O58O13
$$ 66508 67986 68017 65169 62197 59614 56918 55339 56237 58976 62392 65312 67473 69167 70431 71417 72075 72688
652.0G2688L87L31K98L54P1K38L11K67J66K95K17K43K22J15J71K65K57J17J19J48J41
$$ 72688 73075 73406 73704 74058 74129 74367 74678 74945 75111 75406 75623 75866 76088 76203 76374 76639 76896 77013 77132 77280 77421
631.0G7421L0K15J58O2J23Q2Q7K61J70J1J10K61lJ70N9O9O4M6j39J01J20l9M2J73J1
$$ 77421 77451 77666 77824 77886 78009 78091 78178 78439 78609 78620 78730 78991 78988 79158 79217 79286 79350 79396 79257 79358 79478 79439 79481 79654 79665
606.0G9665L4J32k06m3k78RJ81K72m9j7m6j62o67q91l173q099q547M625Q851L957K068
$$ 79665 79699 79831 79625 79582 79304 79313 79494 79766 79717 79700 79654 79492 78825 77934 74761 66662 58115 62740 71591 75548 77616
585.0G7616O72N34L53K85K25q4k00m17l98J16M00M02L57K36K79L6K04J53J7R1L6J13
$$ 77616 78288 78822 79175 79460 79685 79601 79401 78984 78586 78702 79102 79504 79861 80097 80376 80412 80616 80769 80786 80877 80913 81026
563.0H1026M2M0RK02k9o5n0Kj0Q3J46N7q9M4Q0M2L1N6m9L7j92K28Q7m1n3l4M0j4o1O0
$$ 81026 81068 81108 81117 81319 81290 81225 81175 81177 81167 81250 81396 81453 81364 81408 81488 81530 81561 81617 81568 81605 81413 81641 81728 81687 81634 81600 81640 81626 81565 81625
533.0H1625P3j0TQK3q2Q7J08l12n5jl13RNj45j99k20r34q84j320j347k37R23J361J108
$$ 81625 81698 81688 81678 81686 81709 81627 81714 81822 81510 81455 81454 81141 81150 81155 81010 80811 80591 79657 78773 77453 76106 75869 76792 78153 79261
508.0G9261J052N03J69K10M76L39K49k98Q5L4J06K94L5k06q4K32K6j10P6M7R4J47J68
$$ 79261 80313 80816 80985 81195 81671 82010 82259 81961 82046 82080 82186 82480 82515 82309 82225 82457 82483 82373 82449 82496 82590 82737 82905
485.0H2905J9j50l1l4O7q6j0QK08p7r0K42J18m59m04n5R1Q2KN6l48j13O6j37l45l63
$$ 82905 82924 82774 82743 82709 82776 82690 82680 82688 82896 82819 82729 82971 83089 82630 82226 82171 82262 82344 82346 82402 82054 81941 82007 81870 81525 81162
459.0H1162N89r40k316k186k278k111j988n55J939
$$ 81162 81751 80811 78495 76309 74031 71920 69932 69377 71316
##END= 
